##TITLE=$$ Begin of the data block
##JCAMP-DX=5.00 $$ ACD/SpecManager v 10.08
##SPECTROMETER/DATA SYSTEM=Varian
##DATE=07 Jan 2013 17:15:34
##DATA TYPE=INFRARED SPECTRUM
##DATA CLASS=XYDATA
##ORIGIN=
##OWNER=
##NPOINTS=3735
##FIRSTX=399.26403809
##LASTX=4000.35498047
##MAXX=4000.35498047
##MINX=399.26403809
##MAXY=74.61618042
##MINY=36.15504074
##XFACTOR=1.0000000000
##YFACTOR=0.000000100000000
##FIRSTY=53.71149063
##DELTAX=0.96440572
##XUNITS=1/CM
##YUNITS=TRANSMITTANCE
##XYDATA=(X++(Y..Y))
399.3E37114906m716034M244919O503792n669785j2451057R19037J0788536m637413
$$ 537114906 532398872 536643791 543147583 537477798 525026741 525945778 536734314 532096901
407E32096901k825775O87332l420677j761589j822052N013427j397209n228805K014160
$$ 532096901 529271126 529958458 526537781 524776192 522954140 527967567 526570358 521341553 523355713
415.7E23355713L767700R02901l347740M091606Q00895J472245k378311l290024L369903
$$ 523355713 527123413 528026314 524678574 528770180 529571075 531043320 528665009 525374985 528744888
424.3E28744888L886452L480492l764344m313316j596146K465363K107773j000557
$$ 528744888 532631340 536111832 532347488 528034172 526438026 528903389 531011162 530010605
432.1E30010605L747444M02908k58102m247780q480339l04031K568969M167481J030617
$$ 530010605 533758049 534160957 533902855 529655075 521174736 520870705 523439674 527607155 528637772
440.7E28637772K579078J864128n888061P81441L655967q64105m032326m994659l40920
$$ 528637772 531216850 533080978 527192917 527974358 531630325 530766220 526733894 521739235 521398315
449.4E21398315P146302M532661J39809j91078j998177j256027o69480q29010n861854
$$ 521398315 528544617 533077278 533217087 533026009 531027832 529771805 529102325 528273315 522411461
458.1E22411461l110733j040383P67289O816826M111709j556435p122344l438340N582009
$$ 522411461 519300728 518260345 519027634 525844460 529956169 528399734 521277390 517839050 523421059
466.8E23421059L200302K79770j442376k720718J004830K304534l431739n56870J553764
$$ 523421059 526621361 526901131 525458755 522738037 523742867 526047401 522615662 522058792 523612556
475.5E23612556l679695j336708J211128l79638j394310l425408L992386O228409j631737
$$ 523612556 519932861 518596153 519807281 519427643 518033333 514607925 518600311 524828720 523196983
484.1E23196983j23405O9580j861877p59926k493630j773338l93982p92770o16684
$$ 523196983 523073578 523143158 521281281 520521355 518027725 516254387 515860405 515067635 514450951
492.8E14450951J639480K044640j055870q09250j541748j540146k98157L09868O25725
$$ 514450951 516090431 518135071 517079201 516269951 514728203 513188057 512889900 513199768 513825493
501.5E13825493l513756r76067K060814J478386J0796j695213R10301P60727j310654
$$ 513825493 510311737 509335670 511396484 512874870 512885666 511190453 512100754 512861481 511550827
510.2E11550827j722488p56646o17256L07236J367187m50096R31168J118126K51083
$$ 511550827 509828339 509071693 508454437 508761673 510128860 509678764 510609932 511728058 511979141
518.9E11979141j058616l764458j369057q04939k124291K98462K914811l82042j158638
$$ 511979141 510920525 507156067 505787010 504982071 502857780 503156242 506071053 505689011 504530373
527.5E04530373P6675j051865j96228j059951r16J551666r58748j562728r23119M88205
$$ 504530373 504607048 503555183 503358955 502299004 502298088 503849754 502891006 501328278 500405159 500893364
537.2E00893364J885223n33676j753425L40499r25750J4343J485367j904106r54705
$$ 500893364 502778587 502244911 500491486 500831985 499906235 499920578 501405945 499501839 498547134
545.9D98547134J643105J317215J43204q49686k335625j865768J063995l91960j197586
$$ 498547134 500190239 501507454 501650658 500800972 498465347 496599579 497663574 497271614 496074028
554.5D96074028K2011M98504q4686j308670L72696O62499L28788n71327j909523q77113
$$ 496074028 496096039 496594543 496509857 495201187 495573883 496236382 496565170 495993843 494084320 493207207
564.2D93207207N25970J416283J544647J997376Q90388n79338j748924j643296R46427
$$ 493207207 493733177 495149460 496694107 498691483 499581871 499002533 497253609 495610313 496556740
572.9D96556740k97966j942253j097718M67720Q8692l10020J885910J376495k45933
$$ 496556740 496258774 494316521 493218803 493686523 493775215 493465195 495351105 496727600 496481667
581.5D96481667o34537r72939j187286j068268K05612J557770J890945L11280J136741
$$ 496481667 495847130 494874191 493686905 492618637 492824249 494382019 496272964 496584244 497720985
590.2D97720985J467705j922111j302834M61083M18586P04918J108475R91936k51885
$$ 497720985 499188690 497266579 495963745 496424828 496843414 497548332 498656807 499648743 499396858
598.9D99396858p06138M74052L59612r62830l18489O13785q69828k521972j860619
$$ 499396858 498690720 499164772 499524384 498561554 498243065 498856850 497987022 495465050 493604431
607.6D93604431J73569J581993R85794q11920p77702J99127L31077j075515j076966
$$ 493604431 493778000 495359993 496345787 495533867 494756165 494955292 495286369 494210854 493133888
616.3D93133888R16977K58789j71814K90718N49851Q67157M95872Q79441R02176J068725
$$ 493133888 494050865 494309654 494137840 494428558 494978409 495845566 496341438 497220879 498123055 499191780
625.9D99191780R56879j8425P01828Q72650J060104J397286k7352J178933J779480
$$ 499191780 500148659 500130234 500832062 501704712 502764816 504162102 504134750 505313683 507093163
634.6E07093163j450P45888J287002J488495J629257J009903J086388Q05015N82734
$$ 507093163 507091713 507837601 509124603 510613098 512242355 513252258 514338646 515143661 515726395
643.3E15726395J28402L81928J534653K48222K29492K260208J372032L78914M13895
$$ 515726395 515854797 516236725 517771378 518019600 518249092 520509300 521881332 522260246 522674141
651.9E22674141J35918j19172n39207R1705J37291n45807l70140M55971R57298p6942
$$ 522674141 522810059 522690887 522151680 522243385 522380676 521834869 521464729 521920700 522877998 522801056
661.6E22801056m73442K14538K96479L38668j08985r83887p04079P64427O32782J637383
$$ 522801056 522327614 522542152 522838631 523177299 523068314 522084427 521380348 522144775 522777557 524414940
671.2E24414940J649055N43595O56547O58760K10762N52025m46319m76151J560135
$$ 524414940 526063995 526607590 527264137 527922897 528133659 528685684 528239365 527763214 529323349
679.9E29323349J664352J51215M07295K578888J921921M13246J548576Q88405n30052
$$ 529323349 530987701 531138916 531546211 534125099 536047020 536460266 538008842 538897247 538367195
688.6E38367195j017570j058998J28173Q16117J353111J698837J455612J772271J106910
$$ 538367195 537349625 536290627 536418800 537234917 538588028 540286865 541742477 543514748 544621658
697.3E44621658k03781l88679n72663k51617j29852n86090J529998K548981J268539
$$ 544621658 544417877 544029198 543456535 543204918 543075066 542488976 544018974 546567955 547836494
705.9E47836494J020928N57670J51368m34265l12958L76968J3580K29378Q78601J243592
$$ 547836494 548857422 549415092 549566460 549132195 548819237 549196205 549209785 549439163 550317764 551561356
715.6E51561356J291313J091881M96902j12801k92854j12762M49257N18417P60231
$$ 551561356 552852669 553944550 554441452 554328651 554035797 553923035 554372292 554890709 555650940
724.3E55650940Q71887Q67462J186219J020393J390343J294326k68821n26085K41623
$$ 555650940 556522827 557390289 558576508 559596901 560987244 562281570 562012749 561486664 561728287
733E61728287M6692M05082l85589m80118J649818J061859J030465J577606L20053r0027
$$ 561728287 561774979 562180061 561794472 561314354 562964172 564026031 565056496 566634102 566954155 566864128
742.6E66864128N913k69280o16760R10721J301689O27861Q97789O00586P51305K15034
$$ 566864128 566870041 566600761 565984001 566894722 568196411 568824272 569722061 570322647 571073952 571288986
752.2E71288986l12347n77660L99513J551514L72658M54216J418190J678123J047745
$$ 571288986 570976639 570398979 570798492 572350006 572722664 573176880 574595070 576273193 577320938
760.9E77320938M38767L67927L00560P31735L24974l58123j86081Q21380J215439J218872
$$ 577320938 577759705 578127632 578428192 579159927 579484901 579126778 578940697 579762077 580977516 582196388
770.6E82196388P07016o9427l72429j439781r35250m09012L16239J173324M90304N48782
$$ 582196388 582903404 582833977 582461548 581021767 580086517 579677505 579993744 581167068 581657372 582206154
780.2E82206154P6332Q4724L10860j67427l59001J82266K25830n24788M13132Q62122
$$ 582206154 582282486 582367210 582678070 582510643 582151642 582333908 582559738 582034950 582448082 583310204
789.9E83310204R78584P37877M88395m58984j400719K60277j007538j797371k0866
$$ 583310204 584288788 585026665 585515060 585056076 583655357 583915634 582908096 581110725 581089859
798.5E81089859R70154L29056p69082j31759n52368n13993j423416j968918j537628
$$ 581089859 582060013 582389069 581619987 581488228 580935860 580421867 578998451 577029533 575491905
807.2E75491905k616577j721039j42936N61523o52618j054192k25029n2643n31502
$$ 575491905 572875328 571154289 571011353 571572876 570920258 569866066 569641037 569588394 569056892
815.9E69056892j747970r97696j224938o57272J24207Q1405J888619J956558K090187
$$ 569056892 567308922 566311226 565086288 564429016 564553223 564634628 566523247 568479805 570569992
824.6E70569992K083550J691513P63626l68042P06444J178054K062188K763595K558746
$$ 570569992 572653542 574345055 575108681 574740639 575447083 576625137 578687325 581450920 584009666
833.3E84009666K251626K640571K678452J525650P77168n80597J32103N83687R90143
$$ 584009666 586261292 588901863 591580315 593105965 593883133 593302536 593434639 594018326 595008469
841.9E95008469J616859R51347J904717J952972J980820J832848J039199m52652n94711
$$ 595008469 596625328 597576675 599481392 601434364 603415184 605248032 606287231 605834579 605239868
850.6F05239868N27229j93824O43120Q03222J736832K693443K552834K947769J082687
$$ 605239868 605767097 605573273 606216393 607019615 608756447 611449890 614002724 616950493 618033180
859.3F18033180J97373q20847j037559M15039O90345l04603N39970J274452p06672
$$ 618033180 618230553 617409706 616372147 616787186 617477531 617172928 617712898 618987350 618280678
868F18280678K24151k84042j282120j611671k945824k180176j780967n17121j37672
$$ 618280678 618504829 618220787 616938667 615326996 612381172 610200996 608420029 607902908 607765236
876.7F07765236O23741J266174M51546J50414j393738p16210m6768p31735j794205
$$ 607765236 608388977 609655151 610106697 610257111 608863373 608147163 608100395 607368660 605574455
885.3F05574455k189140n74036L81737N69496J43891J23024Q5945P96013L96995p34138
$$ 605574455 603385315 602811279 603193016 603762512 603906403 604029427 604115372 604911385 605308380 604574242
895F04574242p2022n79948n14031k29072K43988L10936J29356M42581M47808J597137
$$ 604574242 604502220 603922272 603408241 603179169 603423157 603734093 603863449 604306030 604753838 606350975
904.6F06350975J64795l80936J170731J400986R86023k6436N15060O39916L43551o14166
$$ 606350975 606515770 606134834 607305565 608706551 609692574 609666138 610181198 610821114 611164665 610550499
914.3F10550499j309929q39500j462517k121086k263565j876488k114143j586419j375770
$$ 610550499 609240570 608401070 606938553 604817467 602553902 600677414 598563271 596976852 595601082
922.9E95601082j849632k196465k885704k405090k479363k382889k854766k851906
$$ 595601082 593751450 591554985 588669281 586264191 583784828 581401939 578547173 575695267
930.7E75695267j867218j509590l27225p7591p4387m62761p65762n87387q81615n83801
$$ 575695267 573828049 572318459 571991234 571913643 571839256 571376495 570610733 570023346 569141731 568557930
940.3E68557930q72459l97339k19155o64901q26149m20418O72607k60124o89773o676
$$ 568557930 567685471 567288132 567068977 566404076 565577927 565157509 565830116 565569992 564880219 564873543
949.9E64873543J40419m58870j087418j054001j301536n45273o31104j877937k225036
$$ 564873543 565013962 564555092 563467674 562413673 561112137 560566864 559935760 558057823 555832787
958.6E55832787j706696j427460j931076k044945j876564j454353j337967j503258
$$ 555832787 554126091 552698631 550767555 548722610 546846046 545391693 544053726 542550468
966.3E42550468j435546j130333j004525j191253j315880k064324k388725j966095
$$ 542550468 541114922 539984589 538980064 537788811 536472931 534408607 532019882 530053787
974.1E30053787j611671k459069l188667k597503k781220l050003l454170l045998
$$ 530053787 528442116 525983047 522794380 520196877 517415657 514365654 510911484 507865486
981.8E07865486k581253l845711m023933l676415l413620k747612l137817l085709
$$ 507865486 505284233 501438522 497414589 493738174 490324554 487576942 484439125 481353416
989.5D81353416k402877k472611k697067k961960k639427k644425k577400k058563
$$ 481353416 478950539 476477928 473780861 470818901 468179474 465535049 462957649 460899086
997.2D60899086k405319k676964k572365j513862j355095k076874j581726q22945j160698
$$ 460899086 458493767 455816803 453244438 451730576 450375481 448298607 446716881 445893936 444733238
1005.9D44733238k106323j705818j283951j022835j325950j262436q87490j359710
$$ 444733238 442626915 440921097 439637146 438614311 437288361 436025925 435138435 433778725
1013.6D33778725j057778j974601j988602j562233j663628j743469k394676j538620
$$ 433778725 432720947 430746346 428757744 427195511 425531883 423788414 421393738 419855118
1021.3D19855118j810875j645126j679078j833534j106911j421241q82302o53686J26190
$$ 419855118 418044243 416399117 414720039 412886505 411779594 410358353 409476051 408822365 408948555
1030D08948555p97615j434059l10631k00005J13564L60069J629219J307450J017837
$$ 408948555 408150940 406716881 406406250 406206245 406319809 406679878 408309097 409616547 410634384
1038.7D10634384R76715R68895J222458O22749M65432j022530N3291L79753q3427N34
$$ 410634384 411611099 412579994 413802452 414425201 414890633 413868103 413921394 414301147 414217720 414218254
1048.3D14218254j893730j192017q77762k40058j94970q85086j054840j02653O40945
$$ 414218254 412324524 411132507 410254745 410014687 409819717 408934631 407879791 407777138 408418083
1057D08418083k703705q80508J688232J135102J015319J499863K585564J438637K410545
$$ 408418083 405714378 404833870 406522102 407657204 408672523 410172386 412757950 414196587 416607132
1065.7D16607132J844597P56454J114807O91338J131134J269798J249962k78053M7722
$$ 416607132 418451729 419208183 420322990 421014328 422145462 423415260 424665222 424387169 424434891
1074.4D24434891K76642J49879J033325J8921j86462O523R82323P65075P07321N41459
$$ 424434891 424711533 424861412 425894737 425913658 425727196 425733719 426716042 427481117 428188438 428729897
1084D28729897L87611J776581L77044O14930J689338J801987J644669R52606P44056
$$ 428729897 429117508 430894089 431271133 431886063 433575401 435377388 437022057 437974663 438718719
1092.7D38718719N54848J113854Q04062J123313J277810J903457K096558O49910R75036
$$ 438718719 439273567 440387421 441191483 442314796 443592606 445496063 447592621 448242531 449217567
1101.4D49217567J475068J707687Q40378R72671R40247M38614J225166N57594P04842
$$ 449217567 450692635 452400322 453240700 454213371 455153618 455592232 456817398 457374992 458079834
1110D58079834M53072K35481P3700N24101K030258Q31032j34811K6359P59735n2948
$$ 458079834 458532906 458768387 458842087 459366188 461396446 462227478 462092667 462119026 462878761 462825813
1119.7D62825813m50515O27327j7586J59225l7803L95774Q25768Q52318J348152P66983
$$ 462825813 462375298 463002625 462985039 463144264 463106461 463502235 464328003 465180321 466528473 467295456
1129.3D67295456P00836O85501J730767K077445K068749K161179J142845J496124J721153
$$ 467295456 467996292 468681793 470412560 472490005 474558754 476719933 477862778 479358902 481080055
1138D81080055J525421J028405O04248P06978Q99734J711502J668511R68360M80805
$$ 481080055 482605476 483633881 484238129 484945107 485844841 487556343 489224854 490193214 490674019
1146.7D90674019L24516J38092p6141j76926k05498J2513m78936l49426N17845N55725
$$ 490674019 490998535 491136627 491060486 490883560 490678062 490690575 490211639 489862213 490380058 490935783
1156.3D90935783N9357p4806l72353j274986j021843o77757n64842l11966K1324J259842
$$ 490935783 490995140 490920334 490547981 489272995 488251152 487573395 487008553 486696587 486717911 487977753
1166D87977753J635551J588249J801834J935692J585236J480141K274017J799698P95746
$$ 487977753 489613304 491201553 493003387 494939079 496524315 498004456 500278473 502078171 502873917
1174.6E02873917J901207K873649K381897K200775J973305J702309J620216J800842
$$ 502873917 504775124 507648773 510030670 512231445 514204750 515907059 517527275 519328117
1182.4E19328117J196747K76489M31748N50880N84908O22368Q23517Q16345O73713
$$ 519328117 520524864 520801353 521233101 521783981 522368889 522991257 523814774 524631119 525304832
1191E25304832Q23937M30298l52288j133461j256675q25768o64444q34083p81174o05240
$$ 525304832 526128769 526559067 526206779 525073318 523816643 522990875 522326431 521492348 520711174 520105934
1200.7E20105934m93545j79253k17667p39441q19435n83191p70568j165925j262016
$$ 520105934 519612389 519433136 519215469 518476028 517656593 517073402 516302834 515136909 513874893
1209.4E13874893p87315l5591L19633J38016O4812p7706l20053k66266m97894r48410
$$ 513874893 513087578 513051987 513371620 513509636 513574448 513496742 513176689 512910423 512412529 511464119
1219E11464119r44672n78422l93906k67677m0474L4408J44082K8915l02582r48791
$$ 511464119 510519447 509941025 509547119 509279442 509238968 509273376 509417458 509446373 509143791 508195000
1228.6E08195000j264305j100312j174774o69021n6649L6316l38783k00005L31612
$$ 508195000 506930695 505830383 504655609 503986588 503929939 503966255 503627472 503427467 503759079
1237.3E03759079O3324j88408p26623r87931o63032m85726k78625k9412M26255K95715
$$ 503759079 503822403 503633995 502907372 501919441 501256409 500770683 500492058 500462646 500888901 501184616
1247E01184616L5477j47896j80244j84250q96454q12874l75290k19612J4610o8779
$$ 501184616 501220093 501072197 500891953 500707703 499811249 498998375 498623085 498403473 498418083 498349304
1256.6D98349304Q7929L70216O56548P77359j06392j91727M43039l20205m81797L67852
$$ 498349304 498437233 498807449 499463997 500241356 500134964 499943237 500386276 500066071 499584274 499952126
1266.3D99952126O91375Q07648P58705R70650J194954J231003P01713J27335N17883
$$ 499952126 500643501 501451149 502209854 503180504 504375458 505606461 506308174 506435509 506953392
1274.9E06953392Q81500P03774N22423N12313J056252J486206J218071J034012J152839
$$ 506953392 507834892 508538666 509061089 509573402 510629654 512115860 513333931 514367943 515520782
1283.6E15520782J324540P59849O97632J130409P09877Q48275J029930J171493J182594
$$ 515520782 516845322 517605171 518302803 519433212 520143089 520991364 522021294 523192787 524375381
1292.3E24375381Q61702P12777O53801N75485K1705k8991K07405O24542N80444K80838
$$ 524375381 525237083 525949860 526603661 527179146 527200851 527171860 527379265 528003807 528584251 528865089
1301.9E28865089L30582L59345N81398k32048j66016P3280m22783j11160l56941m62914
$$ 528865089 529195671 529555016 530136414 529904366 529738350 529811630 529388847 529277687 528920746 528457832
1311.6E28457832l31154k31208m74701m48609K79808N01748L09867p5149R1171Q9455
$$ 528457832 528126678 527895470 527420769 526972160 527251968 527753716 528063583 527988434 528079605 528169060
1321.2E28169060N34515J132164O34194N71937M23355P9346l1319K82173r956p36237
$$ 528169060 528703575 529835739 530469933 531041870 531465225 531544571 531513252 531795425 531785469 531049232
1330.9E31049232o82678m10995q583N5237K00309p591J6251N17158K05612n7068k54402
$$ 531049232 530366554 529955559 529946976 530002213 530202522 530194931 530211182 530728340 530933952 530876884 530622482
1341.5E30622482K92092K84881L47672R82094O43615O01349M72946K98272k57416l69225
$$ 530622482 530914574 531199455 531547127 532529221 533172836 533774185 534247131 534545403 534287987 533918762
1351.1E33918762l08876n72929l8567m6310n3139k9755m6997J5221K14004P0878n58396
$$ 533918762 533609886 533036957 532998390 532952080 532898941 532869186 532822189 532837410 533051414 533122292 532563896
1361.7E32563896n48363j610069m39110J53923m31976l7384J63078k9487m28696m15611
$$ 532563896 532015533 530405464 529966354 530120277 529688301 529650917 529813995 529784508 529355812 528940201
1371.4E28940201l11470M4021j24168o91071j22337r5291o1302j86424L58505l8262
$$ 528940201 528628731 528672752 528548584 527857513 527735176 527639885 527578583 527392159 527750664 527712402
1381E27712402q93936p33337j104889q22792l32909k92663k250481j381264J20926
$$ 527712402 526818466 526085129 524980240 524157448 523824539 523531876 521281395 519900131 520021057
1389.7E20021057p74803r18961o82525l32337k083320l300629j321793j386680r92012
$$ 520021057 519246254 518327293 517644768 517312431 515229111 511928482 510606689 509220009 508227997
1398.4E08227997k339020j930008p65533j105271q62846q92868k064819k256661q92944
$$ 508227997 505888977 503958969 503193436 502088165 501225319 500332451 498267632 496010971 495118027
1407.1D95118027j318894j843223j395493j098747o71120r12437n96123l18603l41416
$$ 495118027 493799133 491955910 490560417 489461670 488790550 487878113 487281990 486963387 486621971
1415.7D86621971m39529q96149J89133k365303j029244J190415O30264Q10966l41034
$$ 486621971 486182442 485286293 485475426 483110123 482080879 483271294 483901558 484712524 484371490
1424.4D84371490L36876O97403m7683O74171M39835Q8768M62341J386147Q45260M00314
$$ 484371490 484708366 485405769 485358086 486032257 486472092 486560860 487023201 488409348 489254608 489654922
1434.1D89654922J781006K273445N18570K1172K139702R64966K87437N98946M27055
$$ 489654922 491435928 493709373 494227943 494249115 496388817 497353783 497641220 498240166 498667221
1442.7D98667221J138229O22483J107521J092682P45926L40919Q92639J272278K38228
$$ 498667221 499805450 500427933 501535454 502628136 503374062 503714981 504607620 505879898 506118126
1451.4E06118126J003532R17015J623230J929894J131973K10266p29904K727738Q01963
$$ 506118126 507121658 508038673 509661903 511591797 512723770 512934036 512204132 514931870 515733833
1460.1E15733833J624337J405830J043167K045288N5885J138039J716385K097855J717834
$$ 515733833 517358170 518764000 519807167 521852455 521908340 523046379 524762764 526860619 528578453
1468.8E28578453K235527L473053J673241P15103J276398L120193L270302J657371
$$ 528578453 530813980 534287033 535960274 536675377 537951775 541071968 544342270 545999641
1476.5E45999641J204491J711235J934319J846008J242256P89795J459312J257477
$$ 545999641 547204132 548915367 550849686 552695694 553937950 554727745 556187057 557444534
1484.2E57444534O28968J335411R11064K21634J564560N08957j211853J32484M95148
$$ 557444534 558073502 559408913 560319977 560541611 562106171 562615128 561403275 561535759 562030907
1492.9E62030907m90837m39187m6844m143944K61841k07443k778015J17530k76107
$$ 562030907 561540070 561100883 561054039 556910095 557171936 556964493 554186478 554304008 554027901
1501.6E54027901j014252q07877R57985R16825m160080l264046L3951Q55140p73010
$$ 554027901 553013649 552205772 553163757 554080582 549920502 546656456 546690407 547545547 546772537
1510.2E46772537O64482k56424j627197M02336J8006o1570j207122l637734P55768
$$ 546772537 547437019 547180595 545553398 545955734 545973740 545912170 544705048 541067314 541823082
1518.9E41823082K265625J42632k702446k17934J367760K201423k45590M19655R93843
$$ 541823082 544088707 544231339 541528893 541310959 542678719 544880142 544634552 545054207 546048050
1527.6E46048050r91478m44298N00221J263085J883430J182823k310218J048965J052895
$$ 546048050 545056572 544612274 545112495 546375580 548259010 549441833 547131615 548180580 549233475
1536.3E49233475P73086K453728j559715l325920K406234J14746o49757J776810J392517
$$ 549233475 550006561 552460289 550900574 547574654 549980888 550095634 549445877 551222687 552615204
1545E52615204j124077J585693J010018J219635O65703j855851N14450J006661J824417
$$ 552615204 551491127 553076820 554086838 555306473 555972176 554116325 554630775 555637436 557461853
1553.6E57461853j468315k44103K892647K339249k511101o582107n73006J196213R48715
$$ 557461853 555993538 555749435 558642082 560981331 558470230 551888123 551315117 552511330 553460045
1562.3E53460045q67119p68929j747589j680297j4000m16413J07613o539650j826325
$$ 553460045 552592926 551823997 550076408 548396111 548382111 547965698 548073311 541533661 539707336
1571E39707336j165466k895164j839753j081428L1090r940873j302490j640320k910194
$$ 539707336 538541870 535646706 533806953 532725525 532756615 522815742 521513252 519872932 516962738
1579.7E16962738k643356l982735k828560m469719k869682l970795l557853l421784
$$ 516962738 514319382 510336647 507508087 503038368 500168686 496197891 492640038 489218254
1587.4D89218254m008751j960754l713494k237396m189987k923965l225365m095497
$$ 489218254 485209503 483248749 479535255 477297859 473107872 470183907 466958542 462863045
1595.1D62863045k391053m274520j943589l444862j840973k371673k338715j584168
$$ 462863045 460471992 456197472 454253883 450809021 448968048 446596375 444257660 442673492
1602.8D42673492l832855j668968k863693j323891k934608j224938j307678k775574
$$ 442673492 438840637 437171669 434307976 432984085 430049477 428824539 427516861 424741287
1610.5D24741287J98403k024842j90200j519509Q63609J01738o453476J922417q08983
$$ 424741287 424939690 422914848 422724648 421205139 422068748 422170486 415717010 417639427 416830444
1619.2D16830444N65300j239395J207009M15077k804032J425896P3166J981888j247483
$$ 416830444 417395744 416156349 417363358 417778435 414974403 416400299 416473465 418455353 417207870
1627.9D17207870j2016M69628L96804R64508J01548K669754K154274J041259l054161
$$ 417207870 417195854 417665482 418062286 419026794 419128342 421798096 423952370 424993629 421939468
1636.6D21939468J688576Q54645J206894K216644J6022J962089M79546K427635K553330
$$ 421939468 423628044 424482689 425689583 427906227 427922249 429884338 430363884 432791519 435344849
1645.3D35344849L13720K684212j787414J123237R05838L402596M304123J756668r166031
$$ 435344849 435658569 438342781 436555367 437678604 438584442 441987038 446291161 448047829 438881798
1653.9D38881798P45163M033470J085091J607093R07097J305275J743241J924629K305031
$$ 438881798 439626961 443660431 444745522 446352615 447259712 448564987 450308228 452232857 454537888
1662.6D54537888r85947K570457J896325K407646K821617K953338K222062N68924M403572
$$ 454537888 453551941 456122398 458018723 460426369 463247986 466201324 468423386 468992310 473395882
1671.3D73395882J255302L122482L669892P41958Q01125L342590M102249K761078L417893
$$ 473395882 474651184 477773666 481443558 482185516 482986641 486329231 490431480 493192558 496610451
1680D96610451J908798M043655N597039L133392P16476O65055N199737L387070K460518
$$ 496610451 498519249 502562904 508159943 511293335 512009811 512674866 517874603 521261673 523722191
1688.6E23722191L532524K668190L654633L868370M599227M860230M583893n94750
$$ 523722191 527254715 529922905 533577538 537445908 542045135 546905365 551489258 550894508
1696.4E50894508L381539N421448O278533N471726o230850N445442M784737L973922
$$ 550894508 554276047 559697495 565976028 571447754 565216904 570662346 575447083 579421005
1704.1E79421005L277741K856712J160584J445007L359947J926460J175270J848755
$$ 579421005 582698746 585555458 586716042 588161049 591520996 593447456 594622726 596471481
1711.8E96471481K211457K910308R86329R48219M371757L933144n100021L33137K272988
$$ 596471481 598682938 601593246 602579575 603527794 607899551 611832695 606732674 607065811 609338799
1720.5F09338799J375350J491967J085014Q12264J229324J560249J651116J582031
$$ 609338799 610714149 612206116 613291130 614103394 615332718 616892967 618544083 620126114
1728.2F20126114J871872m57192l14521L460006L608208k692528o374511M881820M422646
$$ 620126114 621997986 621540794 621226273 624686279 628294487 625601959 619227448 624109268 628531914
1736.9F28531914K167625K973061J197128j412887L154525K868233L80211Q26607L077468
$$ 628531914 630699539 633672600 634869728 633456841 636611366 639479599 639859810 640686417 643763885
1745.5F43763885L092042K510604K658234K284164M406662J466065l01590L421173
$$ 643763885 646855927 649366531 652024765 654308929 658715591 660181656 659880066 663301239
1753.3F63301239J966553K028732K519379L74756J939010K519531K613907M381943
$$ 663301239 665267792 667296524 669815903 670190659 672129669 674649200 677263107 681645050
1761F81645050R07288n52445K326660J015244Q04062J626587J769561j740646J982651
$$ 681645050 682552338 681999893 684326553 685341797 686145859 687772446 689542007 687801361 689784012
1769.7F89784012N042724K164155j516877k012710L541412J895981j296005J107330
$$ 689784012 694826736 696990891 695474014 693461304 697002716 698898697 697602692 698710022
1777.4F98710022L19366J211701O86874j07116J413726K056961K144394k0980J0757
$$ 698710022 699029388 700241089 700927963 700820847 702234573 704291534 706435928 706414948 706425705
1786G06425705P67593J08338J21765J332321Q04291P18155p76444l78723L872070J931534
$$ 706425705 707193298 707301636 707423401 708755722 709560013 710278168 709501724 709123001 712995071 714926605
1795.7G14926605o37207K80914J247101l0517j975861J183624M6006O36215K107544
$$ 714926605 714289398 714570312 715817413 715786896 713811035 714994659 715040665 715676880 717784424
1804.4G17784424J277847J222077Q72879L88259N87159J265945j684799j061936L61023
$$ 717784424 719062271 720284348 721157227 721545486 722132645 723398590 721713791 720651855 721012878
1813G21012878K49482J702118J068420J343536K16370M32663R90066k87170J97983
$$ 721012878 721262360 722964478 724032898 725376434 725592804 726025467 727015533 726728363 726926346
1821.7G26926346q55026N87921Q84628j682281O32934K341232K699585J095810k738571
$$ 726926346 726071320 726659241 727543869 725861588 726494522 728835754 731535339 732631149 729892578
1830.4G29892578m43802J362076j25198j05057l5935K50168Q35724j5564J054917O33239
$$ 729892578 729448776 730810852 730685654 730580597 730544662 730794830 731630554 731614990 732669907 733303146
1840.1G33303146O53077P02133J402435J03989n348282J799621J916886p5760k81754
$$ 733303146 733956223 734658356 736060791 736164780 730816498 732616119 734533005 734457245 734175491
1848.7G34175491P12586J513672K59781N87387j21537j31759m23813m04358N37109
$$ 734175491 734888077 736401749 736661530 737248917 737127380 736995621 736571808 736167450 736704559
1857.4G36704559j10473M01153M77448J066818L20358j6174J75095J9455O87866q5755
$$ 736704559 736594086 736995239 737472687 738539505 738859863 738843689 739018784 739038239 739726105 739640350
1867.1G39640350J081543j195831k055664R48410P61719P57751L77503R46579J22299
$$ 739640350 740721893 739526062 737470398 738418808 739180527 739938278 740315781 741262360 741384659
1875.7G41384659m77524o45447m63562M83856m272M65622K5406M79202O77872j01547
$$ 741384659 740907135 740261688 739798126 740281982 740277710 740743332 740768738 741247940 741925812 741824265
1885.4G41824265J0528o0959J056442j1672j671448J00097Q87452J69677K26364J72196
$$ 741824265 741834793 741773834 742830276 742818604 741147156 741247253 742134705 742304382 742530746 742702942
1895G42702942l30048O90689m3029o2867j08490m10995p706m58R30253L07617J23901
$$ 742702942 742372894 743063583 743020554 742957687 742849197 742438202 742430496 742430038 743360291 743667908 743791809
1905.6G43791809J51291J89743K13013l61100n46417o54144O30112L967M22897O30188
$$ 743791809 743943100 744132843 744345856 743984756 743438339 742784195 743414307 743418274 743841171 744471359
1915.3G44471359K12784J438675j534195j071854Q04749P3395j1215p36008m75311
$$ 744471359 744684143 746122818 744588623 743516769 744321518 744394913 744383698 743647690 743172379
1923.9G43172379K40097Q53347M20838K64206N0430j4191j91345p53860K060k25754
$$ 743172379 743412476 744265823 744686661 744950867 745001297 744987106 744795761 744041901 744043961 743818207
1933.6G43818207J62277j52435k44141N08499K13013N17273M05044R34067m12292j864167
$$ 743818207 743980484 743828049 743583908 744092407 744305420 744822693 745227737 746161804 745749512 743885345
1943.2G43885345k64434j76621n5771Q0033M66537J54724L96881N27115J3352l43552
$$ 743885345 743620911 743444290 743388519 743468552 743935089 744089813 744486694 745013809 745027161 744683609
1952.9G44683609p30133j4038k47040j58462j29929l5400J94625L739Q17489K15760
$$ 744683609 743953476 743939438 743692398 743533936 743404007 743368607 743563232 743566971 744384460 744600220
1962.5G44600220l586k00195l28446n264q55789p04117m7226M99115K81067N15060
$$ 744600220 744596634 744396439 744067993 744062729 743206940 742502823 742455597 742954712 743235779 743750839
1972.2G43750839N98526l891j59836n79452k66876j69220j45035o31943n41458O10657
$$ 743750839 744349365 744345474 744185638 743606186 743339310 743170090 743025055 742393112 741851654 742462311
1981.8G42462311O66733N03845L72467K25754k72141j38779p54928j105271L0900l34092
$$ 742462311 743129044 743632889 744005356 744231110 743958969 743820190 743065262 741959991 741990891 741656799
1991.5G41656799n74341P7363R45205R05838L40805k16369o05927p8354o28128n53741
$$ 741656799 741082458 741159821 742105026 743010864 743351669 743135300 742529373 742451019 741822891 741269150
2001.1G41269150n85633l60336Q2626o5765O91986L19824L88413M98505j10932q43887
$$ 741269150 740683517 740323181 740405807 740340042 741032028 741351852 741740265 742238770 742127838 741283951
2010.7G41283951j005554l18985m59671l8453K26670L75747J84327L98254N50308k45437
$$ 741283951 740278397 739959412 739499741 739461288 739687958 740063705 740248032 740646286 741196594 740951157
2020.4G40951157K9068o13556p85675p38526n07202r2544l89863M09012O10504Q31910
$$ 740951157 740980225 740366669 739580994 738842468 738335266 738242722 737852859 738261871 738872375 739704285
2030G39704285L73306j86157m22440q39767o57730q92106j99203j15433M41437R36279
$$ 739704285 740077591 739891434 739468994 738629227 737971497 737079391 736880188 736764755 737206192 738142471
2039.7G38142471M00238M85840p6980j87378o18058n31616p05032q73718m02604k35214
$$ 738142471 738542709 739028549 738951569 738764191 738146133 737614517 736909485 736035767 735633163 735397949
2049.3G35397949O75583M43802P83920P16400J11008j63422r53140n98373q31070n11322
$$ 735397949 736073532 736517334 737301254 738017654 738128662 737965240 737012100 736413727 735582657 735071335
2059G35071335j15509K45743O43539M54941O11725J11847J45645l07541n52063p93762
$$ 735071335 734955826 735201569 735845108 736300049 736911774 737023621 737169266 736861725 736309662 735515900
2068.6G35515900r12476k27356k01187M23202N97992R96323N73807j85776k69318o68640
$$ 735515900 734603424 734376068 734174881 734598083 735196075 736192398 736766205 736580429 736311111 735642471
2078.2G35642471l60794p85522m20227m56848p3853R17587L44162M69895K14386K22549
$$ 735642471 735281677 734496155 734075928 733619080 733545227 734462814 734806976 735276871 735491257 735713806
2087.9G35713806j46942m98962n74646q92563k01874p4005J85852J33133M37622N15671
$$ 735713806 735566864 735067902 734493256 733600693 733398819 733324814 733510666 733643799 734081421 734597092
2097.5G34597092N5999j34582p19223k85721n31769n43289n75104m26788N41458M09622
$$ 734597092 734653091 734518509 733799286 733513565 732981796 732438507 731863403 731436615 731978073 732387695
2107.2G32387695P89719N09643j49765l89099n01556o02417o12564k62909k82059K95182
$$ 732387695 733177414 733687057 733537292 733148193 732646637 732044220 731431656 731168747 730886688 731181870
2116.8G31181870L70941N40542L43781j50376J65711k8153k31323q78372m12064j39083
$$ 731181870 731552811 732093353 732437134 732286758 732452469 732424316 732192993 731314621 730902557 730763474
2126.5G30763474k63749M32968M36020L87040j30692J69220J58157k74276k58408l37143
$$ 730763474 730499725 730932693 731368713 731755753 731625061 731794281 731952438 731678162 731419754 731082611
2136.1G31082611j55182o98395L6927M55475K86102O15997K80152Q9340n15671n67246
$$ 731082611 730927429 730229034 730265961 730721436 731007538 731623535 731903687 731993027 731477356 730910110
2145.8G30910110l76892k82974l08380P324Q36716O56967K87552M6921R3918j47629
$$ 730910110 730533218 730250244 729941864 729949188 730785904 731442871 731730423 731777344 731871262 731723633
2155.4G31723633k43530m52881o67496n798J91421K15225J01853N87005K96936n8136
$$ 731723633 731480103 731027222 730359726 730353928 730545349 730760574 730862427 731449432 731746368 731688232
2165G31688232K98996m48150o22177p08542j12915J25732L510L81546M04052Q58307
$$ 731688232 731987228 731539078 730916901 730208359 730095444 730221176 730224686 730606232 731010284 731868591
2174.7G31868591K1668k29187m6158k96631q1482j03607j78604m97360K30407N06668
$$ 731868591 731890259 731661072 731614914 731318283 731236801 731133194 730954590 730457230 730687637 731194305
2184.3G31194305P03659N63660l8299J03759n90515l71246l37525k03781P4845j44883
$$ 731194305 731897964 732461624 732423325 732527084 731936569 731565323 731227798 731024017 731098862 730953979
2194G30953979L02125J64413K50015L76587O33392K2355n00031m99039o33316M17023
$$ 730953979 731256104 731420517 731670532 732047119 732680511 732702866 732202835 731703796 731070480 731487503
2203.6G31487503K78397l0442k38571J29242O02951J96076K94876m58222m6081M4632
$$ 731487503 731765900 731735458 731496887 731626129 732229080 732425156 732720032 732261810 732215729 732260361
2213.3G32260361l59192P3395J9226m3488l35235M28924L85666J69144K15606m90417
$$ 732260361 731901169 731974564 731993790 731950302 731615067 732043991 732429657 732598801 732814407 732323990
2222.9G32323990o57578o45218J61515n1499r5749N26276L81241L81088K73285J34659
$$ 732323990 731666412 731021194 731182709 731131210 731035461 731561737 731942978 732324066 732597351 732732010
2232.5G32732010l77808m42123o07681j67695L84369l2501m3259L2731O11648L74603
$$ 732732010 732354202 731912079 731304398 731136703 731521072 731488571 731445312 731478043 732089691 732464294
2242.2G32464294N7908l37830o88095O1645j38397l28750l31650p3471L41034P39288
$$ 732464294 732522202 732184372 731496277 731557922 731419525 731090775 730759125 730685654 731026688 731765976
2251.8G31765976J88141o15692J12610O4010Q3466k28882m44336k42844m33349J67389
$$ 731765976 731954117 731338425 731451035 731515045 731598511 731369629 730925293 730682449 730249100 730416489
2261.5G30416489K73132M91028L83224m2801l55224k7771J03378m46472J39236j43966
$$ 730416489 730689621 731180649 731563873 731521072 731165848 731138077 731241455 730794983 730934219 730790253
2271.1G30790253p8507j67846p6600M75388J39847K03476n73578P8659J77383l94516
$$ 730790253 730711746 730543900 730467300 730942688 731082535 731286011 730712433 730791092 730968475 730573959
2280.8G30573959l07769n99213k5635m42200L52860M60892r2545M8294p3700O99768
$$ 730573959 730266190 729666977 729641342 729199142 729552002 730012894 729920349 729968643 729894943 730594711
2290.4G30594711k85949l31116k85568m24881j10855j61362P97424k28729m10614j33743
$$ 730594711 730308762 729977646 729692078 729267197 729156342 728994980 729792404 729563675 729153061 729019318
2300G29019318J72271L22419p04346j04447m22287k83279j23062j35117L74222N5161
$$ 729019318 729191589 729514008 728809662 728705215 728282928 727999649 727876587 727741470 728115692 728170853
2309.7G28170853O7672l4256K06299o71921k95105O41938J95160J34582j98517Q9722
$$ 728170853 728238525 728204269 728410568 727738647 727443542 728085480 728280640 728415222 728216705 728306427
2319.3G28306427l02505m78669n17959J29699N07889k97394l39813n07355P08390o06766
$$ 728306427 728003922 727525253 727007294 727136993 727644882 727347488 727007675 726500320 727208710 726601944
2329G26601944o50787R93576M51126j98822j949768J95083J317902l12729j042786
$$ 726601944 725951157 726944733 727395859 727197037 725247269 725442352 726760254 726447525 725404739
2337.7G25404739l35235N19485q01239l15246J39846J40839m49905O0882L14789r23004
$$ 725404739 725069504 725588989 724787750 724472504 724612350 724753189 724303284 724364166 724678955 723755951
2347.3G23755951l21884P23572J462554j33209l64303K44522j48316R06372j406555
$$ 723755951 723434067 724157639 725620193 725486984 725122681 725367203 725218887 726125259 724718704
2356G24718704r30862q3542j373n87311j030350J176224K37045n76324m54712J468048
$$ 724718704 723787842 723704300 723702927 723115616 722085266 723261490 723498535 722922211 722467499 723935547
2365.6G23935547r8953j660691r38263p25937R30863K41852k84806n98449Q6822M26178
$$ 723935547 723836594 722175903 721237640 720511703 721442566 721684418 721399612 720801163 720887985 721314163
2375.3G21314163l14026l29284o21262q6594l59268j0147o2485o19888O5460m6539
$$ 721314163 721000137 720670853 720049591 719962997 719603729 719593582 719531097 718911209 718976669 718930130
2384.9G18930130O7749J7777N264k29340m37851j86767n78690l79715k18963R9716
$$ 718930130 718997879 719015656 719020920 718791580 718353729 718166962 717588272 717208557 716989594 717089310
2394.6G17089310o5613j35269J93252m8523J50681l25928o21033q57315o72912J05285
$$ 717089310 717023697 716888428 717081680 717033157 717183838 716857910 716236877 715379562 714706650 714811935
2404.2G14811935O2180J2512K9755K23083o8664k03858j90353k20490k89459n71975
$$ 714811935 714874115 714886627 714916382 715139465 715070801 714866943 714676590 714456100 714166641 713594666
2413.8G13594666l36533q03604n87082J69296K58103J99279J20926r7427n77927m02908
$$ 713594666 713258133 712454529 711867447 712036743 712294846 712494125 712615051 712517624 711939697 711536789
2423.5G11536789p02820n87311k59552l35388l06473m42962K24304J66244K05536j75018
$$ 711536789 710833969 710246658 709987106 709651718 709345245 708902283 709126587 709292831 709498367 709323349
2433.1G09323349n48477J221k38343k01721j045837r69773k38113r5825N13305L56522
$$ 709323349 708774872 708776093 708537750 708336029 707290192 706320419 706082306 705986481 706499786 706856308
2442.8G06856308K46506k79465k14691j41831o73294r10873p66831J32676k91901m14886
$$ 706856308 707102814 706823349 706608658 706466827 705793533 704882660 704115829 704248505 703956604 703541718
2452.4G03541718r8343K60696O91834j63804l95965p38602j121445n93185j23672m59214
$$ 703541718 703443375 703704071 704395905 704232101 703836136 703097534 701976089 701382904 701259232 700800018
2462.1G00800018l68728L87344J97296L32260K21634l78265q47626j204529q81424
$$ 700800018 700431290 700818634 701015930 701348190 701569824 701191559 700343933 699139404 698257980
2470.7F98257980n75027l98636j04294n7297l61328O2332Q8425j67541J54571j35498
$$ 698257980 697682953 697284317 697180023 697122726 696761398 696823730 696912155 696744614 696899185 696763687
2480.4F96763687o78635j153259m94766k75726l72773M807l09296R0561J831j92566
$$ 696763687 696085052 694931793 694437027 694161301 693788528 693793335 693484039 693574600 693576431 693383865
2490F93383865j95388l28675n08651q41675j72119l66669p08923m71573K9144L48587
$$ 693383865 693188477 692859802 692351151 691509476 691337357 690970688 690261765 689790192 689819336 690167923
2499.7F90167923j33667j86310m93469o04782o82984n63354o75583r75494k38877j14212
$$ 690167923 690034256 689847946 689354477 688749695 688066711 687503357 686827774 685852280 685613403 685499191
2509.3F85499191J83869L45001J17035j67542q01544m68979m3335k77786q40301p72553
$$ 685499191 685683060 686028061 686145096 685977554 685176010 684707031 684663696 684385910 683545609 682773056
2519F82773056l17230r9182j17722l6697K39792k30484m14353l08380k65732o63376
$$ 682773056 682455826 682356644 682238922 682202225 682442017 682211533 681797180 681488800 681223068 680559692
2528.6F80559692q27407o1722Q3618Q621k73056j73798j95312o10428l53317k96250
$$ 680559692 679732285 679670563 679754181 679762802 679489746 679315948 679120636 678510208 678156891 677860641
2538.2F77860641m25033n97534l28827l41187k87857P096q6213P0267l58276m49829
$$ 677860641 677435608 676838074 676509247 676168060 675880203 675887299 675801086 675871353 675513077 675063248
2547.9F75063248l43094k97623o35300q65402J80130J8616m74243l47138r0637Q3847
$$ 675063248 674720154 674422531 673787231 672921829 673101959 673120575 672646332 672299194 672208557 672292404
2557.5F72292404k41165m32205n57785j89820k85949o46744m24728m4251Q1329j16348
$$ 672292404 672051239 671619034 671061249 670871429 670585480 669938736 669514008 669469757 669551086 669434738
2567.2F69434738j37558k66189l91922n42984o1341k57263q15582j09940j01776l77045
$$ 669434738 669297180 669030991 668639069 668096085 668034744 667777481 666961899 666851959 666750183 666373138
2576.8F66373138o45599m32510M7607m5624k39639l77579r5443n00718k99911j61209
$$ 666373138 665727539 665295029 665342636 665297012 665057373 664679794 664584351 664083633 663783722 663622513
2586.5F63622513n65415q7814J86691K48871n72815p06177j50833j36184k79236o91910
$$ 663622513 663057098 662969284 663155975 663404846 662832031 662125854 661975021 661838837 661559601 660867691
2596.1F60867691m21524l91235k40860r4300k13394j07574j83029k96326o19965j70593
$$ 660867691 660446167 660054932 659814072 659719772 659506378 659398804 659215775 658919449 658299484 658128891
2605.7F58128891j84402p43485n01404N265q1711o28281l65753l33252l77808o67343
$$ 658128891 657944489 657201004 656699600 656704865 656623154 655994873 655629120 655295868 654918060 654250717
2615.4F54250717n58090J30615m03671n36728n79758o14395j78222O0882R766k37122
$$ 654250717 653692627 653823242 653419571 652882843 652303085 651688690 651510468 651571350 651581116 651343994
2625F51343994l77273p85752m35638j41297m86145o02035j86539M1962k95334J24588
$$ 651343994 650966721 650180969 649745331 649604034 649117889 648515854 648329315 648371277 648075943 648200531
2634.7F48200531J38168j13907q24050j184540k65732k21939l69721o35299k83051
$$ 648200531 648338699 648224792 647400742 646216202 645950470 645728531 645358810 644723511 644440460
2643.4F44440460K5788m62342m00848l65296j02920k19574m27933o57730o69479o6681
$$ 644440460 644466248 644003906 643603058 643237762 643134842 642915268 642487335 641829605 641160126 641093445
2653F41093445k38877n59768j74713J43127l44162k12898k73705m94003J0376k71873
$$ 641093445 640854568 640294800 640120087 640263214 639919052 639706154 639432449 638938446 638948822 638676949
2662.6F38676949m04778o30531k93618P1755k07901j13220m27742j8883j7815n87005
$$ 638676949 638272171 637641640 637348022 637419777 637211876 637098656 636670914 636652031 636634216 636047211
2672.3F36047211m87900l54500m36897l89252J69067J00594k594k36893m32357l33939
$$ 636047211 635559311 635204811 634767914 634378662 634547729 634648323 634645729 634408836 633976479 633642540
2681.9F33642540m04282k08091m04358k19956l65867m56810k27394l78800J78566K5673
$$ 633642540 633238258 633030167 632625809 632405853 632039986 631583176 631355782 630976982 631155548 631181221
2691.6F31181221k06261m2724l98140o67763n02205q6555k3613j84174l07503j52435
$$ 631181221 630974960 630932236 630534096 629866333 629364128 629277573 629253960 629069786 628762283 628609848
2701.2F28609848k82173k35443p4272j13945j15471o14510n13763m34151l41263r7313
$$ 628609848 628327675 628092232 628017960 627904015 627788544 627174034 626660271 626226120 625884857 625787544
2710.9F25787544j70707k09618k53906L38707j75858p06978j89476k27165m73175l18451
$$ 625787544 625616837 625407219 625153313 625492020 625316162 624609184 624419708 624192543 623719368 623400917
2720.5F23400917K48566k13890k80533J16043J0185L3341n33944m61311r0408l38059
$$ 623400917 623649483 623435593 623155060 623271103 623281288 623314629 622780685 622319374 622228966 621890907
2730.2F21890907o92749l59726J3390j41716j5373j79482M8943j2741k59438j71509
$$ 621890907 621198158 620838432 620851822 620710106 620694733 620515251 620564194 620551453 620292015 620120506
2739.8F20120506k82745l8567k84462k42767j80168l55110m0474J54991J59264j14708
$$ 620120506 619837761 619799194 619514732 619271965 619091797 618736687 618696213 618851204 619010468 618895760
2749.4F18895760j35193l39585l79753j46141l09486j72501j46370l07274k0599J15433
$$ 618895760 618760567 618420982 618041229 617895088 617585602 617413101 617266731 616959457 616938858 617054291
2759.1F17054291k37694j64413j83259l58734m60586m42543j7662j15395o3057l88565
$$ 617054291 616816597 616652184 616468925 616110191 615649605 615207062 615189400 615074005 615010948 614622383
2768.7F14622383l48625Q9645l90396j01242k11296k64893k19688q00705l14827J15662
$$ 614622383 614273758 614363403 613973007 613871765 613660469 613395576 613175888 612375183 612060356 612176018
2778.4F12176018p1068k18506j04828l53393m25187p0381k77404p94030q96148k55623
$$ 612176018 612104950 611886444 611781616 611428223 611003036 610932655 610655251 609861221 608965073 608709450
2788F08709450j57356L5743k31743q66546l28026j61362R9831r3193n91850l65983
$$ 608709450 608552094 608587837 608356094 607489548 607161522 607000160 607099991 607006798 606414948 606048965
2797.7F06048965k39677m55017j044159o26984m5395m65049p41082l22418q9874l28674
$$ 606048965 605809288 605354271 604310112 603683128 603637733 603172684 602431602 602109184 602019310 601690636
2807.3F01690636l48702l21808n27038j056557n88646j56174m85305l80707n25932
$$ 601690636 601341934 601020126 600493088 599436531 598847885 598691711 598206406 597825699 597299767
2816E97299767n50385o49528m61274m53834q09975o18820o12755l65829l12882n22690
$$ 597299767 596749382 596099854 595638580 595184746 594374771 593755951 593143196 592777367 592464485 591941795
2825.6E91941795r61532q53577j1558m8790n06173r32731q49076p44705l96118l67775
$$ 591941795 590980263 590126686 590115128 590066338 589560165 588627434 587778358 587033653 586637535 586269760
2835.3E86269760j060486r98230j142616j051102q92601j020317j120681j247635j075058
$$ 586269760 585209274 584211044 583068428 582017326 581124725 580104408 578983727 577736092 576661034
2843.9E76661034j200638j168556j172676j312256k004090j756630o69174r20296q16612
$$ 576661034 575460396 574291840 573119164 571806908 569802818 568046188 567377014 566456718 565640106
2852.6E65640106r01108n96542k06680k83127L58696J56860l32756o48155k04773O4735
$$ 565640106 564738998 564142456 563935776 563652649 564011345 564168205 563835449 563187294 562982521 563047256
2862.3E63047256m44374o03790n20668k41203o15769l32451n72700j180573l87039
$$ 563047256 562602882 561999092 561478424 561237221 560621452 560289001 559716301 558535728 558148689
2870.9E58148689q0528Q9340l04298o10161m00848o67725p91283o04934l49579n56030
$$ 558148689 558068161 558157501 557853203 557243042 556842194 556174469 555383186 554778252 554428673 553872643
2880.6E53872643l16811k35901m85992m07410q57353r73206n33295l80706o19850o21644
$$ 553872643 553555832 553319931 552833939 552426529 551569176 550595970 550062675 549681969 549062119 548440475
2890.2E48440475o09245o79855q47626r99679m26484l01551m88511p32498p00073k26898
$$ 548440475 547831230 547151375 546303749 545304070 544877586 544576035 544087524 543355026 542654953 542428055
2899.9E42428055m96445o31447o27899m00009l00064j085549q99963j73645o29501
$$ 542428055 541931610 541300163 540672264 540272255 539972191 538886642 537986679 537813034 537183533
2908.6E37183533r03435o39801j057854q42285k86903q24127j312295j181564p86896
$$ 537183533 536280098 535640297 534582443 533740158 533453255 532629128 531316833 530135269 529348373
2917.2E29348373q18367j365127j399727q17986m30793m15650m65660n25436p88269
$$ 529348373 528530006 527164879 525765152 524947166 524516373 524100723 523635063 523109627 522321358
2925.9E22321358l54920L20473P3013L28369J28594M8294N53513l75672n67016L01437
$$ 522321358 521966438 522286911 522359924 522688293 522816887 522865181 523418694 523043022 522476006 522777443
2935.6E22777443J122093Q41065K29110P14760N55077O75811P70760L64456K49291
$$ 522777443 523899536 524740601 524969711 525684471 526239548 526915359 527686119 528050575 528299866
2944.2E28299866N63087R07364J95084P6713M53758O44799N63354M67873O18362R9182
$$ 528299866 528862953 529770317 529965401 530042114 530495872 531140671 531704025 532171898 532790260 532889442
2953.9E32889442r5863O142M19464M51279M0893J06506M03214R45892P89376P25555
$$ 532889442 532793579 532799721 533219185 533670464 533711357 533817863 534221077 535166969 535956345 536681900
2963.5E36681900O21147N91698N59082L5896M75769M00276N2948O14968J073570R78050
$$ 536681900 537303047 537894745 538453827 538489723 538965492 539365768 539418716 540033684 541107254 542085304
2973.2E42085304Q77037L90702j67275L64952M77295O04859J89399j62315N90629K38762
$$ 542085304 542962341 543353043 543185768 543550720 544028015 544632874 544822273 544659958 545250587 545489349
2982.8E45489349J5602N0202J97487L22456J27907m1924j0757O72455J83677p7362
$$ 545489349 545504951 545555153 545752640 546075096 546203003 546161079 546150322 546822777 547006454 546929092
2992.5E46929092k10304n27916J04599N3139J03264l19901l79829J46255l65867n88188
$$ 546929092 546718788 546190872 546295471 546348610 546451874 546131973 545752144 545898399 545532532 544944344
3002.1E44944344n69878l31116j49727l64608l79105p057J44424k82516l61100j38931
$$ 544944344 544374466 544043350 543893623 543529015 543149910 543142853 543287277 543004761 542643661 542504730
3011.7E42504730m27208p53059l95813m16718n78727o55671n55076p4997k14424k53334
$$ 542504730 542077522 541324463 540928650 540511932 539933205 539277534 538722458 538647461 538433037 538179703
3021.4E38179703p88956p15713J76506n02282q70208m82178n43900l12385q2817o73485
$$ 538179703 537390747 536675034 536851540 536349258 535479050 534996872 534452972 534140587 534057770 533384285
3031E33384285m24652k10953r93652n81589n11665r15146p17926j79329k06032p70531
$$ 533384285 532959633 532748680 531755028 531173439 530661774 529746628 529028702 528849373 528643341 527872810
3040.7E27872810m12712l46489l41682o54297p31316o12335r28154j38092n54542q72651
$$ 527872810 527460098 527113609 526771927 526117630 525386314 524773979 523845825 523707733 523153191 522280540
3050.3E22280540l49655o83784n49851l97186k97241o43578r60693o19011m14886n71976
$$ 522280540 521930885 521247101 520697250 520300064 520002823 519359245 518398552 517779541 517364655 516792679
3060E16792679n14717n14870j079903o24733m2266M61273L34205j183815j380043p52792
$$ 516792679 516277962 515763092 514683189 514058456 514016190 514477463 514811668 513627853 512247810 511495018
3069.6E11495018k27890l21960p33262l49044j73493o34117q38547l8147J79940n98069
$$ 511495018 511267128 510945168 510211906 509862862 509689369 509055252 508216705 508178558 508358498 507760429
3079.2E07760429o79016k85492n35965p45811l41263m7836k49672j119080j051292
$$ 507760429 507081413 506795921 506259956 505514145 505172882 505125046 504875374 503756294 502705002
3087.9E02705002j75324O1608k87247p23343p19871j067238p71408r7313r5558k41814
$$ 502705002 502529678 502591286 502304039 501580696 500860825 499793587 499022179 498924866 498829308 498587494
3097.6D98587494n28259n58815p49321n12123k69738n24368o38199n03845k87972p82547
$$ 498587494 498059235 497500420 496751099 496238976 495969238 495444870 494806671 494302826 494014854 493232307
3107.2D93232307n13076j29586l74145m80728q28095n85403j31951J23673n89371j179848
$$ 493232307 492719231 492589645 492215500 491734772 490906677 490321274 490189323 490312996 489723625 488543777
3116.9D88543777l37410p6866n64575q24280p19604r68514q32557l02887n75333q26340
$$ 488543777 488206367 488129501 487564926 486740646 486021042 485052528 484219971 483917084 483341751 482515411
3126.5D82515411n89637j67084k05689m88357q58803r39712l83301k78931o57730q10814
$$ 482515411 481925774 481758690 481553001 481064644 480205841 479266129 478882828 478603897 477946167 477135353
3136.1D77135353m50859m34151o39228n74799q05512q44383l96004m20837p50351m17747
$$ 477135353 476684494 476250343 475611115 475036316 474230804 473386421 472990417 472569580 471819229 471401482
3145.8D71401482p32117p72133j89247l18298j75896m49371k56501l33976j530457
$$ 471401482 470669365 469897232 469707985 469389687 469213791 468764420 468507919 468173943 466643486
3154.5D66643486j352310n19829k60048p51877o84089j24855m83895p91092p37381
$$ 466643486 465291176 464771347 464511299 463759422 463075333 462950478 462466583 461675491 460938110
3163.1D60938110o36940m26025k47459o51665j002922j034966p20672k09351p09457
$$ 460938110 460301170 459875145 459627686 458976021 457973099 456938133 456217461 456008110 455298653
3171.8D55298653p26776n8594l30582p13959l64761n16090j016426q20199r01184p16018
$$ 455298653 454571877 454513283 454182701 453468742 453103981 452587891 451571465 450751266 449850082 449134064
3181.5D49134064l82157p43675j036529l96462l5858n08461k33154o41556j010857
$$ 449134064 448751907 448008232 446971703 446575241 446539383 446030922 445797768 445156212 444145355
3190.1D44145355p78198p79457k51961j15433j2931o19622r36927m65241r66148j348496
$$ 444145355 443367157 442587700 442335739 442220306 442207375 441587753 440650826 440185585 439219437 437870941
3199.8D37870941r22928L13530O7177q90808n47981l8529r2163q85162m29421J1406
$$ 437870941 436948013 437261543 437328720 436437912 435889931 435851402 435759239 434874077 434444656 434456062
3209.4D34456062p45468r60121m32434N8632n46951r27277o19354j50109q5525m54445
$$ 434456062 433710594 432750473 432318039 432376671 431829720 430902443 430283089 430132980 430047455 429593010
3219.1D29593010m63677n56182o76346p42684l51104l03002m48150m00544q59680m44336
$$ 429593010 429129333 428573151 427896805 427154121 426803017 426500015 426051865 425651321 424791641 424347305
3228.7D24347305J19591k54288m77142j62773o16036j103134p19681n68389r8267k04582
$$ 424347305 424466896 424212608 423735466 423572693 422956657 421853523 421133842 420565453 420467186 420262604
3238.4D20262604p64199p64999l61366j7739k99301n87578r45014j38512L98331l85743
$$ 420262604 419498405 418733406 418372040 418354301 418055000 417467422 416522408 416383896 416782227 416396484
3248D16396484p75604o18973N226m83970n27840j3771p13425o99501j72691k10571
$$ 416396484 415620880 415001907 415007133 414523163 413995323 413981552 413268127 412568626 412395935 412185364
3257.7D12185364q91724p31659n6076p7324l48358n44395l90511n28374j84135o9237
$$ 412185364 411293640 410561981 410505905 410428581 410080223 409535828 409145317 408616943 408432808 408363571
3267.3D08363571j98822M9210l18184n36003q57621n68084L128J77460P5264q10662
$$ 408363571 408164749 408213959 407895775 407359772 406502151 405934067 405937195 406114655 406189919 405379257
3276.9D05379257p72781l74680k20642l38669n62667n0583N0354k85683n33867n57632
$$ 405379257 404606476 404231796 404011154 403672485 403109818 403059235 403109589 402823906 402290039 401732407
3286.6D01732407n92080n00526k3231K61306J36643k88773n37643o70357l40767j39160
$$ 401732407 401140327 400639801 400616570 400877876 401014519 400725746 400188103 399517746 399176979 399037819
3296.2C99037819m66805n58090l59001l5019j67580J46218K85301m03519o83555q33168
$$ 399037819 398571014 398012924 397653923 397618904 397451324 397597542 397882843 397479324 396795769 395962601
3305.9C95962601m08325Q6975l6736l66554o10771m34990r7390j6860m26636n41039
$$ 395962601 395554276 395641251 395604515 395237961 394627190 394192200 394094810 394077950 393651314 393110275
3315.5C93110275l93028j70555m11720j249619r15604k54020l07617l11318l9558j07422
$$ 393110275 392717247 392546692 392134972 390885353 389969749 389715729 389408112 389096794 389057236 388949814
3325.2C88949814m50020o24733j018333p93953k82975l54080n86815l85780l95889
$$ 388949814 388499794 387875061 386856728 386062775 385779800 385425720 384838905 384453125 384057236
3333.8C84057236p41844J4762m17175r96170O1836j48391m75388p11060j083145q89358
$$ 384057236 383315392 383330154 382912979 381916809 381978645 381830254 381354866 380643806 379560661 378671303
3343.5C78671303n81055K09580O7749n05982k98347o9847m34227r02176q43544r08509
$$ 378671303 378090248 378299828 378367577 377861595 377563248 377493401 377059174 376156998 375313454 374404945
3353.1C74404945k90222r193n78079j80779n1269k33422j80397m65622p46803o83670
$$ 374404945 374114723 374105530 373527451 373346672 373295403 373061981 372881584 372415962 371669159 370985489
3362.8C70985489r6016J23405j60217l03268n69878m25758J01814l90511q99314m42696
$$ 370985489 370889473 371012878 370852661 370549393 369979515 369553757 369655571 369265060 368365746 367923050
3372.4C67923050j30005L4142k63710l17955r9183o59217l90511j26114m45900k49786
$$ 367923050 367793045 367827187 367563477 367245522 367146339 366487122 366096611 365970497 365524597 365274811
3382.1C65274811Q4762L78189k35672o78062m00314J16844P34444j21956n99251J05209
$$ 365274811 365359573 365737762 365502090 364824028 364423714 364540558 365275002 365153046 364553795 364659004
3391.7C64659004N226j29928j77918o81343l59115L70941k27432p77207k21481K74048
$$ 364659004 364664230 364534302 364356384 363675041 363315926 363686867 363459435 362682228 362460747 362734795
3401.3C62734795R6435m31099k67715M0817l19176o447K46697k13471K9603j08948
$$ 362734795 362831230 362400131 362132416 362173233 361854057 361847610 362094307 361880836 361910439 361801491
3411C61801491k51084L71895J65177q6899N4512K84042K41623o2523J65749J6861j99127
$$ 361801491 361550407 361922302 362087479 362000580 362055092 362339134 362580757 362518234 362683983 362700844 362501717
3421.6C62501717l1968M30031P12433K69241K06986M34227J66893k85301J84555J61323
$$ 362501717 362469749 362899780 363612213 363881454 364088440 364522667 364689560 364404259 364588814 364750137
3431.2C64750137o0272Q85277N80788j93596k67983K62718M87099J93405L44239O1645
$$ 364750137 364689865 365575142 366155930 365962334 365694351 365957069 366444168 366637573 366981812 367043457
3440.9C67043457K53792J15166N35774Q04214k23922N44853L40957O9085R25025P17431
$$ 367043457 367297249 367412415 367948189 368752403 368528481 369073334 369414291 369483376 370408401 371125832
3450.5C71125832N59539K18811N69382N19257J16615L18565L96958O97746Q30345J063729
$$ 371125832 371685371 371904182 372473564 372992821 373109436 373428001 373824959 374522705 375353050 376416779
3460.2C76416779N45349J14784K74429L17650R68094J077957M42848J73989P02743
$$ 376416779 376962128 377076912 377351341 377668991 378637085 379715042 380157890 380331879 381034622
3468.8C81034622O67610N94597O18363k5292O64482Q98629m0589N21431J451416J124153
$$ 381034622 381702232 382296829 382915192 382889900 383554382 384453011 384412422 384933853 386385269 387509422
3478.5C87509422N26963J57661P83005J236000k40364P17964J518135O19049J131821
$$ 387509422 388036385 388194046 388977051 390213051 389972687 390690651 392208786 392827835 393959656
3487.2C93959656N94978K87743M94690O06842J065330R59053Q86536N43556R98497
$$ 393959656 394554634 394842377 395337067 395943909 397009239 397968292 398854828 399398384 400396881
3495.8D00396881N66940N4894Q02498Q10737J440850J636200Q85276l13491l82996
$$ 400396881 400963821 401018715 401821213 402631950 404072800 405709000 406594276 406280785 405897789
3504.5D05897789J301994J141358M07562J433182J160774q40988L75137J742096J032944
$$ 405897789 407199783 408341141 408748703 410181885 411342659 410501671 410876808 412618904 413651848
3513.2D13651848R45930J021386J016616J125603P75108L35160L30047J104088J786614
$$ 413651848 414597778 415619164 416635780 417761383 418536491 418871651 419201698 420305786 422092400
3521.9D22092400Q33320j19247P66525J471863J699409Q63762N33066J149368J118470
$$ 422092400 422925720 422806473 423572998 425044861 426744270 427608032 428141098 429290466 430408936
3530.6D30408936N09109K43759J107979J327667J638451Q69446J19095J444053J292839
$$ 430408936 430918045 431161804 432269783 433597450 435235901 436105347 436224442 437668495 438961334
3539.2D38961334R77593R02061J363487R51996P21703J575508J052208J337280l7689
$$ 438961334 439938927 440840988 442204475 443156471 443878174 445453682 446505890 447843170 447805481
3547.9D47805481J146278K033234J687164K052994q59985P75146R96933O15196J913109
$$ 447805481 448951759 450984993 452672157 454725151 453865166 454640312 455637245 456252441 458165550
3556.6D58165550R65348K258567K018586J138267L12691J488991J504707K76184M267387
$$ 458165550 459130898 461389465 463408051 464546318 464859009 466348000 467852707 468128891 472396278
3565.3D72396278J993981k3003K00195o36367K974777J029358R38492J647606J775932
$$ 472396278 474390259 474367256 474567451 473931084 476905861 477935219 478873711 480521317 482297249
3574D82297249J307678J168747K416229N09415J888733J801796P83882J744232K105370
$$ 482297249 483604927 484773674 487189903 487699318 489588051 491389847 492173729 493917961 496023331
3582.6D96023331K522201J209374L582611K000656j357308N95627j101265K869721
$$ 496023331 498545532 499754906 503337517 505338173 503980865 504576492 503475227 506344948
3590.4E06344948L081627L140564J592254L85056L040428j007919K061882L464203
$$ 506344948 509426575 512567139 514159393 514544449 517584877 516576958 518638840 522103043
3598.1E22103043N86853L032112J643867Q08678J996994J394005J439171L176765K750092
$$ 522103043 522689896 525722008 527365875 528174553 530171547 531565552 533004723 536181488 538931580
3606.8E38931580l37944L508453j240349j098633P426529K289772j375122L092270
$$ 538931580 538593636 542102089 540861740 539763107 547189636 549479408 548104286 551196556
3614.5E51196556m85687L762207M752045J289672R41048j359672J524276K700424K248726
$$ 551196556 550710869 554473076 559225121 560514793 561455841 560096169 561620445 564320869 566569595
3623.1E66569595K628174L404770K983131J832810O171379K404861r586181K042160
$$ 566569595 569197769 572602539 575585670 577418480 583589859 585994720 576408539 578450699
3630.9E78450699L933334N022736J779709o57921K629967L526763K624856M70085J837120
$$ 578450699 582384033 587406769 589186478 588528557 591158524 594685287 597310143 597780228 599617348
3639.5E99617348K731323K291412J198082P97844K389755L769227O183280L01705r10187
$$ 599617348 602348671 604640083 605838165 606636009 609025764 612794991 618978271 619279976 618369789
3648.2F18369789O592331o53038m235840j659431M629554M412156M628982M892807
$$ 618369789 624962120 624309082 620073242 618413811 623043365 627455521 632084503 636977310
3655.9F36977310p372589J935272N183106J368637J507187J181564K741776O86416
$$ 636977310 629604721 631539993 636723099 638091736 639598923 640780487 643522263 644208679
3663.6F44208679M27475J569824K108612N500336K893753L0670q90426p078934L279495
$$ 644208679 644636154 646205978 648314590 653814926 656708679 656739349 655848923 648769989 652049484
3672.3F52049484Q522873Q238754k280197j5703888L720703P221528L553466k623901
$$ 652049484 660572357 668811111 666530914 650827026 654547729 661769257 665322723 662698822
3680F62698822M2343K684250K403793J667099M41056O62613L933105O552811q600006
$$ 662698822 662741165 665425415 667829208 669496307 669937363 670599976 674533081 681085892 672485886
3688.7F72485886l483429R313354m977798j843186M412079M53415J038361j30616L86048
$$ 672485886 669002457 678315811 673338013 671494827 675906906 676360321 677398682 677268066 677654114
3697.4F77654114K261886L35083K412415L549957m973755k932968L661118J569366
$$ 677654114 679916000 680251083 682663498 686213455 681239700 678306732 681967850 683537216
3705.1F83537216N89981K39792K726212M684753m292602L783721L052369j3832627
$$ 683537216 684127197 684366989 687093201 691777954 687485352 691269073 694321442 680488815
3712.8F80488815L074036M125671m73251l8376K555695K105026k672424O61087M679718
$$ 680488815 683562851 687688522 687215271 687176895 689732590 691837616 689165192 689826279 694505997
3721.5F94505997l409119k908935N308609J368484j084137l592682J95847L491287
$$ 694505997 691096878 688187943 693496552 694865036 693780899 690188217 690384064 693875351
3729.2F93875351P40356N072709k137986n841903R179687J364899j1570740n27191
$$ 693875351 694615707 699688416 697550430 691708527 700888214 702253113 690682373 690155182
3736.9F90155182K974930M47006K307892K754593k269974M398880J2331314j0196762
$$ 690155182 693130112 693577118 695885010 698639603 696369629 700768509 713099823 702903061
3744.7G02903061j9089661R921494O328201N887451l938369q435059J1987533o452255
$$ 702903061 683813400 693734894 700063095 705950546 702012177 693577118 705564651 699112396
3752.4F99112396q458709N695953L745346K449875m959412J824341N030441o853103
$$ 699112396 690653687 696349640 700094986 702544861 697585449 699409790 704440231 697587128
3760.1F97587128j352845L749390Q09021L45993L402558j890641m272766K454529M864807
$$ 697587128 696234283 699983673 700792694 701138687 704541245 702650604 698377838 700832367 705697174
3768.8G05697174J378098q914948J34735K966995O24772J055526Q6060R16366P64771
$$ 705697174 707075272 698160324 698295059 701262054 701886826 702942352 703028412 703944778 704709549
3777.4G04709549K550125p34405p536545K173919K132416J015091K828903k124939
$$ 704709549 707259674 706525269 698988724 701162643 703295059 704310150 707139053 705014114
3785.2G05014114j831970N85556O70090M50363o22253R7808j14974M75082L76282J038894
$$ 705014114 703182144 703767700 704437790 704888153 704265900 704363708 704248734 704723816 705100098 706138992
3794.8G06138992K998658l505936l381500K493286L749618N943299p061234j0338058
$$ 706138992 709137650 705631714 702250214 704743500 708493118 714436417 707375183 697037125
3802.5F97037125L933181K642517M847031L529968j0103530j469727M798126J262055
$$ 697037125 700970306 703612823 708459854 711989822 701886292 700416565 705214691 706476746
3810.2G06476746q5526K76642l42255J486664N904541k054520j3029174N169601O126862
$$ 706476746 706391220 706667862 706325607 707812271 713716812 711662292 698633118 703802719 709929581
3818.9G09929581N247726J660156j8656234J356506N536423J905288K573471o05850
$$ 709929581 715177307 716837463 698181229 699537735 705074158 706979446 709552917 708947067
3826.6G08947067m019317k9450J945954M345855J446686q221741K779618P373581n130616
$$ 708947067 704927750 704898300 706844254 711190109 712636795 704415054 707194672 714568253 709437637
3835.3G09437637j485214Q034287p620850n748291N935822n182114J62277O359787
$$ 709437637 707952423 715986710 708365860 702617569 708553391 703371277 703533554 709893341
3843G09893341j455078l521500J897049J082077j33209J826630Q2931K910309N603943
$$ 709893341 708438263 704916763 706813812 707895889 707762680 709589310 709672241 712582550 718186493
3851.7G18186493m296112K74811j7102509J159744R396210r40323j156845K190399
$$ 718186493 713890381 714165192 697062683 698222427 707618637 706678314 705521469 707711868
3859.4G07711868K329026K502975m707184o72378M900970n688629m043961M386216
$$ 707711868 710040894 712543869 707836685 707164307 712065277 706376648 702332687 706718903
3867.1G06718903M521331N020676n272598q013077K004471M929275L472061q564682
$$ 706718903 711240234 716260910 710988312 702975235 704979706 709908981 713381042 704816360
3874.8G04816360n41076K956543L91845K685395L918609n289840o643677N683746K088089
$$ 704816360 704275284 707231827 707623672 710309067 714227676 708937836 702294159 707977905 710065994
3883.5G10065994J404038K710266j2818909J777268M071884L76053M087143N0277p381897
$$ 710065994 711470032 714180298 701361389 703138657 707210541 707586594 711673737 711724014 704342117
3892.2G04342117M28849K617721m39224J799850J005020J496430R67178p496032M877319
$$ 704342117 704770966 707388687 706949463 708749313 709754333 711250763 712217941 704721909 709599228
3900.9G09599228J799087m710083L896103l240432k413712L58124O73599J458206j0834
$$ 709599228 711398315 706688232 710584335 707343903 704930191 705288315 705961914 707420120 707409286
3909.6G07409286K71225k99072L89862K78244K8153J347809J318054k917252l044052
$$ 707409286 707680511 707381439 707771301 708049545 708077698 709425507 710743561 707826309 704782257
3918.2G04782257K714691j217193k570114L081588J864014O10580k327194k608642
$$ 704782257 707496948 706279755 703709641 706791229 708655243 709265823 706938629 704329987
3926G04329987J264953J342468J533738p15714r77936J120682j932373j212463N96084
$$ 704329987 705594940 706937408 708471146 707755432 706777496 707898178 705965805 704753342 705349426
3934.6G05349426M28849J497955O31790o12793o07300k82669J838455J228562m081803
$$ 705349426 705778275 707276230 707908020 707295227 706687927 706405258 708243713 709472275 705390472
3943.3G05390472j461410J389236J583863J630478j844254N75027J131058j750870
$$ 705390472 703929062 705318298 706902161 708532639 706688385 707263412 708394470 706643600
3951G06643600O50406q23059m55169P96051n98450o33392p43943P77893R13697O59027
$$ 706643600 707294006 706470947 706015778 706811829 706213379 705579987 704836044 705613937 706527634 707186661
3960.7G07186661l71552j747741O56204J038360K7161l29742n59235p2937k35748l01056
$$ 707186661 706815109 705067368 705723572 706761932 706789093 706459351 705900116 705827179 705591431 705290375
3970.3G05290375L60794N60379P28836J20010q06961n1803j00174K10037N70755l73306
$$ 705290375 705651169 706211548 706940384 707060394 706253433 706201630 706101456 706311493 706882248 706508942
3980G06508942l77426m02756J59683J37405r002K71225k43073k20413K40097P68280
$$ 706508942 706131516 705728760 705888443 706025848 706016846 706288071 706044998 705824585 706064682 706832962
3989.6G06832962o56815p67517L63388J38245O02570l52784m59899K68631M13055M10690
$$ 706832962 706176147 705408630 705772018 705910263 706512833 706160049 705700150 705968781 706381836 706792526
3999.2G06792526l17459
$$ 706792526 706475067
4000.2G06475067
$$ 706475067
##END=$$ End of the data block
