##TITLE=$$ Begin of the data block
##JCAMP-DX=5.00 $$ ACD/SpecManager v 10.08
##SPECTROMETER/DATA SYSTEM=Varian
##DATE=08 Jan 2013 15:20:44
##DATA TYPE=INFRARED SPECTRUM
##DATA CLASS=XYDATA
##ORIGIN=
##OWNER=
##NPOINTS=3735
##FIRSTX=399.26403809
##LASTX=4000.35498047
##MAXX=4000.35498047
##MINX=399.26403809
##MAXY=70.72281647
##MINY=29.01798439
##XFACTOR=1.0000000000
##YFACTOR=0.000000100000000
##FIRSTY=47.12867737
##DELTAX=0.96440572
##XUNITS=1/CM
##YUNITS=TRANSMITTANCE
##XYDATA=(X++(Y..Y))
399.3D71286774J714515M493370J655045P37114K844810k588234j175384R48372n2834
407.9D79863548O79436j775360P6485l520775l202210K439232J239319J199303K890777
416.6D79889755K941132l199845m758377N012818O22215m636383j194839N554809M480438
425.3D84711723K675667k410927j499862j096497o881905m098053P60499J185798L06816
434D73653259L20549K259980l04032k046928j55525K685012L699913n54695j852417
442.7D77705116K488137K434196K836571J921348q406868r522857k402802K029572
450.4D69082413M456253K144089j15433L115043q6021j694183k839470k631836J420593
459.1D72851448p089844m785423L457108M088592K173309k514000j23672j455193j169509
$$ plain form
399.3 471286774 473001289 477494659 479149704 479886818 482731628 480143394 478968010 479916382 479863548
407.9 479863548 480542984 478767624 478844109 475323334 472121124 474560356 475799675 476998978 479889755
416.6 479889755 482830887 479631042 474872665 479885483 480507698 475871315 474676476 480231285 484711723
425.3 484711723 487387390 484976463 483476601 482380104 475498199 471400146 472160645 473346443 473653259
434 473653259 473973808 476233788 475929756 473882828 473727303 476412315 480112228 479557533 477705116
442.7 477705116 480193253 482627449 485464020 487385368 478978500 469455643 467052841 469082413
450.4 469082413 473538666 475682755 475567322 478682365 478596344 476902161 474062691 471430855 472851448
459.1 472851448 465761604 460976181 464433289 468521881 470695190 468181190 468057518 466602325 465432816
467.7D65432816K263832k291527m522133n198250K596512P253380K457352O96563k770347
476.4D65918198j468621J875038J733056k712937j662292L33061k236710J255761K056274
485.1D65090828o05202N61600j14365j531639r59549L04032J388054k021561m178658
493.8D57933540j346740o0540K223359J899375O69327O79512l095817j981049K559433
502.5D59480400Q68111k315026k290954j299668k68821K044754J313095J566315J463928
511.1D60562134q53501j736106k093430k920685k742233O70929M406166L721542k720833
519.8D56293983n430870o9770Q41674L65410k03857k503662l17345R04503j111641
528.5D48768425O91757J663437L80936M00696j335068k125435j295395L11317N05028
$$ plain form
467.7 465432816 467696648 465405121 460882988 455684738 458281250 465534630 467991982 468688545 465918198
476.4 465918198 464449577 466324615 468057671 465344734 463682442 464015503 461778793 463034554 465090828
485.1 465090828 464485626 465047226 464932861 463401222 462441673 462745705 464133759 462112198 457933540
493.8 457933540 456586800 456526260 458749619 460648994 461318321 461997833 458902016 456920967 459480400
502.5 459480400 460348511 458033485 455742531 454442863 454174042 456218796 457531891 459098206 460562134
511.1 460562134 459708633 457972527 455879097 452958412 450216179 450887108 455293274 459014816 456293983
519.8 456293983 450863113 450793343 451635017 452000427 451796570 449292908 448975563 449880066 448768425
528.5 448768425 449460182 451123619 451504555 451905251 450570183 448444748 447149353 447460670 447965698
537.2D47965698j709671m75769J053124J415405q926j071244k00996j424866n94368
545.9D44948387O45638K6359K69814j93825j412811j516075q33130l03231J88294q05779
555.5D41013641m38804N54161M54025K23694o63567j00059L00903l52135p48100K51045
565.1D40494804N41916j25808R91859J376686M62647j957703j966133k51846M17938
573.8D39984360J403885n04074J14212O46553j070176l77159j618576o85425J127854
582.5D39021454N7449O64749M70124j397477k57568J478233J274949R76676M12026
591.2D42700615N33562O90193L28216q95919j566468L03002J133423Q78257Q50411
599.9D44955292M4861j217308m43688J12038k032662r60464M33540j082344o19659
$$ plain form
537.2 447965698 446256027 445780258 446833382 448248787 448239861 447168617 446967621 445542755 444948387
545.9 444948387 445594025 445620384 445890198 445696373 444283562 442767487 441934357 441631126 441819420 441013641
555.5 441013641 440574837 441128998 441583023 441806717 441143150 441043091 441343994 440991859 440243759 440494804
565.1 440494804 441036720 440910912 441902771 443279457 443742104 441784401 439818268 439566422 439984360
573.8 439984360 441388245 440884171 440998383 441644936 440574760 440197601 438579025 437893600 439021454
582.5 439021454 439078903 439743652 440213776 438816299 438558731 440036964 441311913 442288589 442700615
591.2 442700615 443234177 443924370 444252586 443356667 441790199 442093201 443226624 444104881 444955292
599.9 444955292 445000153 443782845 443339157 443451195 441418533 440458069 440891609 439809265 439189606
608.5D39189606J367302P51991j438141j287804o61926k4376j27105k46315l03727
617.2D37219505j082420Q29239J181183R05380R60197R8114L67623l41072R18312K101860
626.9D43157921l11699o90079J476364J838303L53317R84268L083496K488747R7275
635.5D52477913j54266R23004J0109l73192P77893J503219J831475J420097J273804
644.2D59690056N12886K55890J109962j016998q99735J287041N97763J244583J962891
652.9D64744339J167374P0419m19045p1487k13699m37622o51245p99103p45850O1569
662.5D62705650J413956J919098J347656p60956o333770j6767197R965744Q999596
670.3D62489777L069610k76146M3526J334991J728554P27692J374054J709671O2561
$$ plain form
608.5 439189606 440556908 441308899 439870758 438582954 437921028 437896652 437769547 437523232 437219505
617.2 437219505 436137085 436966324 438147507 439052887 440013084 440111198 440478821 440137749 441056061 443157921
626.9 443157921 442846222 442156143 443632507 445470810 445824127 446808395 449891891 452380638 452477913
635.5 452477913 452323647 453246651 453256760 452883568 453661461 455164680 456996155 458416252 459690056
644.2 459690056 460202942 460458832 461568794 460551796 459652061 460939102 461536865 462781448 464744339
652.9 464744339 465911713 465982132 465563087 465491600 465277901 464840279 464189034 463389931 462644081 462705650
662.5 462705650 464119606 466038704 467386360 466625404 460291634 443524437 453490181 462489777
670.3 462489777 465559387 465283241 465326767 466661758 468390312 469118004 470492058 472201729 472264290
678.9D72264290N6305P24067j88980j58577J426773J552735J179848K515220K344628
687.6D81716309j71814m69704P59163J008720K93465n26123N92537J490288J176147
696.3D85868988R50127N64117Q29659Q32138M27131L9406R0065P56188L38859K28996
705.9D90925674P00379J140060J313095L72124K56462J066933J220474K75765K16827
714.6D97487793Q66890L77426Q76236Q64258o65131p12967J143189J746673M49334
723.3E02433701k27662Q240Q03833J424866J475830J022491N89333M33579M15649J109886
733E09489746N05905O28548R00001J65253L75023l6964J327247J456185K88887m5510
742.6E15054321o86264J118355R30405N24559J572571P08236j86653L2883J086311
$$ plain form
678.9 472264290 472320595 473044662 472855682 472697105 474123878 475676613 476856461 479371681 481716309
687.6 481716309 481544495 481074791 481833954 482842674 483136139 482610016 483202553 484692841 485868988
696.3 485868988 486819115 487383232 488212891 489045029 489472160 489511566 489601631 490357819 490696678 490925674
705.9 490925674 491626053 492766113 494079208 494451332 494707794 495774727 496995201 497270966 497487793
714.6 497487793 498354683 498732109 499608345 500472603 499807472 499094505 500237694 501984367 502433701
723.3 502433701 502206039 502214279 503018112 504442978 505918808 506941299 507530632 507964211 508379860 509489746
733 509489746 509995651 510624199 511524200 511689453 512064476 512027512 513354759 514810944 515099831 515054321
742.6 515054321 514368057 515486412 516416817 516941376 518513947 519222183 519035530 519068413 520154724
751.3E20154724N29442L43246O83518J090927R05113J40152J713371Q80356Q5182J347847
760.9E27873878P60346k75459j9493J424140J249161O53038O18058N26657K11296o7673
770.6E32953949K23389k18315n60227n47676L53012M29726M34265J048965L4142n4360
780.2E34096870M78745N71518m65508o12487N26542j09215k15187R52263J975632J125603
789.9E38324776K39143N03464J63841k76642o51550q10127j249047n98030K70195Q07076
799.5E36723099N91430n20362r14612j247673j105576k146377j955948j079560j666412
808.2E26678009j225700m98925J3657j104851j363144r99565j476936j795082j951103
816.9E16276360k06299K67906K01301O47393O06460J191597J683655J404152K90527
$$ plain form
751.3 520154724 520684166 521027412 521710930 522801857 523706970 523847122 525560493 526440849 526526031 527873878
760.9 527873878 528634224 528358765 528339272 529763412 531012573 531665611 532283669 532810326 533021622 532953949
770.6 532953949 533177338 532959023 532398796 531851120 532204132 532633858 533068123 534117088 534151230 534096870
780.2 534096870 534575615 535147133 534681625 534069138 534595680 534486465 534271278 535223541 537199173 538324776
789.9 538324776 538563919 539067383 539231224 538954582 538303032 537492905 536243858 535645828 535916023 536723099
799.5 536723099 537314529 536794167 535879555 534631882 533526306 531379929 529423981 528344421 526678009
808.2 526678009 525452309 524953384 524967041 523862190 522499046 521499481 520022545 518227463 516276360
816.9 516276360 516070061 516337967 516539268 517186661 517793121 518984718 520668373 522072525 522363052
825.5E22363052R64852J281357J904792K972031J868896K225419K641410K714768K043190
834.2E40979767J913681K177582R77935J346932P36008K43339P63512K073021K834053
842.9E54045830K277107K094460J141891J129150L08381Q13179J304817J88255r3918
851.6E63209152J3542K419663K453155J753846J369056J359749K263756K55814K81906
860.3E75379639J295814J126671m79431q95271Q79020J101570Q72002j73111q80546
868.9E78226357j333504r49898j428261j826820q86192j037941l88909m06303K22740
877.6E70191269K5215m81377o52198j623497j99738n27420j198349r06601n3673L76625
887.3E64950256o11877n81207j081467k29950K31972N35507P30591q7509j24741m43382
$$ plain form
825.5 522363052 523327904 524609261 526514053 529486084 531354980 533580399 536221809 538936577 540979767
834.2 540979767 542893448 545071030 546048965 547395897 548131905 548375244 549138756 551211777 554045830
842.9 554045830 556322937 558417397 559559288 560688438 560996819 561809998 563114815 563303070 563209152
851.6 563209152 563222694 565642357 568095512 569849358 571218414 572578163 574841919 575097733 575379639
860.3 575379639 576675453 577802124 577322693 576427422 577306442 578408012 579280014 579106903 578226357
868.9 578226357 576892853 575942955 574514694 572687874 571801682 570763741 570374832 569968529 570191269
877.6 570191269 570216484 569735107 569082909 567459412 567259674 566732254 565533905 564627304 564573631 564950256
887.3 564950256 564338379 563757172 562675705 562445755 562677727 563213234 563943825 563856316 563731575 563288193
896.9E63288193Q38051K35061p40890k10648m99153k05040K25258J147003J270790
905.6E65348625J441879J414414J287651R25560K87323O14700L85666J406593J88180
914.3E73300591j487961j163864j610260j980172k214126j208458k157440l159409
922E58318901k424393j954231k121620k777557k616387l412170l434525k915611k595673
930.7E34066734k494087k292557j278267o34574K22854n23300m75426p3395q22677
939.3E25695305m41704q13942q06732p24716j03531K84691l3112L55148n42335o63719
949E22205353N78346J132851n94139j420289m56581o75468p49207p60612k09618j307525
958.6E17743111k804642k965813k774429j709900j830749j206131j052514j833877
$$ plain form
896.9 563288193 564126244 564361305 563620415 563409767 562910614 562705574 562930832 564077835 565348625
905.6 565348625 566790504 568204918 569492569 570418129 570705452 571320152 571705818 573112411 573300591
914.3 573300591 571812630 570648766 569038506 567058334 564844208 563635750 561478310 558318901
922 558318901 555894508 553940277 551818657 549041100 546424713 543012543 539578018 536662407 534066734
930.7 534066734 531572647 529280090 528001823 527367249 527590103 527066803 526591377 526517982 525695305
939.3 525695305 525253601 524439659 523632927 522908211 522804680 523089371 523056259 523411407 522869072 522205353
949 522205353 522783699 523916550 523322411 521902122 521445541 520770073 520020866 519260254 519050636 517743111
958.6 517743111 514938469 511972656 509198227 507488327 505657578 504451447 503398933 501565056
966.3E01565056j445465j289673j669426j696930o26144j590767k824936k274132k354965
975D85792618k446442k412834k387962k626267l035011l512116l383903l263626l917847
983.7D58806610m218597m527283l848190l066254l805122l573075l101005l496247
991.4D29170837l455505l734398l304634k760582k533798k803192l134079k204094
999.1D05240555k654152k640114k365456j678276j132621k504158j984063j782150
1006.8C88499565j732902j626511j380577n13992j085244j135940j513214j884575
1014.6C77626610k052307j895104k016945k396164k415466k983780k031631k167244
1022.3C59667969k350998k250977j779785o84929j335296q40874j089096j134682j386375
$$ plain form
966.3 501565056 500119591 498829918 497160492 495463562 494837418 493246651 490421715 488147583 485792618
975 485792618 483346176 480933342 478545380 475919113 472884102 469371986 465988083 462724457 458806610
983.7 458806610 454588013 450060730 446212540 443146286 439341164 435768089 432667084 429170837
991.4 429170837 425715332 421980934 418676300 415915718 413381920 410578728 407444649 405240555
999.1 405240555 402586403 399946289 397580833 395902557 394769936 392265778 390281715 388499565
1006.8 388499565 386766663 385140152 383759575 383245583 382160339 381024399 379511185 377626610
1014.6 377626610 375574303 373679199 371662254 369266090 366850624 363866844 361835213 359667969
1022.3 359667969 357316971 355065994 353286209 352601280 351265984 350425110 349336014 348201332 346814957
1031C46814957j084786O4507n74188L4866M36706J082383J024322J362724J962967
1039.6C51124458J084290P97462O32477J379852P38106k85492n72166l92723l78189
1048.3C54128075j003456n63241j056938j154327j523514r67331l26614l22037R5139
1057C47305756j128273j35880P19986K309036J827164P2021J935730J563836J599121
1065.7C56068497J950378K238732K044143J096535R35516Q36716Q27255J6937N82772
1074.4C66597481O2027n19066q86459k76452J101151J92261J256065M67644O04439
1083C68599091J043167K51579Q00095j59722J569023K210198J689491P34749O66771
1091.7C77404442J745262J009178J831741O75965P16095J453514J239548J632461J775742
$$ plain form
1031 346814957 345730171 345794678 345220490 345255356 345692062 346774445 347798767 349161491 351124458
1039.6 351124458 352208748 353006210 353638687 355018539 355756645 355471153 354898987 354506264 354128075
1048.3 354128075 353124619 352561378 351504440 350350113 348826599 347859268 347532654 347210617 347305756
1057 347305756 346177483 346041603 346761589 349070625 350897789 350969810 352905540 354469376 356068497
1065.7 356068497 358018875 360257607 362301750 363398285 364333801 365170517 365997772 366014709 366597481
1074.4 366597481 366659508 366140442 365253983 364977531 366078682 366270943 367527008 367994652 368599091
1083 368599091 369642258 369893837 370693932 370534210 372103233 374313431 376002922 376737671 377404442
1091.7 377404442 379149704 380158882 381990623 382666588 383382683 384836197 386075745 387708206 389483948
1100.4C89483948K590790J029548J369477J951789J499329J187820j0719K67372J91956
1109.1C99561310L68271N0621P75184J081009R14955J804276Q36601J166840O23932
1117.7D07182999j72997p47375j036301O2714q3199O82030K35214O12946J478309Q29239
1127.4D09043579O41632J39008R58175J596871K153740K486305K534294J977387J556968
1136.1D23087959K194901J172714J216965J802139J397095R27810R19571J265412M55551
1144.8D34440117P11365J343040R47113j00288j70975N14793p9155o1912n34515k60354
1154.4D36749229K53945o29044j15127j44425l51562m69895j172485j132660k80991
1163.1D32706985J125260J337967Q83217J564369K563667K107086J635781K084922
$$ plain form
1100.4 389483948 392074738 393104286 394473763 396425552 397924881 399112701 399101982 399369354 399561310
1109.1 399561310 399929581 399980202 400755386 401836395 402751350 404555626 405392227 406559067 407182999
1117.7 407182999 407010002 406262627 405226326 405289040 405205841 405887871 406123085 406736031 408214340 409043579
1127.4 409043579 409685211 409824219 410782394 412379265 414533005 417019310 419553604 421530991 423087959
1136.1 423087959 425282860 426455574 427672539 429474678 430871773 431799583 432719154 433984566 434440117
1144.8 434440117 435151482 436494522 437441635 437341347 437170372 437685165 437606010 437544098 437009583 436749229
1154.4 436749229 437003174 436374130 436259003 436114578 435763016 435293121 434120636 432987976 432706985
1163.1 432706985 433832245 435170212 436053429 437617798 440181465 442288551 443924332 446009254
1170.8D46009254J867486J413497K064057K590408K396546K538833K579575K428360
1178.5D63888016K360687J912231J385994J626511J919212J815491R73854O06918J251832
1187.2D77740746J410560R91745J57433K39334J30005n61600j101418q86001J71585
1195.9D78292389k33040n75714l39050k57340q70895j589089j073913j288948j117020
1204.5D70947380n80254o70394N6953K14462m14009l14712m02565p55654k46048m76112
1214.2D67359047q86002j72882q7089P2708K29034k39410p3509m22592j131173q45260
1223.8D63802872p01752r74503q16764l40195l7651J77498N3520r13010j201210n79147
1233.5D58469658m27322o49071j003952n25666L71743j12610m53949K74620L61862
$$ plain form
1170.8 446009254 447876740 449290237 451354294 453944702 456341248 458880081 461459656 463888016
1178.5 463888016 466248703 468160934 469546928 471173439 473092651 474908142 475881996 476488914 477740746
1187.2 477740746 479151306 480143051 480300484 480539818 480669823 480108223 479006805 478120804 478292389
1195.9 478292389 478059349 477483635 477144585 476887245 476016350 474427261 473353348 472064400 470947380
1204.5 470947380 470367126 469696732 469753685 469968147 469554138 469239426 468836861 468081207 467835159 467359047
1214.2 467359047 466473045 466300163 466213074 466285782 466514816 466275406 466201897 465779305 464648132 463802872
1223.8 463802872 463101120 462126617 461309853 460969658 460932007 461109505 461163025 460250015 459048805 458469658
1233.5 458469658 458042336 457393265 456389313 455863647 456235390 456122780 455668831 455943451 456305313
1242.2D56305313j26076p12547r58481q89969p50579k62261k15530l65868j37329L48587
1251.8D52235260K93617j52740k60239l88374k51389m70428m04358k5597O8627O83899
1261.4D51328278O27899L25203L39164M34876K11487K51541P22618M17175N97687J072998
1271.1D56328926J126251J064186Q11539N38483P07664J234207J015435L88336N38673
1279.8D63753700J251793J206207J120491J520272J489563J476669J182556N97725
1287.5D73598976N35813O23207O62078R44672R91783R00421P30667Q08106R47456N03922
1297.1D81247101J29280J75972L58925M0397K41394J20736j08605L09258j34659j907
1306.8D82377892k80991m66385k51083o62804l29094l48701m68598m29230o752l2386
$$ plain form
1242.2 456305313 456179237 455466690 454508209 453618240 452867661 452605400 452389870 452024002 451886673 452235260
1251.8 452235260 452528877 452376137 452115898 451727524 451476135 451005707 450601349 450575752 450644379 451328278
1261.4 451328278 451956177 452281380 452620544 453055420 453266907 453518448 454241066 454658241 455255928 456328926
1271.1 456328926 457455177 458519363 459330902 459869385 460577049 461811256 462826691 463215027 463753700
1279.8 463753700 465005493 466211700 467332191 468852463 470342026 471818695 473001251 473598976
1287.5 473598976 474134789 474757996 475420074 476364746 477356529 478256950 478987617 479795723 480743179 481247101
1297.1 481247101 481376381 481552353 481911278 481951675 482193069 482313805 482205200 482514458 482379799 482377892
1306.8 482377892 482096901 481630516 481379433 480716629 480387535 480038834 479570236 479141006 479134254 479101868
1316.4D79101868m03748K31094L98713P63626O27174L39661Q67157J170311Q78334
1325.1D83974190L65524M18167k4986j14327l73458p59812l40843j83601J01966J17417
1334.7D83180237J30195l61442n86624j06011k19879L55187Q67462J014137P00645
1343.4D84973907O03638P68852O03829O17447R3231P7095n2071k90718n72357m37813
1353.1D86385040j61628l08724M41399M63295L89366j28975n59692j096497j450920
1361.7D83972664o59523r60617R77249N63011q89168n13229n28946j9340j39199l78227
1371.4D81424675p07512q80814n64689j10665M27590j95961L0250M68636M90265l12576
1381D80069199j166573j389885j628189r52377j103249j152611j091385r6778J42440
$$ plain form
1316.4 479101868 478698120 478929214 479327927 480091553 480718727 481058388 481925545 483095856 483974190
1325.1 483974190 484339714 484757881 484732895 484618568 484245110 483485298 483144455 482960854 483062820 483180237
1334.7 483180237 483310432 482948990 482362366 482256355 482036476 482391663 483259125 484273262 484973907
1343.4 484973907 485577545 486346397 486950226 487567673 487660904 487737999 487685928 487395210 486822853 486385040
1353.1 486385040 486223412 485914688 486356087 486819382 487208748 487079773 486520081 485423584 483972664
1361.7 483972664 483313141 482352524 483329773 483892784 483003616 482490387 481961441 481942101 481802902 481424675
1371.4 481424675 480717163 479836349 479271660 479160995 479588585 479392624 479422874 479891510 480381775 480069199
1381 480069199 478902626 477512741 475884552 474932175 473828926 472676315 471584930 471488152 471630592
1389.7D71630592j111717j527862k016869j845741k943077l174515j336136j561394
1397.4D56113281j423454k017593o84662p42874k081452k034721k226410l007507j633149
1406.1D40261459n75866j107941j342163j001625j158600j141052r20677q37975j185570
1414.8D30989990j302528j564522j305122m46816k464180J153908K007942O21033M70390
1423.4D28160095j46560O52618P11594L04565N70679l16162P45964J785812J863632
1432.1D34332237J401024J100426J366157M81148K18392J186218K012214J290627J315689
1440.8D44704132J627007Q53424J523628R15031P98531Q03871K45018K05460J279907
1449.5D52956009J597443N60150J042480J372566J272622j20011q74863l48739R92927
$$ plain form
1389.7 471630592 470518875 468991013 466974144 465128403 462185326 459010811 457674675 456113281
1397.4 456113281 454689827 452672234 451987572 451244698 449163246 447128525 444902115 441894608 440261459
1406.1 440261459 439685593 438577652 437235489 436233864 435075264 433934212 433013535 432175560 430989990
1414.8 430989990 429687462 428122940 426817818 426371002 423906822 425060730 427068672 427689705 428160095
1423.4 428160095 428013535 428666153 429377747 429682312 430252991 429936829 430682793 432468605 434332237
1432.1 434332237 435733261 436833687 438199844 438680992 438899384 440085602 442097816 443388443 444704132
1440.8 444704132 446331139 447184563 448708191 449623222 450421753 451225624 451470642 451676102 452956009
1449.5 452956009 454553452 455113602 456156082 457528648 458801270 458681259 457806396 457457657 458450584
1458.2D58450584M409829K363891K470970J271057J265641K226333p2326J782036K210197
1466.8D76378212K530785J981582K098923K712860J066551O43807K293472M327431
1474.6D94033623K681732K045326K706909K170449J990356J405449J643524J769524
1482.3E10446892K008209J731987O90575P89795L74298J11885O97937j065369O48079
1491E16434288K501678J177559k88658m93355r40208m054337M97857q78601k081986
1499.6E11874237L34282o92177p36008o42852j96762j501389p922821m427834M070015
1508.3E00158691L004876j87874N27687j278420r05952O98814j335182j327896j655617
1517D97699127o48842J088562N15557l437233k723809K447243J299019J102638j056823
$$ plain form
1458.2 458450584 462860413 465224304 467695274 468966331 470231972 472458305 472385979 474168015 476378212
1466.8 476378212 478908997 480890579 482989502 485702362 486768913 487412720 489706192 494033623
1474.6 494033623 496715355 498760681 501467590 503638039 505628395 507033844 508677368 510446892
1482.3 510446892 512455101 514187088 514877663 515667458 516041756 516153641 516851578 515786209 516434288
1491 516434288 518935966 520113525 519824867 519331512 518391304 514336967 514834824 513956223 511874237
1499.6 511874237 512208519 511516342 510780334 510137482 509940720 508439331 500516510 496088676 500158691
1508.3 500158691 503163567 502975693 503503380 502224960 501319008 502017822 500682640 499354744 497699127
1517 497699127 497050285 498138847 498654404 495217171 492493362 494940605 496239624 497342262 496285439
1525.7D96285439P19261J218071J100425J917916O51321j04866o1607p11441j149712
1534.3D99864807K570267J565361L46680J077461l700562l306694L258934J453438
1542.1E03129692l36876R82247J140632O26755K348595J127128M31099j422462q13713
1550.7E07213097J628990K23312L1510k696038R09424J517449j129609o586113q008689
1559.4D93103333O694374L006057J665039r23271j183586k414894k199516q44345k116127
1568.1D94787064k201844p039070Q32787o72074k971763k282143k309990j497040j2142715
1576.8D64503212J3351j265182k800827k710953m106789k532958m735489l049736m013215
1585.5D39301414l672218l724708m536324k797661m671745k687378m310226k500534
$$ plain form
1525.7 496285439 497004700 498222771 499323196 501241112 501892433 501787567 501725960 501014519 499864807
1534.3 499864807 502435074 504000435 504347115 505424576 501724014 498417320 501676254 503129692
1542.1 503129692 502792816 503775063 504915695 505542450 507891045 509018173 509449272 508026810 507213097
1550.7 507213097 508842087 509065399 509096909 506400871 507310295 508827744 507698135 501112022 493103333
1559.4 493103333 499797707 502803764 504468803 503545532 502361946 499947052 497747536 496903191 494787064
1568.1 494787064 492585220 485546150 486378937 485706863 482735100 480452957 478142967 476645927 464503212
1576.8 464503212 464516563 463251381 460450554 457739601 453632812 451099854 446364365 443314629 439301414
1585.5 439301414 435629196 431904488 427368164 424570503 419898758 417211380 412901154 410400620
1593.2D10400620l659020m528313k148513m002572j895637m283257k272415l036804
1600.9C84574089k899208j876030l598671q50334l406029j647262k931633j431275
1608.6C65933647j471557k763749Q8883k506027L84636j419983k88849j436348o024018
1617.3C50496635L043671l83339J038475j272888P42683n26084k025795J643447k86789
1626C52470016J662140j910514J289901R89991N19104O75773n61638K099037J56212
1634.6C57390022N88837j275597K636834K091293J561775K549820L46375K158088L21655
1643.3C68369102K083779J272697j355362K449303j098480L919182J284408K396431
1651C79321060K104759j993255l594933J917420N164489J614342J948052J232681J895561
$$ plain form
1593.2 410400620 406741600 402213287 400064774 396062202 394166565 389883308 387610893 384574089
1600.9 384574089 381674881 379798851 376200180 375349846 371943817 370296555 367364922 365933647
1608.6 365933647 364462090 361698341 361787224 359281197 359665833 358245850 357957001 356520653 350496635
1617.3 350496635 353540306 353156967 354195442 352922554 353665237 353139153 351113358 352756805 352470016
1626 352470016 354132156 352221642 353511543 354501534 355020638 355696411 355134773 357233810 357390022
1634.6 357390022 357978859 356703262 359340096 361431389 362993164 365542984 365889359 368047447 368369102
1643.3 368369102 370452881 371725578 370370216 372819519 371721039 375640221 376924629 379321060
1651 379321060 381425819 379432564 375837631 377755051 382919540 384533882 386481934 387714615 389610176
1659.7C89610176J648941J016464J495743J10092M362183K737236K480965K380409
1667.4D05842209K195320K224388J491013L988304J858597M599990M011193K348060
1675.1D28559074K372246L512726M230995K417679L261871K758484M641953L449249
1682.9D55204277j910210N647049M643441O116027L665924L372651L774948L582229
1690.6D84096336M457169L842544M351845L758812L776398L69415N139084O010208
1698.3E15801811M502259J112823m00620P745362N187111L335075J999283K689133
1706E41972237L305893L281288L600273J799698J540260K331047K050858J688881l8529
1714.7E61531906J025391L419151J681442k709961L874169L225250K148666J558533
$$ plain form
1659.7 389610176 391259117 392275581 393771324 393881416 398243599 400980835 403461800 405842209
1667.4 405842209 408037529 410261917 411752930 415741234 417599831 422199821 426211014 428559074
1675.1 428559074 430931320 434444046 438675041 441092720 444354591 447113075 451755028 455204277
1682.9 455204277 453294067 458941116 463584557 469700584 473366508 476739159 480514107 484096336
1690.6 484096336 488553505 492396049 496747894 500506706 504283104 504652519 509791603 515801811
1698.3 515801811 520304070 521416893 521016273 528761635 533948746 537283821 539283104 541972237
1706 541972237 545278130 548559418 552159691 553959389 555499649 557830696 559881554 561570435 561531906
1714.7 561531906 562557297 565976448 567657890 564947929 568822098 572047348 574196014 575754547
1722.4E75754547J91078Q35724J835289J506081J200218J559372J383133n96695Q80318
1731.1E84549065K749672J607284l084755j669731N403404L786011K002792K223359
1738.8E97567101j78681K72560M172440K312507L32146J835594L016053K033424R95979
1747.5F12359123J611672K502937M427490J738167J533546M377556K956620K572174
1755.2F34079285J998291l8147K196121K880707K266845K587128j221619M84696L576507
1763.9F48809814J891633J716308J584320Q26721j507187J962739K868118j516495
1771.6F56635971j139908J101151L813095J625213k57797K249756N65491P82928L03498
1780.3F65679398j83564J278382J354980J148453m63486L80936J571579J144256L86658
$$ plain form
1722.4 575754547 575945625 576781349 578616638 580122719 581322937 582882309 584265442 583668747 584549065
1731.1 584549065 587298737 588906021 585821266 584151535 589554939 593340950 595343742 597567101
1738.8 597567101 597388420 597660980 601833420 604145927 604478073 606313667 609329720 611363144 612359123
1747.5 612359123 613970795 616473732 620901222 622639389 624172935 628550491 631507111 634079285
1755.2 634079285 636077576 636039429 638235550 641116257 643383102 645970230 644748611 645233307 648809814
1763.9 648809814 650701447 652417755 654002075 654828796 653321609 655284348 658152466 656635971
1771.6 656635971 655496063 656597214 660410309 662035522 661777725 664027481 664592972 665375900 665679398
1780.3 665679398 665495834 666774216 668129196 669277649 668814163 669195099 670766678 671910934 672297592
1788.9F72297592J003418R5291l92532q12607m730K990875Q09097N1880J531830J128235
1798.6F78698349m34723j013260J742707J16119Q33130J433868N17807R03244K49024
1807.3F83046265M88891P41349Q36257p41195L93219J221161M77447R70993L2959K81220
1816.9F87748566k02561R17740J130982j09024R94186l9139M64478L44925j735077
1825.6F89515076M80575J435013R76257p53097k093353J500320K638931N08576J22452
1834.3F94330750L71551J29166r9030n24521J306153M01687J36643K36129P98722N15060
1843.9F97602310l995590J993027J860046j11847J09558O36368Q78067J02921K89383
1852.6F99364243j93558O65436L11355k96936K85416p9575L70865j0986L47137k41394
$$ plain form
1788.9 672297592 673301010 673396301 673003769 672191162 672186432 675177307 675986404 676038284 677570114 678698349
1798.6 678698349 678263626 677250366 678993073 679109192 679942322 681376190 681893997 682797241 683046265
1807.3 683046265 683535156 684276505 685112762 684371567 684764786 685985947 686463394 687434387 687467346 687748566
1816.9 687748566 687546005 688463745 689594727 689485703 690479889 690440750 690905228 691250153 689515076
1825.6 689515076 689995651 691430664 692406921 691653824 689560471 691060791 693699722 694208298 694330750
1834.3 694330750 694702301 694831467 694732437 694207916 695514069 695915756 696052399 696288528 697087250 697602310
1843.9 697602310 693606720 695599747 697459793 697347946 697457504 698093872 698971939 699074860 699364243
1852.6 699364243 699170685 699836121 700147476 699850540 700135956 700056381 700427246 700416260 700763397 700522003
1862.2G00522003J62125O83594J50833L94211p69501K93350r69696j018372J472779
1870.9G00921326J080856O48727J01242L49274k78854L36685N15976K38724L34854
1879.6G04248810l80783K90222k79770K2354J4191m1199N04608l586P25022l35007
1889.2G04764862j093979N17655P22503j58157k89002l61480j48239J382522M52194
1897.9G05788879K40250M7150j03455L55301j68228o11q63800r689M73480p5760j94702
1908.5G05488815k28500M99115K56348Q84628q6365l88870j13449L9520P30820j962052
1918.2G05120010l14102J211853P32880M08096j035690k17743O68564O54297j70975
1926.8G07057190k72904l83529j11389M84237R3537O3400k64740L63846j0147k14691
$$ plain form
1862.2 700522003 700684128 701367722 701518555 701912766 701143265 701436615 700466919 699448547 700921326
1870.9 700921326 702002182 702650909 702752151 703101425 702822571 703159256 703675232 703913956 704248810
1879.6 704248810 703868027 704158249 703878479 703900833 703915024 703873825 704378433 704374847 705099869 704764862
1889.2 704764862 703670883 704188538 704911041 704752884 704463882 704102402 703954163 705336685 705788879
1897.9 705788879 706029129 706076279 705972824 706328125 706159897 706159286 705295486 705285797 705759277 705683517 705488815
1908.5 705488815 705260315 705759430 706015778 706900406 706814041 706425171 706311722 706351242 707082062 705120010
1918.2 705120010 704805908 706017761 706750641 707158737 706123047 705905304 706573868 707228165 707057190
1926.8 707057190 706784286 706400757 706289368 706773605 706867142 706930542 706665802 707029648 707019501 706804810
1936.5G06804810j72120l07846L31269j99738M87290o42472j058197R39942L44848
1945.2G06527786L3570j37558P7056k00805j4801k1286k98310J8616R8801K42767m51279
1955.8G05874557k0904l57971k39716N67398j71280j15051j40152L33786j59073m54483
1965.4G05117111j21307o35071J3809N13458O11420l22952k37122n3863j96533M87518
1975.1G05176468M5395l357j47705j37329j26953p8202o2256j09405K40250l52707
1984.7G04444199k77176k75879J42364k2278m35562N03922R92l85819k05078M32053
1994.3G03921738R5596n24902j32752l83911p5912k28119O1111J51901R9793J86310
2004G03170853m12522k6245k05231l00293m56237l50724M3946L9825R2392j16424N69381
$$ plain form
1936.5 706804810 706632690 706324844 706656113 706456375 706943665 706301193 705242996 706182938 706527786
1945.2 706527786 706561356 706423798 706500854 706300049 706285248 706263962 705965652 705984268 706083069 706325836 705874557
1955.8 705874557 705853653 705495682 705255966 705823364 705652084 705537033 705396881 705730667 705571594 705117111
1965.4 705117111 704995804 704360733 704374542 704888000 705499420 705176468 704939346 704885483 704688950 705176468
1975.1 705176468 705221863 705218506 705070801 704933472 704806519 704728317 704666061 704556656 704796906 704444199
1984.7 704444199 704167023 703891144 704033508 704011230 703575668 704079590 704080582 703694763 703489685 703921738
1994.3 703921738 704017334 703492432 703359680 702975769 702899857 702671738 702732849 702884750 702984543 703170853
2004 703170853 702758331 702732086 702526855 702226562 701770325 701419601 701463547 701503372 701595764 701479340 702048721
2014.6G02048721J16883n85938o08673l91006k69471l52859K09656j05362L87039L71704
2024.2G00820694m9057m0207o23016m73633n62897J50452j38931n04075J94092Q8349
2033.9F98861771R2239N0888L06702l51486l35083l25928p55387j10931N798J24970
2043.5F97563553l18070J39313M20227o332j145k15988k47268m88282J99662l71476
2053.2F96674194m17785L66211O8893J75095k66037K87780j76391m19388m0283n66330
2062.8F95685959k07367m47846L41568M05426P3395L10288j38397N7754Q4763m6921
2072.5F96118622o81076m76151l0670J4420Q8958J36643M62265j63345n7450k33993
2082.1F95178223l03879j30081m62570k40632m81796R1095L39432J77383j90811j23138
$$ plain form
2014.6 702048721 702165604 701579666 700970993 700579987 700310516 699957657 700167313 700061951 700448990 700820694
2024.2 700820694 700771637 700731430 700108414 699634781 699071884 699222336 699083405 698579330 698773422 698861771
2033.9 698861771 698954010 699004898 699311600 698960114 698625031 698299103 697543716 697432785 697438583 697563553
2043.5 697563553 697245483 697384796 697805023 697798691 697797546 697581558 697334290 696846008 697045670 696674194
2053.2 696674194 696256409 696622620 696691513 696866608 696600571 696888351 696711960 696292572 696252289 695685959
2062.8 695685959 695478592 695030746 695372314 695777740 695851135 696161423 696023026 696080780 696165543 696118622
2072.5 696118622 695437546 694961395 694930725 694945145 695034103 695170746 695633011 695469666 695412216 695178223
2082.1 695178223 694874344 694744263 694281693 694041061 693559265 693650360 693989792 694167175 693976364 693853226
2091.7F93853226K23694m61884j39008j17340l3874l93906k11639N67398j44043j18866
2101.4F93023758k91977R7198J05286n11017l79333K4185M27933l15934M273J26190
2111F92310562k37350k64817j66473N5161k98691K63748N875k24457m06037m07562
2120.7F90629959J40457m2419M72717J1139j21918l87878n18570M48074J11923l2196
2130.3F90711288L281L47138j65558m69208J15738k63062j82800J48392L48587m1275
2140F90552521J37558R8266k27508N3863k26669j58157l50800M6692K13623L64914
2149.6F90504303K65884n95169K06681L16696M654m17404m03595P019j52054M22210
2159.3F90159225K4415j84174J87683N05753M58145J25046m4327n40924m12217l38668
$$ plain form
2091.7 693853226 694076920 693615036 693476028 693358688 693324814 692930908 692719269 693286667 693142624 693023758
2101.4 693023758 692731781 692828979 692934265 692423248 692043915 692068100 692496033 692180099 692184372 692310562
2111 692310562 692073212 691808395 691641922 691697083 691398392 691662140 691668015 691443558 691037521 690629959
2120.7 690629959 690770416 690727997 691200714 691211853 691089935 690702057 690183487 690631561 690743484 690711288
2130.3 690711288 690714569 691061707 690896149 690426941 690542679 690279617 690096817 690245209 690593796 690552521
2140 690552521 690690079 690788345 690560837 690614700 690388031 690229874 689879074 689925766 690139389 690504303
2149.6 690504303 690770187 690175018 690381699 690698395 690703049 690285645 689882050 689889069 689737015 690159225
2159.3 690159225 690183640 689999466 690187149 690692902 691151047 691276093 691231766 690690842 690278625 689939957
2168.9F89939957K47268J96610K8992L16085J5946Q0261j55029M03671j35345o96259
2178.5F90242157p2937k0142K85035J19705K00500r5978L57361N03311j01318j8082
2188.2F91399612n18646r4375l96576j37177K60391J94779Q27331J85089J94474m61808
2197.8F91453094o41708j75552l97949m8829N2643N78079L15400K88162N76172N11169
2207.5F92510681L15247k94266m62799o52847j5717j34888m12063K5177O13556Q80279
2217.1F92372360o1798q2016k61993k31629k75802m98047N1040J60981L67355j69754
2226.8F91370697L3188N40237L99018M043n23529l11355k79694O3324j19782J94169
2236.4F91370316K57720k51770K86637K71988J30615k89612P6k90603n03998K56195
$$ plain form
2168.9 689939957 690187225 690383835 690412827 690728912 690744858 690825119 690670090 691073761 690938416 690242157
2178.5 690242157 690169220 690149078 690434113 690553818 690754318 690658340 691015701 691519012 691417694 691399612
2188.2 691399612 690880966 690786591 690390015 690252838 690513229 690708008 691535339 691720428 691914902 691453094
2197.8 691453094 690811386 690635834 690237885 690189056 690241699 690819778 691135178 691423340 691999512 692510681
2207.5 692510681 692825928 692531662 692068863 691416016 691400299 691265411 690853348 690878525 691492081 692372360
2217.1 692372360 692310562 692228546 691966553 691734924 691459122 690961075 691012115 691173096 691540451 691370697
2226.8 691370697 691403885 691944122 692343140 692347183 691823654 691512299 691232605 691295929 691176147 691370316
2236.4 691370316 691628036 691376266 691662903 691934891 692065506 691775894 691775970 691485367 690981369 691237564
2246F91237564J87454L06244n56335k09656L56140l3493j80359n04455K3117k49481
2255.7F90376740j11084l357n0736K58789J31836r0866l05252M54788j86157m08020
2265.3F90066681k14539l21960J93863m07028J48315O37970L77808l21808k62223J83793
2275F90080872l77503n1956l12805J98746L80325o2943j30233j88599L02734k72903
2284.6F89565735j91269k27432k65045o64597n45349J80282q18252n15289p07474j30539
2294.3F85680771l2120n07049K3193n18265J14975q22067o64215o90308j112671k5253
2303.9F81446991o66657k62069j510697j145172m14352m31824R4605j362687m38461
2312.6F75309677j474762o37512q5983j696625o86035j192932r12247k131653j362839
$$ plain form
2246 691237564 691425018 691731262 691174927 690965271 691321411 691287918 691107559 690603104 690626221 690376740
2255.7 690376740 690265656 690262299 690211563 690470352 690602188 690511322 690206070 690660858 690474701 690066681
2265.3 690066681 689852142 689530182 689724045 689317017 689465332 690103302 690481110 690159302 689897079 690080872
2275 690080872 689703369 689651413 689338608 689537354 689917679 689854736 689724503 689535904 689838638 689565735
2284.6 689565735 689374466 689147034 688881989 688217392 687672043 687852325 687034073 686518784 685811310 685680771
2294.3 685680771 685648651 685141602 685164795 684646530 684761505 683939438 683275223 682584915 681472244 681446991
2303.9 681446991 680780334 680518265 679007568 677862396 677448044 677016220 677110825 675748138 675309677
2312.6 675309677 673834915 673197403 673111420 671414795 670728760 669535828 668623581 666491928 665129089
2321.3F65129089m55169j121292l70026o77948m19846j695709o47735j461564j204757
2329.9F57075043j48087o09283J506653m36554l51487j920242j510544N09796p55081
2338.6F53360214J89667j025009P1564m38920N94407J510238J043930K154999J951294
2347.3F59412384L790512P05109k714463l051910l153381k076721k388459k924041
2355F47599030l495942k704315j661644o94046p0076k55470R44748M68712K070617
2363.7F42201614R56498J020965K100754J235199J743698J261673J392365J390457
2371.4F53303223K941513K741699K050247K743988K751160K304230O10504J076584
2379.1F70523148J677093J236725J248245J474686J162948M41361Q62884P76444O77566
$$ plain form
2321.3 665129089 664673920 663552628 663182602 662504654 662084808 660389099 659741364 658279800 657075043
2329.9 657075043 656926956 656317673 657824326 657387772 657036285 655116043 653605499 654115295 653360214
2338.6 653360214 653549881 652524872 652596436 652157516 652751923 654262161 655306091 657461090 659412384
2347.3 659412384 663202896 663908005 661193542 658141632 654988251 652911530 650523071 647599030
2355 647599030 644103088 641398773 639737129 639043083 638973007 638717537 639662285 640130997 642201614
2363.7 642201614 643158112 644179077 646279831 647515030 649258728 650520401 651912766 653303223
2371.4 653303223 656244736 658986435 661036682 663780670 666531830 668836060 669446564 670523148
2379.1 670523148 672200241 673436966 674685211 676159897 677322845 677764206 678627090 679403534 680081100
2387.8F80081100R0867p46232q46786n21698J58615k08206j7700j90659K43530Q06656
2397.4F78849487j75094l32871o22940m59061p36923n26733p6218l18374N12390K17209
2407.1F76330872L8147q0262k81753m06342p64770m24805l87192L9292j78910m9820
2416.7F73834457K57264k32544k71988k89078O5231n4245k68173o68564o09665k29110
2426.4F71533585k02179j14289o41784M3487R3994k11486j68992o86264j75857k94876
2436F69175339p8888n5771n47409j80435j39923m4022j14365k71453k46659k85797
2445.7F67210617m75769l80936l31268m5242J76620n18951n52063m16489J74561J71432
2455.3F65012512m53872k89155m97055k55737l74756l90320m24804l07846L14407k85492
$$ plain form
2387.8 680081100 680171967 679425735 678578949 678057251 678215866 678007660 677989960 677799301 678042831 678849487
2397.4 678849487 678674393 678341522 677718582 677259521 676522598 675995865 675919647 675601273 676113663 676330872
2407.1 676330872 676369019 676288757 676007004 675600662 674835892 674411087 674023895 674063187 673884277 673834457
2416.7 673834457 674091721 673859177 673587189 673298111 673363342 673309097 673040924 672372360 671762695 671533585
2426.4 671533585 671331406 671217117 670575333 670618820 670712814 670501328 670332336 669646072 669470215 669175339
2436 669175339 669096451 669040680 668493271 668312836 668172913 668128891 668014526 667743073 667496414 667210617
2445.7 667210617 666734848 666353912 666022644 665977402 666154022 665635071 665083008 664666519 664841080 665012512
2455.3 665012512 664558640 664269485 663772430 663516693 663141937 662751617 662326813 662018967 662333374 662047882
2465F62047882m10461n66941m97055l9673q9263j39084l76969j39007k75727n43518
2474.6F58970184l53470q1710k76566l69491j53733k82287k35443p62787o57425l65067
2484.2F55432205j48392M5472m69284k01645k78473R8877r1553q07419l11050m27933
2493.9F52840805n67932n54657l80325n08652r4681K22168m47464k44675j80282q6365
2503.5F49997940o01425q23517m33350n27420j79519l48511l28751j68838K0065k10037
2513.2F46396637m71954k84272n86929k37427m16259l79181m6158l51792n04760j53199
2522.8F42964706M96827l36228o04935l79486m60968l11355m64020k67258l73916P1335
2532.5F40334702k289n09301n99136n70183J14861k31362n25207o00510n17654m4785
$$ plain form
2465 662047882 661637421 661070480 660573425 660533752 660444489 660305405 659928436 659789429 659513702 658970184
2474.6 658970184 658616714 658535004 658258438 657888947 657735214 657452927 657217484 656454697 655797272 655432205
2484.2 655432205 655283813 655329285 654860001 654658356 654379883 654478760 654387207 653579788 653268738 652840805
2493.9 652840805 652272873 651718216 651337891 650829239 650734558 650956726 650509262 650264587 650084305 649997940
2503.5 649997940 649396515 648572998 648139648 647612228 647432709 647084198 646755447 646586609 646606674 646396637
2513.2 646396637 645924683 645640411 645053482 644816055 644399796 644020615 643974457 643622665 643117905 642964706
2522.8 642964706 643461533 643125305 642520370 642140884 641679916 641368561 640904541 640637283 640263367 640334702
2532.5 640334702 640332413 639823112 639223976 638653793 638768654 638537292 638012085 637411575 636893921 636849136
2542.1F36849136j10397m0092j11428j72996m68598o01120l95851M6997R1782n99442
2551.7F34487991n26161l72505k29988j08948L4828j54037n38559m78974q31718m67491
2561.4F30814438k39983l73497k04353K0142K68592m02641p13119m57497j44348l19367
2571F28248367o52618m30489k45475L3760j69640j23215n417o3476l08533r11941n37529
2581.6F24833794j38398j16500l16163m26597l16239l48815j94092j99242j80817j81312
2591.3F22415619l31078p60002m93126K14196j9379n72128o88858k00196l06358k77710
2600.9F18980980k93617o59104k28500p4959j91269p59315o34194k49786o33011l00941
2610.6F14956284Q8234P4882m68903l34930R9792m15000o25687l26195k29797m39186
$$ plain form
2542.1 636849136 636738739 636698647 636587219 636414223 635945625 635344505 634948654 634995651 635087433 634487991
2551.7 634487991 633961830 633589325 633359337 633250389 633285217 633131180 632592621 632113647 631281929 630814438
2561.4 630814438 630574455 630200958 629996605 630016747 630285339 629882698 629169579 628712082 628567734 628248367
2571 628248367 627595749 627165260 626919785 626953545 626783905 626660690 626655273 626591797 626283264 625371323 624833794
2581.6 624833794 624695396 624578896 624262733 623836136 623519897 623171082 622976990 622777748 622596931 622415619
2591.3 622415619 622084541 621324539 620831413 621045609 621026230 620454102 619765244 619565048 619258690 618980980
2600.9 618980980 618687363 618028259 617799759 617724800 617533531 616774216 616140022 615890236 615257225 614956284
2610.6 614956284 615044518 615119400 614650497 614315567 614415359 614000359 613374672 613048477 612818680 612379494
2620.2F12379494m03366q38700m74510J30386n51185m10958j83906n23300p77474o01692
2629.9F07744789k31666m9630l72581q19473n12734m06990J96991J61171m97398m31404
2639.5F04781075m13361j30119n50843o78405m51889k03820q1749l67508J2398m84886
2649.1F01430893o95763n19828m14773j48849n44167l33061j94092q7242l35540o96564
2658.8E97461014k36778J97334J4000q54950r28269m67109J70326M0436o97136m86565
2668.4E94212303n9814J07574k15111q7623m86069p48100j26229k29835k7428j03836
2678.1E92235832j57547j78261k39715k14081p67975o40182m08554l44468l21235j78032
2687.7E88785782l41988m68597J9493j13106j43852l15094j47781j67351o42586k84195
$$ plain form
2620.2 612379494 611976128 611137428 610662918 610793304 610242119 609831161 609647255 609123955 608346481 607744789
2629.9 607744789 607513123 607463493 607090912 606271439 605758705 605351715 605548706 605709877 605212479 604781075
2639.5 604781075 604367714 604237595 603686752 603008347 602556458 602352638 602270889 601903381 601915779 601430893
2649.1 601430893 600735130 600215302 599800529 599651680 599107513 598774452 598580360 598493118 598157578 597461014
2658.8 597461014 597224236 597421570 597435570 596580620 595652351 595185242 595355568 595396004 594698868 594212303
2668.4 594212303 594152489 594260063 594044952 593957329 593471260 592723160 592596931 592367096 592339668 592235832
2678.1 592235832 592078285 591900024 591660309 591446228 590678253 590038071 589629517 589285049 588963814 588785782
2687.7 588785782 588443794 587975197 587994690 587881584 587737732 587422638 587274857 587107506 586464920 586180725
2697.4E86180725n3100J40037l10173n09872m49562l99094J24664m52843n26199j18523
2707E83626060k60238l06740m25720m64020j57204P0458k11029j25923q8959l18642
2716.6E81338043n87005l96233M2648j62735J2894j87759l55721k23846o31409l64990
2726.3E78483887J32103m2763j67809p6179o79398o37550k67L7041k00501m47159J01967
2736.9E76503372o5155m92859l64151j56440L39202j87721m25987k2965j45263k50969
2746.5E74731064j58348m21791l99437q965k75230N3940n9853m79240l08075l88985
2756.2E72285080j2589k76527l49655J52740P6485j72310l61748l54728m15344j87531
2765.8E70383873k6016O2599k19460m89959l08152m70962j56365M0665p8163l55682
$$ plain form
2697.4 586180725 586127625 586267662 585957489 585447617 584998055 584598961 584723625 584270782 583744583 583626060
2707 583626060 583365822 583059082 582633362 582169342 582012138 582082596 581871567 581745644 581656685 581338043
2716.6 581338043 580751038 580354805 580397453 580234718 580247612 580059853 579704132 579480286 578848877 578483887
2726.3 578483887 578615990 578573227 578405418 578329239 577649841 577012291 577012024 577049065 576848564 576401405 576503372
2736.9 576503372 576438217 575945358 575581207 575424767 575763969 575576248 575150261 575127296 574982033 574731064
2746.5 574731064 574572716 574150925 573751488 573742523 573467293 573521233 573461380 572982140 572674065 572285080
2756.2 572285080 572272491 571995964 571646309 571799049 571875534 571703224 571341476 570986748 570571404 570383873
2765.8 570383873 570357857 570420456 570200996 569711037 569402885 568931923 568775558 568816223 568738060 568382378
2775.5E68382378m35143l84407q96377o31943k72866k29110j62773j73722k02293j93062
2785.1E64800682j19324l87497k34298j07651l39737p89642p75833m64249m92249M9630
2794.8E61139832j24550k59858l08609p99827n19333o29463r30939p17392k82860n14488
2804.4E56052513j59645L34969p64504q54835k28157l71094r61685r51233o45333o56700
2814E50794296k82707o40297p45849l26577l30353n38673o68526m77523p76406r84421
2823.7E45022964q33320l57094j22337m86222o42738p14226o90918p99293r61571j313858
2833.3E38101387j019325n49050p78045n92690r34219j411171j664353j604347j109733
2842E28438454j396447j771926j892930j664543j524238j794205j682472j570511j931496
$$ plain form
2775.5 568382378 567947235 567562828 566666451 566034508 565761642 565532532 565369759 565196037 564993744 564800682
2785.1 564800682 564681358 564293861 564059563 563951912 563612175 562822533 562046700 561582451 561090202 561139832
2794.8 561139832 561015282 560755424 560446815 559646988 559127655 558498192 557567253 556849861 556567001 556052513
2804.4 556052513 555892868 556227837 555463333 554608498 554380341 554009247 553047562 552096329 551450996 550794296
2814 550794296 550511589 549871292 549125443 548798866 548468513 547929840 547261314 546783791 546007385 545022964
2823.7 545022964 544189644 543832550 543710213 543223991 542581253 541867027 541176109 540376816 539415245 538101387
2833.3 538101387 537082062 536533012 535754967 535162277 534228058 532816887 531152534 529548187 528438454
2842 528438454 527042007 525270081 523377151 521712608 520188370 518394165 516711693 515141182 513209686
2850.7E13209686j787300j070900r44786m04587O9428n28374m65965N09834N91431
2859.4E09178467o0463m0665j20277q7281n8631j84861k31552q99925r44672o14128
2869E05936012m98543o53877p35779k13165q6250l20511l31535k62185q54873n89295
2878.7E01389999L891l06129n71556j150551n71175m37431r43489n34935p86858r40704
2888.3D95151062p66792j79863m86222j206207j030235j016846n17692q02536j050110
2897D88094559p88956j026306o27976m34799m29764n06744p29103o99349j117019j250687
2906.6D80483856n76439n69420r17358q31337r91096j460762k056199j679687j380920
2915.3D70020638j652070j525154j641731j243248j027946j028290j149788j193352
$$ plain form
2850.7 513209686 511422386 510351486 509406700 509002113 509071541 508543167 508077202 508587036 509178467
2859.4 509178467 509118004 509077339 508957062 508869781 508811150 508626289 508394737 507494812 506550140 505936012
2869 505936012 505437469 504783592 504047813 503834648 503748398 503427887 503096352 502834167 501979294 501389999
2878.7 501389999 501393890 501087761 500516205 499365654 498794479 498357048 497413559 496878624 496091766 495151062
2888.3 495151062 494384270 494204407 493718185 492511978 491481743 490464897 489947205 489144669 488094559
2897 488094559 487305603 486279297 485651321 485216522 484786758 484280014 483550911 482851562 481734543 480483856
2906.6 480483856 479907417 479337997 478420639 477589302 476598206 475137444 473081245 471401558 470020638
2915.3 470020638 468368568 466843414 465201683 463958435 462930489 461902199 460752411 459559059
2923D59559059m96292k83012Q4343O3819M01917O37245j94588N7793M15192N83725
2932.7D60829201M81910M35830O17942M66347P71141R73053J028061P83272Q00247
2941.3D67187004J014290R13963P75223K68669N04646Q66547L57399K1134L29322M18587
2951D72656784L90015L91502M8790J91345K14501L71322N68810N77965O37970L66096
2960.6D76415100N53551L17650M99725Q66966N99442J119499J170692P33643O80580
2969.3D82956848O67915K95640K94837N63546N42907Q91533P64809O35414Q95653Q80661
2979D89389763M37469l1471k5291j82648m39720q621R36470N40580J49117L22533j26648
2989.6D90961533L66821M93622J24855k59819o77338k44217J78642K96631j83067m59938
$$ plain form
2923 459559059 459062767 458779755 458864098 458927917 459329834 459967079 459772491 459830284 460245476 460829201
2932.7 460829201 461311111 461746941 462364883 462831230 463602371 464575424 465603485 466386757 467187004
2941.3 467187004 468201294 469115257 469890480 470159149 470663795 471530342 471887741 471908875 472238197 472656784
2951 472656784 473046799 473438301 473487091 473678436 473892937 474264259 474833069 475411034 476049004 476415100
2960.6 476415100 476968651 477286301 477786026 478652992 479252434 480371933 481542625 482276268 482956848
2969.3 482956848 483624763 483920403 484215240 484778786 485321693 486213226 486978035 487613449 488509102 489389763
2979 489389763 489827232 489795761 489770470 489587822 489148102 489139481 490075951 490616531 490765648 491088181 490961533
2989.6 490961533 491328354 491821976 491946831 491687012 491009674 490765457 490944099 491240730 491057663 490597725
2999.2D90597725m44641k67563j79939n17159n35621o38314j94931j48620m39301n66177
3008.8D86665459q77838r3384M9515m87710m57305k82822k74811q16498r94148n28297
3018.5D81902161l78113m97360j12992m45862n86166l0823p90939j150017n80978j59416
3028.1D77169495r9907k47879n09110r75494o02036l49884n68123q44459j125794p35588
3037.8D71111221m33769m60968l42750m38195o39724p06215q26645m75045j38053m35029
3047.4D66214828r15679j066170o00090o47927o38008n10673p47872n40428p98874
3056.1D59749107j046028n27191k91023p15866o74515l17268m94423l88375m51316
3064.8D54843102o29044n20668k86255n37033r19685n35164p55310o89011m37202q03071
$$ plain form
2999.2 490597725 490153084 489885521 489705582 489188423 488652802 488014488 487819557 487670937 487231636 486665459
3008.8 486665459 485787621 485694237 485743752 485256042 484798737 484515915 484241104 483424606 482430458 481902161
3018.5 481902161 481524048 481026688 480913696 480467834 479881668 479850845 479059906 477909889 477328911 477169495
3028.1 477169495 477069588 476821709 476312599 475337105 474735069 474385185 473817062 472972603 471846809 471111221
3037.8 471111221 470677452 470216484 469873734 469435539 468795815 468089600 467262955 466787910 466649857 466214828
3047.4 466214828 465299149 464232979 463632889 462984962 462346954 461836281 461088409 460547981 459749107
3056.1 459749107 458703079 458175888 457884865 457168999 456494484 456177216 455682793 455294418 454843102
3064.8 454843102 454214058 453693390 453407135 452870102 451950417 451415253 450659943 449970932 449533730 448730659
3074.4D48730659n24940j56555K9068k83127r34525r74426m89044l34663n02396p55539
3084.1D43804512r25674m59938l52707m25606n25704m18930L357m88853j017456r25102
3093.7D38267899k82021n42412r53750l95585o44683m65851m56886q85087n69801n09910
3103.4D32561913n36843m35905j71776l38554r16405j017990o96335m87671k11639
3112D27748795m11911j303368n86586L357p89223p36313m75044l42445m95911r08432
3121.7D21702919r18617p86438m54712k41394q65402r34830l64761q20237j010475
3130.4D15306053o05392m69055n66216m62036r5062n07317r42459q15048n08538l91388
3140D09943542p00607q95271q51402j072503r09881J05629l83301j081009p43065n52253
$$ plain form
3074.4 448730659 448205719 448049164 448078232 447795105 446860580 445886154 445397110 445062447 444560051 443804512
3084.1 443804512 442878838 442418900 442066193 441640587 441114883 440695953 440699310 440210457 439193001 438267899
3093.7 438267899 437985878 437443466 436489716 436094131 435449448 434983597 434526711 433641624 433071823 432561913
3103.4 432561913 432025070 431589165 431417389 431078835 430162430 429144440 428448105 427960434 427748795
3112 427748795 427336884 426033516 425446930 425450287 424661064 423924751 423449707 423107262 422611351 421702919
3121.7 421702919 420784302 419997864 419543152 419301758 418436356 417501526 417136765 416316528 415306053
3130.4 415306053 414700661 414231606 413665390 413203354 413108292 412600975 411658516 410843468 410334930 409943542
3140 409943542 409242935 408347664 407496262 406423759 405513878 405619507 405236206 404155197 403412132 402859879
3149.6D02859879J06353m53491j216545j109962r05190o06537p74536n81207o91757
3158.3C96627007o28434n37872n80215l42446r59625p77626p02934q43773n53589j086350
3168C89614143o71424k76261p83157q12264r39178r81827n93491m80461l80478m24232
3177.6C83271370p43141o18897n90057n46570n91736q03528r45892q92258k50663o55899
3187.3C76632729r51004l38135o48117n36957k85378j033783q86688k91443p26165
3195.9C70935059p78809m96902n57328p31544q32558n12314n93719m52080k29645l94745
3205.6C65355415l91616n47867l53241m46587q51211p73468l66250j74369n91851p47947
3215.2C60111008n12467l08342o96563q97751n04723k37045l95622p91817j69182p3204
$$ plain form
3149.6 402859879 402966232 402512741 401296196 400186234 399281044 398674507 397899971 397318764 396627007
3158.3 396627007 395998573 395460701 394880486 394538040 393578415 392800789 392097855 391254082 390700493 389614143
3168 389614143 388942719 388666458 387883301 387071037 386131859 385150032 384556541 384076080 383695602 383271370
3177.6 383271370 382528229 381909332 381319275 380772705 380180969 379377441 378431549 377539291 377288628 376632729
3187.3 376632729 375681725 375343590 374695473 374158516 373873138 372839355 371952667 371661224 370935059
3195.9 370935059 370156250 369659348 369102020 368370476 367537918 367025604 366431885 365979805 365750160 365355415
3205.6 365355415 364963799 364415932 364062691 363616104 362764893 361991425 361625175 361450806 360858955 360111008
3215.2 360111008 359598541 359290199 358593636 357695885 357191162 356954117 356558495 355766678 355597496 355524292
3224.9C55524292o33545p42340q77457m23965j94245m52995n76439k26631j96800m96369
3234.5C50703506n74760j171761j031188p1145L00522m88281p96127k44980l41950
3243.2C46283836l60412o66657p05452n78499o13250n40619n14412R2773j43928m53072
3252.8C41800308p64465o93779J84250n04112j012803p38182l17649j56594j87836
3261.5C37609138n1994o98089n21927o4774k50511n98297p31621j9340R6893m66690
3271.2C34302788n33371k43378m12636m07333j87836l67813m58183n05066k35062k10228
3280.8C30741882l02391m61998o78596k36931p4272o9428j58081k59361l99551m23050
3290.4C27678223N1460j50375o82831q34542l62663J92375j59530p04155l87154J98135
$$ plain form
3224.9 355524292 354890747 354148407 353270950 352846985 352652740 352199745 351623306 351396675 351199875 350703506
3234.5 350703506 350128746 348956985 347925797 347854652 348155174 347666893 346870766 346625786 346283836
3243.2 346283836 345923424 345256767 344551315 343972816 343359566 342818947 342304535 342397308 342253380 341800308
3252.8 341800308 341035843 340342064 340526314 340022202 339009399 338271217 337953568 337796974 337609138
3261.5 337609138 337557144 336859055 336337128 336272354 336021843 335423546 334691925 334672585 334769478 334302788
3271.2 334302788 333769417 333526039 333113403 332706070 332518234 332150421 331692238 331187172 330952110 330741882
3280.8 330741882 330439491 329977493 329298897 329061966 328987694 328918266 328760185 328500824 328101273 327678223
3290.4 327678223 327729683 327579308 326896477 326061935 325699272 325891647 325732117 325027962 324640808 324838943
3300.1C24838943k3078l11890m26865k41165j24893l07808j73264o48307q81348n43480
3309.7C21156845l43590l3188l4217m16069j117287o59008K96535M6883k74849l99647
3319.4C18222408k11944j59149p40815r91707q43696l43342l27663m57096J32541k69012
3329C14010525p39002p00551q10852l91445n88569q37441m43382o0768l27606p91207
3338.7C08319702l09715n20439p28989n38120n53456k56042k00863n1803m58012n46074
3348.3C04156189n36785p11804k39658m56371k76432J19686J54438o66809j142979
3357C00399475j57318k79255o3858j98288p51934q0318j02063k07843l4829j38816
3366.6B98384953p64561p26776j93425j28326O7082o19107o44359k86m06704n13878
$$ plain form
3300.1 324838943 324815865 324503975 324077110 323835945 323711052 323403244 323229980 322581673 321700325 321156845
3309.7 321156845 320813255 320780067 320745850 320329781 319212494 318553486 318850021 318896904 318622055 318222408
3319.4 318222408 318010464 317851315 317110500 316118793 315275097 314931755 314604092 314146996 314279537 314010525
3329 314010525 313271523 312570972 311760120 311368675 310780106 309942665 309499283 309438515 309110909 308319702
3338.7 308319702 308009987 307489548 306760559 306222439 305668983 305412941 305212078 305160275 304702263 304156189
3348.3 304156189 303619404 302907600 302667942 302211571 301935139 302054825 302209263 301542454 300399475
3357 300399475 300242157 299962902 299899044 299700756 298948822 298868504 298766441 298558598 298523769 298384953
3366.6 298384953 297620392 296893616 296700191 296571865 296638947 296019840 295375481 295375195 294968491 294454613
3376.3B94454613j28384k85702p7514P39841m8904q44021l53947k01111k32410k15797
3385.9B92806664o1837R5043Q5888l56636k66666K00214k89669o30092m05274J79730
3395.6B91357365J38721n52101k30103L73440N06935j36490o31484P1468J45397l95145
3405.2B90648003K50873M21524j32828j28059m28333m13342J69621O59847N23796j39103
3414.8B91431999n55973o11839q4343L89805M89464j48144l32165O71768O05488j6155
3424.5B91839905k53258M2057M03671M1828K4395N05066M02317L35484O08234O1226
3434.1B94010925M4613M27666K99797L13587L09982M64230J58501N7964r689l7518
3443.8B96040058N00469R22642J211643K13185K05841O60820J13563K06261L00617
$$ plain form
3376.3 294454613 294326229 294040527 293963013 294702854 294653950 293809929 293455982 293254871 293022461 292806664
3385.9 292806664 292744827 292839870 292925758 292569122 292302456 292502670 292213001 291582909 291177635 291357365
3395.6 291357365 291496086 290943985 290713882 291087322 291594257 291457767 290826283 290897751 291043148 290648003
3405.2 290648003 290898876 291320400 291187572 291059513 290631180 290217838 290387459 291047306 291571102 291431999
3414.8 291431999 290876026 290264187 290179844 290569649 291059113 290910969 290578804 291250572 291856060 291839905
3424.5 291839905 291586647 291628704 292032375 292074203 292098598 292603664 293005981 293341465 293949699 294010925
3434.1 294010925 294055538 294483204 294783001 295096588 295406570 295870800 296029301 296087265 296077576 296040058
3443.8 296040058 296540527 297463169 298674812 298887997 299093838 299754658 299868221 300074482 300375099
3452.5C00375099P40967M63257J84784P77874N79262L38897M20323M65831K39392M76265
3462.1C05061951R31377Q23021K94571M07314R15184L37239O89582J036511O35700
3470.8C11132450N93453M93850L99761M2267N14527J032524J341400J324539L91026
3479.5C17265797J0967O25133J207180J26305L55873J086235N19409N86815M37393
3488.1C22221107J077881J322785M32052L79715P64962R13009O83365Q17070Q83026
3496.8C29494972N35012Q74443J470413P47261K59590M98199J89324Q61130J019935
3505.5C35950279Q09670P57026J054688J030502K05307J173706Q95195M08287J144791
3514.2C43429451J079292O95038N15022J008797Q21190Q97140J169549J333503R63173
$$ plain form
3452.5 300375099 301116066 301579323 301764107 302541981 303121243 303460140 303880463 304346294 304585686 305061951
3462.1 305061951 305993328 306816349 307110920 307518234 308433418 308770657 309460239 310496750 311132450
3470.8 311132450 311725903 312219753 312619514 312661781 313176308 314208832 315550232 316874771 317265797
3479.5 317265797 317276764 317901897 319109077 319235382 319591255 320677490 321196899 321783714 322221107
3488.1 322221107 323298988 324621773 325053825 325433540 326198502 327111511 327794876 328611946 329494972
3496.8 329494972 330029984 330904427 332374840 333122101 333381691 333879890 334069214 334930344 335950279
3505.5 335950279 336759949 337516975 338571663 339602165 339807472 340981178 341876373 342284660 343429451
3514.2 343429451 344508743 345203781 345718803 346727600 347548790 348445930 349615479 350948982 351912155
3522.9C51912155k44865J062164J330528Q17070J203308Q21724N53093Q88214P71218
3531.5C59114609Q82606J806298J396637J681442P29675n58968J619225J500206Q87375
3540.2C69059105R20677J041794Q83140R44405J636047R02901J080284M31748J688995
3548.9C78589096J714439J099740J796531n15480J365280J692124J076469K299271
3556.6C89117470J454696J734009J051865M79355O86264J982040J500855R27887L181762
3565.3D02116203j78451O74782P17620K29187L615189J411858J711692K052651R80720
3574D13331451Q01583J431274K004357P45658K074242J457672J297875K407646J365280
3582.6D26917038Q53958J050301L686409J686172j380310K444496J281204K254296
$$ plain form
3522.9 351912155 351667290 352729454 354059982 354877052 356080360 356902084 357455177 358343391 359114609
3531.5 359114609 359997215 361803513 363200150 364881592 365611267 365052299 366671524 368171730 369059105
3540.2 369059105 369979782 371021576 371904716 372849121 374485168 375388069 376468353 376900101 378589096
3548.9 378589096 380303535 381403275 383199806 382684326 384049606 385741730 386818199 389117470
3556.6 389117470 390572166 392306175 393358040 393837395 394523659 396505699 398006554 398934441 402116203
3565.3 402116203 401937752 402612534 403330154 403559341 407174530 408586388 410298080 412350731 413331451
3574 413331451 414133034 415564308 417568665 418314323 420388565 421846237 423144112 425551758 426917038
3582.6 426917038 427770996 428821297 432507706 434193878 432813568 435258064 436539268 438793564
3590.4D38793564K372017K242050J068191L30849K534561R67446K158317K250176J279335
3599D53996506L280487J075210O07033K211228J908989K099304K610206J646843l89328
3607.7D69046478L634262J090317Q68111O725197J192817j185608L823204J59417L479042
3616.4D88833237L235435M5395K249641L64533Q45642K929192L121261K528153K809448
3625.1E06961937J892548K084465O153144K00539p281303M500084M716491M393082
3632.8E23620987J464806J47247L421554L895379K491073J056976K026482K731514
3640.5E40856018K564545J461181J278534K413483L083534N217209J53008k665596
3648.2E54361916M452858J11961j217499J101685N121917M543839M023437L449097
$$ plain form
3590.4 438793564 441165581 443407631 444475822 444806671 447341232 448308678 450466995 452717171 453996506
3599 453996506 457276993 458352203 458959236 461170464 463079453 465178757 467788963 469435806 469046478
3607.7 469046478 472680740 473771057 474639168 481364365 482557182 481371574 485194778 485354195 488833237
3616.4 488833237 492068672 492114067 494363708 494728241 495573883 498503075 501624336 504152489 506961937
3625.1 506961937 508854485 510938950 517092094 517292633 510011330 514511414 519227905 523620987
3632.8 523620987 525085793 525233040 528654594 532549973 535041046 536098022 538124504 540856018
3640.5 540856018 543420563 544881744 546160278 548573761 551657295 556874504 557027512 554361916
3648.2 554361916 558814774 558926735 557709236 558810921 563932838 568476677 572500114 575949211
3655.9E75949211o298408L350334N554695J698341J804009O15692K065201J662140
3663.6E86401215J523475J771393J089974L781127J804734p16286k50206m506149K674255
3672.3E93573532O760559P204476k880822j4914741N351448Q588409M792824k772941
3680F05702744L67088L574486K567520J226082m75998j41678L206024O221619n868988
3688.7F16378899l735962O253013m861374M83971M750519R23843K040253M39567o60057
3697.4F22012672J208077L43933J055527J434746m091416r02023M608040J523780L90320
3706.1F27583656J222992K139244J859322p683678K474633K921485q554229O669426
3713.8F28632851N019760r3460j39427J198730O44608k950173O18630M433822l320694
$$ plain form
3655.9 575949211 569650803 573001137 578555832 580254173 582058182 582673874 584739075 586401215
3663.6 586401215 587924690 589696083 590786057 594567184 596371918 595655632 595405426 590899277 593573532
3672.3 593573532 600334091 607538567 604657745 589743004 595094452 603682861 608475685 605702744
3680 605702744 606069832 609644318 612211838 613437920 612961922 612820244 616026268 622247887 616378899
3688.7 616378899 612642937 618895950 614034576 614518547 619269066 620192909 622233162 622672729 622012672
3697.4 622012672 623220749 623564682 624620209 626054955 621963539 621061516 625669556 627193336 627583656
3706.1 627583656 628806648 630945892 632805214 625121536 627596169 630517654 621963425 628632851
3713.8 628632851 633652611 633559151 633419724 634618454 635263062 632312889 632931519 637365341 634044647
3722.5F34044647l852272M323731O73027p44934j846123L09028L192521O33125M429817
3731.2F41162567k167969o981887O235122j191215o729088K987251L596764J062317
3738.9F37973862K017059K597046k914467K596550R077911j1423339j1070099J0558510
3746.6F39413033M826850L717423m380875q980179J0714798m414520o496887O356354
3754.3F40755997M761886K424393n027008K364731M795913p335128j107331L839264
3762F45472717J296616J73874L025360k453613m186478L576050M352340O09360p353973
3770.7F44512253P47070K680283L69415Q16040k26669P75223Q6517K018509l22876
3779.4F51455765p092896K473908K272873J111297K107621k550583p96967J214523
$$ plain form
3722.5 634044647 630192375 634516106 635189133 634444199 632598076 632907104 636099625 636732750 641162567
3731.2 641162567 638994598 632012711 638247833 637056618 630327530 633314781 636911545 637973862
3738.9 637973862 639990921 642587967 639673500 642270050 651347961 639924622 628854523 639413033
3746.6 639413033 644239883 647957306 643576431 634596252 645311050 640896530 634399643 640755997
3754.3 640755997 645517883 647942276 642915268 645279999 650075912 642740784 641633453 645472717
3762 645472717 646769333 646943207 649968567 647514954 643328476 646904526 651256866 651866226 644512253
3770.7 644512253 645259323 647939606 648309021 649125061 648898392 649673615 649760132 651778641 651455765
3779.4 651455765 644362869 646836777 649109650 650220947 652328568 649777985 648981018 650195541
3787.1F50195541Q02079K75421m84314O80771M21981K06223n40924M16870K436829
3795.8F54410477l521729m000091J686859L755035O375733m965592j1290130L307876
3803.5F45758438L409271M876557M905548q605652l772888M292145K225418J38702
3811.2F53227539m2877j58692N01099L829575k425766j1710129M612503N317841M752655
3819.9F57903748J190414j6591721K418595N455322K311630K285233p19681l567429
3827.6F50686111Q52509J984100K553940Q84247p386551J938171N757523n718536r17054
3836.3F50634460O875458p498855l661957O891022l600617K45514N448227j371307
3844F53961945k414246J760330O60858J05744J732330j491318P08466L870468o685257
$$ plain form
3787.1 650195541 650997620 651273041 650788727 651469498 651891479 652097702 651556778 651973648 654410477
3795.8 654410477 650888748 646888657 648575516 652330551 658706284 653740692 642450562 645758438
3803.5 645758438 649167709 654044266 658949814 650344162 646571274 650863419 653088837 653227539
3811.2 653227539 653184662 653025970 653527069 657356644 654930878 643220749 647833252 653151093 657903748
3819.9 657903748 659094162 642502441 644921036 650376358 652687988 654973221 654253540 650686111
3827.6 650686111 651538620 653522720 656076660 656960907 649574356 651512527 657270050 651551514 650634460
3836.3 650634460 657509918 650011063 646349106 653240128 649639511 649885025 655333252 653961945
3844 653961945 651547699 653308029 653968887 654074631 655806961 654315643 655024109 658894577 652209320
3852.7F52209320K306595j1621704J610794J0057297m45786j899643Q24890J143647
3860.4F54185410K260818l985825N30930N563278n365371n471802L024444M959717
3868.1F55701599N338440q851852q402329M600830O300965L416519q232651J613235
3875.8F51484756L960419p16629J511841L815155m912415o730117M651336L25241R27277
3884.5F54316864M834900j0710602J374817M338760M61808K904663j222916p333450
3892.2F48964844J529693L779374r43223K79465M74930J553955J133118p425766M835052
3900.9F54181442J926728n301514K462005l416366q73337J744690K091370K218322
3908.6F55033340k76565o84891l56750J046600j45340p17697J269226J589432l208084
$$ plain form
3852.7 652209320 654515915 642894211 644505005 654562302 654116516 652216873 653041763 654185410
3860.4 654185410 656446228 652460403 652991333 658554611 653189240 647717438 650741882 655701599
3868.1 655701599 661040039 652188187 643785858 648386688 654687653 658104172 649871521 651484756
3875.8 651484756 655445175 654728546 656240387 660055542 655143127 648413010 653064346 653389587 654316864
3884.5 654316864 659151764 648441162 649815979 654154739 654616547 657521210 656298294 648964844
3892.2 648964844 650494537 654273911 653330688 653610153 654085083 655639038 656772156 649346390 654181442
3900.9 654181442 656108170 650806656 653268661 649852295 648978958 650723648 652815018 655033340
3908.6 655033340 654756775 654071884 653715134 654761734 654616394 653898697 655167923 656757355 653549271
3917.3F53549271l182221M042359L9444l576355J696014J134720R12094j523438k351455
3926F50740433J602630J392746N57404j283341q9035J817551k124023o98700J266632
3934.6F53182297l19519O2713Q3313m92553K5634L14637P28454Q57544k006836o70166
3944.3F51765518Q55637k6627L16544j191483J090241j81351k714386K199326J220550
3953F53333969m20532k33307l17230J77002o63910N88455j93329M4785n3406j378403
3962.6F50884094J313172P41348n63812j57242j70288K05688M1199R4299N32608o637
3972.2F52914429n07584L38135p2632o19125J62658N47104l39508q11233M91409O31561
3981.9F52735214M3640l38745l93448l13186M93927R11865n05371l0060j68838o79932
$$ plain form
3917.3 653549271 650367050 654409409 654448853 650872498 652568512 653703232 654615326 653091888 650740433
3926 650740433 652343063 653735809 654293213 653009872 652920837 654738388 652614365 651915665 653182297
3934.6 653182297 652862778 652925491 653008804 652516251 652541885 652856522 653584976 654442520 652435684 651765518
3944.3 651765518 652621155 652594528 652911072 651719589 652809830 652628479 649914093 652113419 653333969
3953 653333969 652913437 652680130 652362900 652539902 651875992 652464447 652271118 652315903 652262497 650884094
3962.6 650884094 652197266 652938614 652374802 652217560 652047272 652252960 652294159 652388458 652921066 652914429
3972.2 652914429 652406845 652744980 652672348 652053223 652215881 652762985 652423477 651612244 652103653 652735214
3981.9 652735214 652778854 652440109 652046661 651733475 652227402 653139267 652633896 652603836 652434998 651755066
3991.5F51755066R7122M23508Q0643j281739K86560J228257L40576J13067o4697
4000.2F52978363
$$ plain form
3991.5 651755066 651852188 652275696 652356339 651074600 651361160 652589417 652929993 653043060 652978363
4000.2 652978363
##END=$$ End of the data block
