##TITLE=$$ Begin of the data block
##JCAMP-DX=5.00 $$ ACD/SpecManager v 10.08
##SPECTROMETER/DATA SYSTEM=Varian
##DATE=08 Jan 2013 15:50:46
##DATA TYPE=INFRARED SPECTRUM
##DATA CLASS=XYDATA
##ORIGIN=
##OWNER=
##NPOINTS=3735
##FIRSTX=399.26403809
##LASTX=4000.35498047
##MAXX=4000.35498047
##MINX=399.26403809
##MAXY=75.27165985
##MINY=19.97457695
##XFACTOR=1.0000000000
##YFACTOR=0.000000100000000
##FIRSTY=44.05305862
##DELTAX=0.96440572
##XUNITS=1/CM
##YUNITS=TRANSMITTANCE
##XYDATA=(X++(Y..Y))
399.3D40530586P56836N501785O503602m209481j258239j20049r32465K18544r355774
407.9D37635345m578743L371430O668625L391838q27675k98195k506866l807946n739936
416.6D33307877q997574q403473J4935684L509827M363784N199776l828354J501465
424.3D41589012m09393k633553k962112m541016j842193J071891M516221k659531l484116
433D28645210Q29163J537056K534942N266800K405205n098533q90046k282943k344628
441.7D30602226K373238m112358J403274J235962J32637M209976K810784q07610q219070
450.4D29629059n092850L009606L090820j309471n45655N14870j504478k073899K00653
459.1D25918655K199288j279755n353088k534142K996140M912948Q32634p87925k856293
$$ plain form
399.3 440530586 441287422 446789207 453292809 449083328 447825089 447705040 446772575 446991119 437635345
407.9 437635345 433056602 436428032 443096657 446488495 445660820 445362625 442855759 439047813 433307877
416.6 433307877 424310303 415906830 430842514 434352341 438716125 443915901 440087547 441589012
424.3 441589012 441179619 438546066 435583954 431042938 429200745 430272636 434788857 432129326 428645210
433 428645210 429474373 431011429 433546371 438813171 441218376 436119843 435229797 432946854 430602226
441.7 430602226 432975464 428863106 430266380 431502342 431634979 435844955 438655739 437848129 429629059
450.4 429629059 424536209 427545815 430636635 429327164 428781509 429296379 427791901 425718002 425918655
459.1 425918655 428117943 426838188 421485100 418950958 421947098 426860046 427692680 426904755 424048462
467.7D24048462m645386j855316P56073O0005M69933K324714N19410j603775m376870
476.4D15697250j92985O58912N73197K616272m941445k780456P76825n520401j850472
485.1D05036697M103432M337273l50075j197853p97310k850266R89991J584091j980667
493.8D08875313l03955K00500N82237L032570J494713q51478k974663m482231o88057
502.5D04884949K315712P27195j607933j858673K223130K302246j622391k727547o79474
511.1D03957214k71530j460571j442413J467018K987060j990814l463478o00052l416672
519.8C95765762l103752p41119q11806J329537K901344M62417k754783j067085R04121
528.5C92884636L97110q3466J174240K69738K14538J600762n75219j384162j312600
$$ plain form
467.7 424048462 419403076 417547760 418303833 418363838 418833771 421158485 421677895 420074120 415697250
476.4 415697250 415504265 416163177 416736374 419352646 414411201 411630745 412407570 406887169 405036697
485.1 405036697 409140129 413477402 413127327 411929474 411132164 408281898 409271889 410855980 408875313
493.8 408875313 408571358 408771858 409354095 412386665 413881378 413029900 410055237 405573006 404884949
502.5 404884949 407200661 407927856 406319923 404461250 406684380 408986626 407364235 404636688 403957214
511.1 403957214 403685684 402225113 400782700 402249718 405236778 403245964 399782486 399182434 395765762
519.8 395765762 392662010 391920891 391109085 392438622 395339966 395802383 393047600 391980515 392884636
528.5 392884636 393281746 393198280 394372520 394642258 394856796 396457558 395882339 394498177 393185577
537.2C93185577m19807M81873j465760Q18100J262436j706543k206459k925491k46506
545.9C86777420J028519j137047m66461J102066J559486q80508l459511k090645n6343
554.5C82376976l93486J2856J181068J847115P40928k094269j838607Q21075O58188
563.2C83311844j064453n98831L80249R03358M81262j381683j005135M07181l54576
571.9C81079216j262245J32332J181373k87857j54075O03866o69479j373940j821518
580.6C77427673r27772K052994P95517q68340J505280n1995n64461Q32863o60095j96838
590.2C79344826J163826O68373M53300J920357P37991n04837k02827j540604l65448
598.9C81674957m48532r07593J778565K042274K91748r68170j105346j952935j880455
$$ plain form
537.2 393185577 392765770 393247643 391781883 392599983 393862419 392155876 389949417 387023926 386777420
545.9 386777420 387805939 386668892 386202431 387304497 388863983 387983475 384523964 382433319 382376976
554.5 382376976 381983490 381996346 383177414 385024529 385765457 383671188 381832581 382653656 383311844
563.2 383311844 382247391 381648560 382028809 382932167 383413429 382031746 381026611 381433792 381079216
571.9 381079216 379816971 379949303 381130676 380842819 380688744 381292610 380623131 379249191 377427673
580.6 377427673 376499901 378552895 379348412 378480072 379985352 379933357 379368896 380201759 379541664 379344826
590.2 379344826 380508652 381177025 381630325 383550682 384288673 383783836 383581009 382040405 381674957
598.9 381674957 381226425 380318832 382097397 384139671 384431419 383463249 382357903 380404968 378524513
607.6C78524513K60010N46265J38054M26635j06811o08635r12132j890107j274643
616.3C75103149l98712O64711J801758Q97522J009979O02532K42881q02803j709289
624.9C77411728L67088J397476L018952K807922J408348K074585Q44078m67491P477
633.6C88870163J378097K367096K623940K137146J190186R11483P41005P43790J79100
642.3D01142006N62210K336159K798805K537117P14645r87396o7596J119041J321678
651D11476669J59722l61061J201858K419167J467247L01208r18541j432380K38304
659.7D14552193p46079j332130L14522J799507K492561J27258p49092k270622p442360
668.3D06745758N161057L072204J796265J780128J040688R52911J426087Q09288J23520
$$ plain form
607.6 378524513 378784523 379330788 379468842 379895477 379788666 379180031 378267899 376377792 375103149
616.3 375103149 374704437 375369148 377170906 378068428 379078407 379680939 379923820 379121017 377411728
624.9 377411728 377778816 379176292 382195244 385003166 386411514 388486099 389330177 388862686 388870163
633.6 388870163 390248260 392615356 395239296 397376442 398566628 399478111 400219116 400962906 401142006
642.3 401142006 401704216 404040375 406839180 409376297 410090942 409103546 409035950 410154991 411476669
651 411476669 411636391 411275330 412477188 414896355 416363602 416664810 415746269 414313889 414552193
659.7 414552193 413806114 412473984 412788506 414588013 417080574 417207832 416458740 414188118 406745758
668.3 406745758 411906815 414979019 416775284 418555412 419596100 420549011 421975098 422784386 422907906
677D22907906O93969J272507J479721Q78334J565704K233887J632233J382255L62168
685.7D34408684j65215L8414J924591K949410J934891J745109K98462j051369j034622
694.4D41048355j10283K92855J083908K997818K494468J230126O80198k96287p95670
703.1D48625488k86331J92223J967010K315178Q98705J955604J243935j96533j124802
711.7D55590477j280861J301804K668075K310181J130104J328773N56946q57849o65817
720.4D62081833p62901O96525J474610L036537L095283P87201Q00438k07710r46770
729.1D70055046J61400R51843J043320K596779K897224J225510L99551o92177l26767
737.8D78311729p32269l64151O20117J570015K598000R41963J084633N97801o36673
$$ plain form
677 422907906 423601875 424874382 426354103 427232437 428798141 431032028 432664261 434046516 434408684
685.7 434408684 434243469 434281883 436206474 439155884 441090775 442835884 443134346 442082977 441048355
694.4 441048355 440938072 441230927 442314835 445312653 447807121 449037247 449717445 449421158 448625488
703.1 448625488 448339157 448531380 450498390 452813568 453712273 455667877 456911812 456715279 455590477
711.7 455590477 454309616 455611420 458279495 460589676 461719780 463048553 463605499 462747650 462081833
720.4 462081833 461318932 462015457 463490067 466526604 469621887 470409088 471209526 471001816 470055046
729.1 470055046 470216446 471168289 472211609 474808388 477705612 478931122 479330673 478638496 478311729
737.8 478311729 477579460 477215309 477835426 479405441 482003441 482945404 484030037 484627838 483991165
746.5D83991165j119461j87988J164169R47342K771950J892052P17849R4834j061325
755.1D89210587q26035j14784L224411K637291J461563K492866J997147J247635m35677
763.8E00895004j055107q38470O65016J258850K223434K053109l2387K83050r97848
772.5E04454651j390343j148109q55904Q61626K328834K422638Q72765k55432j741143
781.2E05549583p83119j117706r94759J506920J717835L220672K488022R25064o31599
789.9E11880913k424889j803894p39479N94139Q53462J373597P41996k14119k204513
798.5E08057213k896118j095963k048797j536446r08165j77345k57378j832924k767067
807.2D94537010l905983l050880k400704q98971o19507j133118q91266j694679j423912
$$ plain form
746.5 483991165 482871704 482683716 483847885 484795227 487567177 489459229 490177078 490271912 489210587
755.1 489210587 488384552 488269768 491494179 494131470 495593033 498085899 500083046 501330681 500895004
763.8 500895004 499839897 499001427 499666443 500925293 503148727 505201836 505169449 505452499 504454651
772.5 504454651 503064308 501916199 501060295 501921921 504250755 506673393 507546158 507290726 505549583
781.2 505549583 504766464 503648758 502653999 504160919 505878754 509099426 511587448 512512512 511880913
789.9 511880913 509456024 507652130 506912651 507506790 508360252 509733849 510475845 510261726 508057213
798.5 508057213 505161095 504065132 502016335 500479889 499571724 499394379 499137001 497304077 494537010
807.2 494537010 490631027 487580147 485179443 484280472 483660965 482527847 481636581 479941902 478517990
815.9D78517990k319298k211685j531944p01141J096000K239113K516060O35300M53376
824.6D78693771J287804J165657P71713K492333M678230M536896M879913K998123K713127
833.3E04217567K608643J509438K024955J798935L544007L519783L686943L807373
841E26717644K872925J403274n94788J008225J490250K511673K940940L272858L531647
849.6E45154648J586189R21059l67165L80631R77859J959648K968292L286934L438416
858.3E60306511J214714P90710j31073k85034q68911N90133L085251J012955L35541
867E66050797J41067m47502k952118l178139j755447j081124J56670l66440P95059
875.7E57362823q44764j932717k499923l002625l79448o07605P5646L64952M90227
$$ plain form
815.9 478517990 476198692 473987007 472455063 471753922 472849922 475089035 477605095 478240395 478693771
824.6 478693771 479981575 481147232 481918945 484411278 489089508 493626404 498506317 501504440 504217567
833.3 504217567 506826210 508335648 510360603 512159538 515703545 519223328 522910271 526717644
841 526717644 529590569 530993843 530399055 531407280 532897530 535409203 538350143 541623001 545154648
849.6 545154648 546740837 547661896 547294731 547675362 548653221 550612869 553581161 556868095 560306511
858.3 560306511 561521225 562311935 562180862 561895828 561026917 561617050 564702301 565715256 566050797
867 566050797 566191864 565744362 562792244 559614105 557858658 556777534 556934204 556567764 557362823
875.7 557362823 556518059 554585342 552085419 549082794 548703346 548095741 548171387 548536339 549026566
884.4E49026566K03666q35151j128045k393264j309319m25644R03282J943550K227517
893E48213158J400718m32586j61667q82302q35762k73170J259117J980133J259194
901.7E51526833P79419m21906k94991j77421J959190K349129K488098L307953J895638
910.4E63411942K480430L16353k017403l381042k623329p20787j381646j398620k080803
919.1E52605095j819611k837333l922654m753303m893875l440895l440018j886444
926.8E25610962j953621k420540k359505l437156m262314m098587k229309j552277
934.5E03297653p93037p52526l08303k62223j827049j786575j719971j285095j692162
943.2D92870712p30896L39966K85454P43141l36304m49829j353988j275711n24292
$$ plain form
884.4 549026566 549230232 548395081 547267036 544873772 543564453 543138809 544042091 545985641 548213158
893 548213158 549613876 549181290 549019623 548137321 547301559 547028389 548287506 550267639 551526833
901.7 551526833 552306252 551884346 551589355 551411934 553371124 555720253 558208351 561516304 563411942
910.4 563411942 565892372 566208725 564191322 560810280 558186951 557466164 556084518 554685898 552605095
919.1 552605095 550785484 547948151 544025497 539272194 534378319 530937424 527497406 525610962
926.8 525610962 523657341 521236801 518877296 515440140 511177826 507079239 504849930 503297653
934.5 503297653 502504616 501752090 501443787 501181564 499354515 497567940 495847969 494562874 492870712
943.2 492870712 492139816 492479782 492765236 493508377 493172073 492722244 491368256 490092545 489568253
951.9D89568253l71170M46701m02756j149292k557259l062706l312607l067016k497788
960.6D73594360k745742j328736j203346j124764j891403l310127l323669l244248
968.3D55422325k477112k329521k124977k240524k042694k554894m453735n023842
976D32175026m432144l532257l875237l940277m097671m803772n312195o041794o017151
984.7C90122528o038246n721474n124244n067826m446373m201622n463447n709000
992.4C48350296n118027n008087n258179m912529l784828l491516l260422l829956
1000.1C13686752m127826l634301l014145l210659l645896j765042r91001j156673
1007.8B92141209j288643j271458j419487j816807j739349k345047k058640k402610
$$ plain form
951.9 489568253 489197083 489643784 489241028 488091736 485534477 482471771 479159164 476092148 473594360
960.6 473594360 470848618 469519882 468316536 467191772 465300369 461990242 458666573 455422325
968.3 455422325 452945213 450615692 448490715 446250191 444207497 441652603 437198868 432175026
976 432175026 427742882 424210625 420335388 416395111 412297440 407493668 402181473 396139679 390122528
984.7 390122528 384084282 378362808 373238564 368170738 363724365 359522743 354059296 348350296
992.4 348350296 343232269 338224182 332966003 328053474 324268646 320777130 317516708 313686752
1000.1 313686752 309558926 305924625 302910480 299699821 296053925 294288883 293297882 292141209
1007.8 292141209 290852566 289581108 288161621 286344814 284605465 282260418 280201778 277799168
1015.5B77799168k353745j827106j923676k657757m005298k910042k130299k013283
1023.2B57977962k920150k370396j012974k011680k127896l096676k058582j065960
1031B41313648j151066j037502o54583O65074o83346m58412K15854R19304R52759J146145
1040.6B41227875J698665O36101J973381O13995l16582M9400j37462k23084j184997
1049.3B44337292j47076n86109k62222r76773j217041j91440m61846K76566n75943
1058B40195408L79352L89405J032505J975517K378902L246270J808834K775574J823310
1066.6B56005077J667652J937962J805649K118416N17063J265411K32849P05624J228561
1075.3B67484264M13895Q22392J208324K568378J014901M81948O62365J513424J807957
$$ plain form
1015.5 277799168 275445423 273618317 271694641 269036884 265031586 262121544 259991245 257977962
1023.2 257977962 255057812 252687416 251674442 249662762 247534866 244438190 242379608 241313648
1031 241313648 240162582 239125080 238470497 239135571 238452225 237993813 238209667 239128971 240081730 241227875
1040.6 241227875 242926540 243562641 245536022 246150017 245833435 245882835 245745373 245522289 244337292
1049.3 244337292 244190216 243604107 243341885 242365112 241148071 240956631 240494785 240771351 240195408
1058 240195408 240574760 240964165 241996670 243972187 246351089 249597359 251406193 254181767 256005077
1066.6 256005077 257672729 259610691 261416340 263534756 264051819 265317230 265550079 266255703 267484264
1075.3 267484264 267898159 268720551 269928875 272497253 273512154 273994102 274656467 276169891 277977848
1084B77977848J154060J688958J215782K556667K047253K266159K004223Q67366K059365
1092.7B93837681J666946J698914J395511K601796K117347J083279K213135J658382
1100.4C08272991J707020J244163K099877K202663J589527J714268Q47664J532421
1108.1C21210594J594887P65228n2681O02875R11064O72112J722259J471863J035385
1116.8C29933586n27573r72518m17862o80771j40763l53584K20833R43413J246185
1125.5C29250946P56416O31371K027092K168426J602707K148857K954445K270584K174225
1134.1C45985069K374039K037926J658325J665153K144280K011948K391319J786575
1141.9C62054634J038132J125717N27267O7711J27030Q21037P77206K09237K92396
$$ plain form
1084 277977848 279131908 280820866 282036648 284593315 286640568 288906727 290910950 291778316 293837681
1092.7 293837681 295504627 297203541 298599052 301200848 303318195 304401474 306614609 308272991
1100.4 308272991 309980011 311224174 313324051 315526714 317116241 318830509 319678173 321210594
1108.1 321210594 322805481 323570709 323518028 324120903 325031967 325704079 327426338 328898201 329933586
1116.8 329933586 329406013 328433495 328015633 327334862 327194099 326840515 327061348 328004761 329250946
1125.5 329250946 330007362 330638733 332665825 334834251 336436958 338585815 341540260 343810844 345985069
1134.1 345985069 348359108 350397034 352055359 353720512 355864792 357876740 360268059 362054634
1141.9 362054634 363092766 364218483 364745750 364813461 364940491 365761528 366538734 366747971 367040367
1150.5C67040367O39038N94940l48968q52623l97377J13220l58734o69746l23639o17409
1160.2C64819069o03218n66292o83594l54881P16248K023162K234421K225914K695236
1168.9C72506065K874680K504654K284851J904106K343369K734947K846527L092728
1176.6C93091927K957840K931175K242508J912765J482887J618996J724663J248894
1184.3D09211655J512603J471138J439248O22291k23617o55709q89396r36928o99730
1193D10851555R8152k25067r05304j046448j399879k028237j825714j603050j656876
1201.6D00259132r52835r56917j085243j202316j809349j654396j039047j42174J00899
1210.3C91517754k16294j19171n379L73040K77595R2316j10092k02103K82593K62985
$$ plain form
1150.5 367040367 367679405 368274345 367925377 367072754 366675377 366788597 366429863 365760117 365436478 364819069
1160.2 364819069 364215851 363649559 362965965 362611084 363327332 365350494 367584915 369810829 372506065
1168.9 372506065 375380745 377885399 380170250 382074356 384417725 387152672 389999199 393091927
1176.6 393091927 396049767 398980942 401223450 403136215 404619102 406238098 407962761 409211655
1184.3 409211655 410724258 412195396 413634644 414256935 414033318 413377609 412488213 411551285 410851555
1193 410851555 410949707 410724640 409819336 408772888 407373009 405344772 403519058 401916008 400259132
1201.6 400259132 399306297 398349380 397264137 396061821 394252472 392598076 391559029 391416855 391517754
1210.3 391517754 391301460 391182289 391176910 391549950 391827545 391919861 391809769 391607666 391890259 392153244
1220C92153244M60167Q50258N63698j18332n78232q63762r76639m40712k59399p57332
1229.6C90032959m89349J42746l39661j294861j572838j272621o78482l53165j32064
1238.3C84042664J65062l9711m80309q16765r08584j036683o70661l94669o01921j18752
1247.9C79139671k33078m06913k78779o28318o49987p10525n49545k4491M35181M13818
1257.6C76507034j12152p11403o25953R7084J21040q4076J92223P47070Q62579R67446
1267.2C77960892Q51631M01611L12920K52495R01146J429176J479950J445045J483918
1275.9C86518784J371498P70721Q78639J230355J412773J479225K010727K466049K186432
1284.6D00325203J801720J278305J005249J051674J337013J305847J493111J650962
$$ plain form
1220 392153244 392613411 393463669 394027367 393909035 393330803 392467041 391490402 391049690 390790291 390032959
1229.6 390032959 389543610 389686356 389346695 388051834 386478996 385206375 384527893 384174728 384042664
1238.3 384042664 384207726 384168015 383687706 382870941 381962357 380925674 380255013 379860344 379258423 379139671
1247.9 379139671 378906593 378499680 378220901 377592583 376942596 376232071 375682526 375658035 376093216 376507034
1257.6 376507034 376394882 375683479 375057526 375154610 375275650 375191574 375383797 376130867 376993446 377960892
1267.2 377960892 378812523 379214134 379527054 379779549 380680695 382109871 383589821 385034866 386518784
1275.9 386518784 387890282 388661003 389539642 390769997 392182770 393661995 395672722 398138771 400325203
1284.6 400325203 402126923 403405228 404410477 405462151 406799164 408105011 409598122 411249084
1292.3D11249084J783562J598969J108246P94868k30980J39084Q48427J303253J321602
1301D19916115O07414N46303p0343j74599l12195l42216n6992K0409J65825j42975
1310.6D20156746j01280o72188r78890o54258n47257l74489J54381R82781J059036
1319.3D19024582J373863J479416J089058J24283n1193P53326N48477R42230R06372
1328D26190414N69306J49650k59437n04837j203003q02612n63851l01475o1112J58234
1337.6D23371277K74849p7210j01356j89324O77834O08139R70726J208305L68882Q70056
1347.3D27982178L61519o7940n82161o44035j98403J38779N83801m30107m81339l22456
1356.9D26339836n35087q85468p32498p23953q96111J16882k49366L32565k03133j006622
$$ plain form
1292.3 411249084 413032646 414631615 415739861 416534729 416303749 416442833 417291260 418594513 419916115
1301 419916115 420523529 421069832 420999489 420824890 420512695 420170479 420113487 420133896 420299721 420156746
1310.6 420156746 420055466 419383278 418404388 417750130 417202873 416828384 416982765 417965546 419024582
1319.3 419024582 420398445 421877861 422966919 423091202 423040009 423793335 424341812 425284042 426190414
1328 426190414 426759720 426909370 426649933 426145096 424942093 424139481 423575630 423274155 423213043 423371277
1337.6 423371277 423646126 423568916 423467560 423278236 423956070 424564209 425534935 426743240 427112122 427982178
1347.3 427982178 428343697 428275757 427693596 427049561 426851158 426989937 427573738 427143631 426662292 426339836
1356.9 426339836 425804749 424919281 424186783 423462830 422566719 422683601 422434235 422766800 422563667 421557045
1366.6D21557045q71353j363564n42412l52134O0081J07003J21955l59726j136589
1375.2D17220306N9090n86853j067848j128922j34239J31836r21745j580963k094002
1383.9D09896660j552582j710968j708679k627602j180420l57971j631470j583519
1391.6C97543449k155304k216072l488121l888359j619453j505051j166534k941818
1399.3C78562737k659722j753807k184791k319489k503471k765961k390213j105728
1407.1C60879555r99947j502609j618347j837425j588212j748924j329689r46083p80220
1415.7C48528099l01781l76320L60756j464004o4278J187973J27754M18129L1014J621208
1425.4C50068550J748810Q80318J533622R31588O79664N57823J700974J840477J805038
$$ plain form
1366.6 421557045 420685692 419322128 418779716 418427582 418487663 418594666 418716621 418356895 417220306
1375.2 417220306 417279396 416692543 415624695 414495773 414361534 414493370 413571625 411990662 409896660
1383.9 409896660 408344078 406633110 404924431 402296829 401116409 400758438 399126968 397543449
1391.6 397543449 395388145 393172073 389683952 385795593 384176140 382671089 381504555 378562737
1399.3 378562737 375903015 374149208 371964417 369644928 367141457 364375496 361985283 360879555
1407.1 360879555 359879608 358376999 356758652 354921227 353333015 351584091 350254402 349308319 348528099
1415.7 348528099 348226318 347849998 348210754 346746750 346682472 347870445 347998199 348416328 348447342 350068550
1425.4 350068550 351817360 352697678 354231300 355162888 355842552 356400375 358101349 359941826 361746864
1434.1C61746864K398300J267319J727524J843567K165031J540490J582832J697998
1441.8C75969925J064148K198906J414375J379471J294060N16929J50681J250763J694870
1450.5C86934128O28624J549415J326409J944160J993866M80118k38228m86870L602677
1459.1C97734299J368942K169151J956673J418610K116127M36706J707459J499672
1466.8D10407639K632179K955513K760162L160019K273674L357849K411347L620300
1474.6D33578682K814941J618119L391838L541984L042984K508889K098274J674957
1482.3D54270668J866722J409454J556817J721305N79339J017684K197075P00722o38657
1491D64681129O1722m55932j174164o88553p45850n005798K57797j937904m198341
$$ plain form
1434.1 361746864 364145164 365412483 367140007 368983574 371148605 372689095 374271927 375969925
1441.8 375969925 377034073 379232979 380647354 382026825 383320885 383837814 383988495 385239258 386934128
1450.5 386934128 387562752 389112167 390438576 392382736 394376602 394856720 394618492 394131622 397734299
1459.1 397734299 399103241 401272392 403229065 404647675 406763802 407200508 408907967 410407639
1466.8 410407639 413039818 415995331 418755493 421915512 424189186 427547035 429958382 433578682
1474.6 433578682 436393623 438011742 441403580 444945564 447988548 450497437 452595711 454270668
1482.3 454270668 456137390 457546844 459103661 460824966 461404305 462421989 464619064 465319786 464681129
1491 464681129 464742851 464286919 463112755 462424202 461678352 456672554 456930351 454992447 450794106
1499.6D50794106m34914j890679k148132j918182J80969O5651n429611k984772Q3618
1508.3D36318054J889191o87409M55742j129265j620559Q31413k75345m61082k647209
1517D32673531k967720J396408J238708k997589k947159L165817K119179K199974j92985
1525.7D33688164P26928R41048n42602J357803J684837J556282J293679P90519P04041
1534.3D42200699K666054J760063P96509J015319l917198j162987M026337K958641
1542.1D50343437J753617K279853J320153j180230J517830N98946Q57658L29094L34282
1550.7D58154640J864090J113739J497994l413468j187324J208725O66465j951484
1558.5D57953377r103775M983749M73938L64533k231675k119712l658295l304482r67903
$$ plain form
1499.6 450794106 450359192 448468513 446320381 444402199 444583168 444648819 439219208 436234436 436318054
1508.3 436318054 438207245 437519836 437975578 436846313 435225754 436057167 435781822 435320740 432673531
1517 432673531 429705811 431102219 432340927 429343338 426396179 429561996 431681175 433881149 433688164
1525.7 433688164 434415092 435356140 434813538 436171341 437856178 439412460 440706139 441496658 442200699
1534.3 442200699 444866753 446626816 447423325 448438644 444521446 443358459 447384796 450343437
1542.1 450343437 452097054 454376907 455697060 454516830 456034660 456633606 457491264 457820358 458154640
1550.7 458154640 460018730 461132469 462630463 459216995 458029671 459238396 459904861 457953377
1558.5 457953377 448849602 453833351 454307289 454671822 452440147 450320435 446662140 443357658 442389755
1567.1D42389755k141762j529350r443817j385422k147636m196930l354111l976249
1574.9D14214478j595803j3619499j531181l197174m803734m698448o487084m203071
1582.6C74078484o568985m282227o010017m388810m300155n980377m020806o884804
1590.3C31642303l697013o241341l945503m388714n412388l188419n612774k550507
1598B96605644n614948k813549m320316l889523k197590m811592j200256m132672j500377
1606.7B66124821l750840j933536j918488l667373L23791l049145L35961j784840M00810
1615.4B51081161k10475o329651J926784j479091J700134j335220J373310r0409k209720
1624B44426823J688747m90341K673626j406269K083339P68071J040935J485710j4057
$$ plain form
1567.1 442389755 440247993 438718643 429274826 427889404 425741768 421544838 418190727 414214478
1574.9 414214478 412618675 398999176 397467995 394270821 389467087 384768639 378281555 374078484
1582.6 374078484 367509499 363227272 357217255 352828445 348528290 342547913 338527107 331642303
1590.3 331642303 327945290 321703949 317758446 313369732 307957344 304768925 299156151 296605644
1598 296605644 290990696 288177147 283856831 279967308 277769718 272958126 271757870 267625198 266124821
1606.7 266124821 262373981 260440445 258521957 254854584 255178375 252129230 252465191 250680351 251081161
1615.4 251081161 250870686 244541035 246467819 244988728 246688862 245353642 246726952 246636543 244426823
1624 244426823 246115570 245625229 248298855 246892586 248975925 249743996 250784931 252270641 252256584
1632.7B52256584L080902n91583K330742l45383L760243L155384K395553L654709L50399
1641.4B70047550K957363O49395K474213J679382m16507L288517j057435M908886P47166
1650.1B85278530K526322J364536m350300K447338L63617M193592N30338K156563P53899
1658.8B95264435J512184J908951J426315L050118k5788M083252K495098M068032L654975
1667.4C17437572K749844M891205J459427N751686L182487M841957L993950L867875
1675.1C48176003N623931M110909N775871L604469N168877M026032N326271N545234
1682.9C87357597J386490J0451317L879623O901284M705505M839020N680046M976387
1690.6D30177269O222763N509911O368942N857468O001663M116211O271019O785926
$$ plain form
1632.7 252256584 255337486 254745903 257076645 256731262 260491505 263646889 266042442 269697151 270047550
1641.4 270047550 273004913 273654308 276128521 277807903 277391396 280679913 279622478 284531364 285278530
1650.1 285278530 287804852 289169388 284819088 287266426 287630043 291823635 292353973 294510536 295264435
1658.8 295264435 296776619 298685570 300111885 303162003 303136215 307219467 309714565 313782597 317437572
1667.4 317437572 320187416 325078621 326538048 332289734 335472221 340314178 344308128 348176003
1675.1 348176003 353799934 357910843 363686714 367291183 372460060 376486092 381812363 387357597
1682.9 387357597 388744087 399195404 403075027 409976311 414681816 419520836 425200882 430177269
1690.6 430177269 436400032 441909943 448278885 454136353 460138016 464254227 470525246 477311172
1698.3D77311172O356278N941200Q06351P597923O230507N565720M079818L812867
1706E17701836L223686L224144M326706L421898L726043L617020L554077L641396J556968
1714.7E47993774J214104L683357K401772l101196M662437M803772L441238K404099
1722.4E67503357J116028P43103J777916J918373J485290K247811K557792O36330J543541
1731.1E81529541M199638L500252j029968m064751M084892M796143K619476L263131
1738.8E98898354J505203Q2092M474297K742462Q50334K047806L695907L053513K642937
1747.5F19992905K832184J987152N200538J718445J325417M628105L341026L845749
1755.2F44871521L428879J222305K409058L125763K044677K654419o89239R80072M253921
$$ plain form
1698.3 477311172 483667450 489608650 490415001 498012924 504243431 509809151 513888969 517701836
1706 517701836 520925522 524149666 528476372 531898270 535624313 539241333 542795410 546436806 547993774
1714.7 547993774 549207878 552891235 555293007 552191811 556854248 561658020 565099258 567503357
1722.4 567503357 568619385 569362488 571140404 573058777 574544067 576791878 579349670 579986000 581529541
1731.1 581529541 585729179 589229431 588199463 584134712 588219604 593015747 595635223 598898354
1738.8 598898354 600403557 600485649 604959946 607702408 608552742 610600548 614296455 617349968 619992905
1747.5 619992905 622825089 624812241 630012779 631731224 633056641 637684746 641025772 644871521
1755.2 644871521 648300400 649522705 651931763 655057526 657102203 659756622 659067383 660047455 664301376
1763.9F64301376K082901K435456K703247J999359j808014J502685L589707k12021
1771.6F76594696n05829J01013N130387K635421o09817J955643M1427J405030R49707
1780.3F87697678j20240J271897K479706K881698o00128k57492J172485R84040N46035
1788.9F96055679J352005R16443P23877l14789J7929L696824P92465m85382J412124
1797.6G04167175J893616N41992l15857L097916M2725M73785J074524L280R60618J80816
1807.3G12120590O86264J190720K233505K5940M01993J287918Q3160O54602m83322
1815.9G18201370R79538P30515J352920J590500L02887R99298j028137M60663M26025
1824.6G24015579j944656J316833K782135K688294k57340l066635O07147K103577J86920
$$ plain form
1763.9 664301376 666384277 668819733 671522980 673522339 671714325 673217010 676806717 676594696
1771.6 676594696 676088867 676189880 681320267 683955688 683345871 685301514 685342941 686747971 687697678
1780.3 687697678 687577438 688849335 691329041 694210739 693610611 693353119 694525604 695509644 696055679
1788.9 696055679 697407684 698324127 699048004 698733215 698751144 702447968 703240433 702755051 704167175
1797.6 704167175 706060791 706602783 706286926 709384842 709427567 709901352 710975876 710979156 711939774 712120590
1807.3 712120590 712806854 713997574 716231079 716257019 716659012 717946930 718030090 718684692 718201370
1815.9 718201370 719180908 719911423 721264343 722854843 723157730 724157028 723128891 723589554 724015579
1824.6 724015579 722070923 723387756 726169891 728858185 728600845 725534210 726141357 728244934 728431854
1833.3G28431854O8054P01371J078262R83887j84326J331253n1499k1515l10745M79355
1842.9G32505951J240539l374328L267593K329560l77274o68869R9487P68280j67617
1851.6G35623322P91244J36948J304016J081085P5226M18701p32117p6599m99420N45425
1861.3G38667831P86744R37500J135864M93774N07202j250686J64795j281433j137391
1869.9G39024200J708909J825714J419983k9908L00827o99386p8659J7090p9728P76215
1879.6G44185257K62833J222152J81809M17251j91574p01446M2419l54538J128769
1888.3G46192932k06222n07279J125412R47266R7885k78092q11843j087494J209793
1896.9G46682358N44433J012879Q59375k72370R4452n83419o1951n06592M23584M24194
$$ plain form
1833.3 728431854 728499908 729201279 730279541 731263428 731079102 732410355 732358856 732337341 732026596 732505951
1842.9 732505951 733746490 730372162 733639755 735969315 735592041 734923172 735022659 735790939 735623322
1851.6 735623322 736414566 736551514 737855530 738936615 739011841 739430542 738698425 738621826 738122406 738667831
1861.3 738667831 739454575 740392075 741527939 742021713 742528915 741278229 741443024 740161591 739024200
1869.9 739024200 740733109 742558823 743978806 743948898 744249725 743550339 743471680 743488770 743409042 744185257
1879.6 744185257 744448090 745670242 745852051 746269302 746077728 745376282 745418701 745064163 746192932
1888.3 746192932 745986710 745479431 746604843 747552109 747649994 747371902 746560059 745472565 746682358
1896.9 746682358 747226791 748239670 749099045 748826675 748921127 748337708 748275757 747769165 748192749 748616943
1906.6G48616943J01471J071549M55246k57111q37478K07977n17044K35748N10941
1915.3G49588242M28466J782227j328125l70102M33731k79999N34r47265J75628J207199
1924.9G50690536J190339l66898j31378k07443k39945j39618r83200L91846P62939
1933.6G50967178J283112L47137k68631l00293q84933l94516o59180J110916j64337
1942.3G51036453p51571J673126N31921n37720j062469j31073k57492q4534J83563
1951G50600204M12903R99680L81470L22342r49784q56399q45719m25720O31104M79965
1960.6G50750046J120987L47595J53046o30417q56552n32914r51767L32337P06253
1969.3G50438614J098022N04151K13241j89590p22351p17011o92062K78397j45951
$$ plain form
1906.6 748616943 748718414 749789963 750245209 749988098 749150620 749358597 748841553 749077301 749588242
1915.3 749588242 750016708 751798935 750470810 750100708 750534439 750254440 750254974 749307709 749483337 750690536
1924.9 750690536 751880875 751513977 751382599 751175156 750935211 750795593 749812393 750204239 750967178
1933.6 750967178 752250290 752597427 752328796 752028503 751143570 750749054 750089874 751200790 751036453
1942.3 751036453 750284882 751958008 752489929 751952209 750889740 750758667 750501175 750416641 750600204
1951 750600204 751013107 752012787 752394257 752716599 751766815 750910416 750064697 749638977 750270081 750750046
1960.6 750750046 751871033 752218628 752371674 751741257 750884705 750351791 749400024 749732361 750438614
1969.3 750438614 751536636 752040787 752254028 752064438 751342087 750625076 749933014 750211411 750065460
1978G50065460P67746Q84628J35041M8294n81131l57742q67081l70712k04773M80499
1987.6G50000229J025772M30069M95605r13848j210785n40162l6849j48774L63999
1996.3G49465256R33456Q1330K00958o08979m24880o78788n78918K19192J7701P69119
2005.9G49395447J54419K26135j68762o08750n99975p56607K14843p6828J48316K01721
2015.6G48129959L70636n1956n98450m36096m78287M13590k52228J37253K70080j87835
2025.2G47316666J10244j56784j45721j046372l25622k7771O6223N04684K80610K59323
2034.9G46835480n95475k99148p35855l60108J84098l6621K1972J03607R12018m97284
2044.5G45532684n21164n60760o95496L19901J95236L26385k77328N28488j06659m75235
$$ plain form
1978 750065460 750833206 751717834 751852875 751901169 751320038 750962296 750095215 749724503 749519730 750000229
1987.6 750000229 751026001 751456070 751951675 751037827 749827042 749286880 749250031 749101257 749465256
1996.3 749465256 750398712 750480042 750681000 750072021 749647141 748968353 748389435 748608627 748626328 749395447
2005.9 749395447 749549866 749776001 749607239 748998489 748398514 747641907 747856750 747779922 747928238 748129959
2015.6 748129959 748500595 748448639 747850189 747414093 746935806 747349396 747097168 747234421 747504501 747316666
2025.2 747316666 747426910 747270126 747124405 746078033 745752411 745724640 745790863 746295547 746576157 746835480
2034.9 746835480 746240005 745940857 745205002 744844894 745028992 744992371 745014343 745117950 746029968 745532684
2044.5 745532684 745011520 744450760 743755264 744075165 744270401 744596786 744319458 744847946 744741287 744266052
2054.1G44266052j58996p72400K94113n951N22232K62222N4169k9907p38678p6294
2063.8G43616562o49872j5335K31094N97458L92685p6370J37405q27789j93710n66254
2073.4G42645874J7929O28128L15323M17633k85950j52740p30438k15378m17709m22440
2083.1G41800232J54648K62680Q21152m02222K8229j24894l51257k91061n61829K52915
2092.7G41588593J52816P99103L0899P630l07465r69696k44751p34406o7215r1095
2102.4G40164413N43442N10102O0348J31912r82513k96555k49633j89896k59247L86353
2112G39818726N72586l77503L27759m01611m21906m62036o34766j05667M50363P30515
2121.6G39496460O5765L38745m14733k19727l72696p60651P5913r0561M50668L54233
$$ plain form
2054.1 744266052 744107056 743334656 743628769 743622818 744145050 744407272 744461441 744431534 743692856 743616562
2063.8 743616562 742966690 742951355 743182449 743779907 744172592 744096222 744233627 743405838 743212128 742645874
2073.4 742645874 742663803 743291931 743607254 744024887 743738937 743586197 742855759 742640381 742222672 741800232
2083.1 741800232 741954880 742217560 743038712 742636490 742664719 742539825 742188568 741897507 741335678 741588593
2092.7 741588593 741741409 742540512 742571411 742579041 742271576 741301880 741057129 740322723 740255508 740164413
2102.4 740164413 740707855 741217957 741278305 741410217 740427704 740131149 739881516 739691620 739432373 739818726
2112 739818726 740391312 740013809 740341568 739939957 739518051 739056015 738421249 738315582 738765945 739496460
2121.6 739496460 739562225 739900970 739486237 739266510 738893814 738133163 738209076 738118515 738569183 738923416
2131.3G38923416M85382j9455m16107k52609k82440J71966k22473M79431J40457K43531
2140.9G39251099L33557m05808l18908o54908K32087k9984K96249M77295L52021L99780
2150.6G39932480o71768n3254p52792k40631M93927J3123K84195J53884L66440k83279
2160.2G39242325J81198n5771k85721j64489l01819O30417J67160M34341r9487l95813
2169.9G39352341m71802m38843K89765m20838O61163M98429J63650L66211j96609j49231
2179.5G39654236n72510j5488Q7281M10080J98211K92511N37262l13568k53219o72303
2189.1G39352493n2795K11182N20324M30451j49155N798o40793P3166k26516J86538
2198.8G39710693N52750p8812O51017M49066Q9187q78601k59933J42441j80588M8904
$$ plain form
2131.3 738923416 739408798 739389343 738973236 738720627 738438187 738610153 738387680 738867111 739007568 739251099
2140.9 739251099 739584656 739178848 738859940 738205032 738437119 738407135 738703384 739180679 739532700 739932480
2150.6 739932480 739260712 739207458 738454666 738214035 738707962 738721085 739005280 739159164 739525604 739242325
2160.2 739242325 739423523 739367752 739082031 738917542 738615723 739246140 739413300 739847641 739748154 739352341
2169.9 739352341 738880539 738441696 738731461 738310623 738971786 739470215 739633865 740000076 739803467 739654236
2179.5 739654236 739081726 739066238 739153519 739563599 739761810 740054321 740591583 740278015 740024796 739352493
2189.1 739352493 739299698 739510880 740031204 740461655 740312500 740318298 739677505 739750671 739524155 739710693
2198.8 739710693 740263443 740184631 740835648 741284714 741373901 740495300 740235367 740377808 740197220 740246124
2208.4G40246124r3689P86667J46332K52533J98975m93088m49448k95181N17807Q0109
2218.1G40897141L32794L52401K59018j13906m30451k1667n63660n8670k22092L11890
2227.7G40742798O70318M27857K65503q46176m48685m91943J54495J28097k5482O99311
2237.4G41276093M20761N20172n40467n94329n13382k72217J27792o1798N05905J89057
2247G41057587O34689K9602o53839o84280m97132M77371J58921K94723M83322O91376
2256.7G41992340l11279p97653m49067o98547K70920j16272J45798L51104K65961J51367
2266.3G40804672o50635j50299n52444k29263j7701O4087M69971L51791N36042o1951
2275.9G40564270n47180q90427n7449J1139j09482L81622K59857M46320k47040k65503
$$ plain form
2208.4 740246124 740152435 740939102 741085434 741337967 741536942 741043854 740594406 740299225 740817032 740897141
2218.1 740897141 741229935 741582336 741841354 741727448 741296997 741275330 740711670 740653000 740430908 740742798
2227.7 740742798 741413116 741840973 742106476 741260300 740811615 740319672 740474167 740602264 740576782 741276093
2237.4 741276093 741696854 742217026 741676559 741082230 740568848 740296631 740424423 740362625 740868530 741057587
2247 741057587 741692276 741721878 741068039 740383759 739886627 740363998 740522919 740817642 741300964 741992340
2256.7 741992340 741681061 740883408 740434341 739735794 740006714 739890442 740036240 740387344 740653305 740804672
2266.3 740804672 740154037 740003738 739451294 739222031 739204330 739268417 739738388 740090179 740626221 740564270
2275.9 740564270 740017090 739126663 739069214 739080353 738970871 739352493 739612350 740058670 739811630 739546127
2285.6G39546127p65457m85763l12729m59137N09720r9717P84684O4621o20575j04523
2295.2G38057251p65076m56924o09207N90439L90396J49383L7384q79974n34821p57751
2304.9G35221100o9428n40847J01471K98690M8371J22070j459045j07346p18842m34036
2314.5G32462158J72577p75680m10386q85162N17807l8376l17917l15323r78164j112747
2324.2G28318787q35190R88922M04205J35193j714325l39279O24084j594619r29642
2332.8G25058136j144791J438294O06308p2937r6207j202240L24402l09753K2201m13895
2342.5G24209518L53699m11835j6784R14306p48062J048813J131821K61154j399841
2351.2G25342789j965180m99573R3613m99039j779937Q89587j246185k433777k53601
$$ plain form
2285.6 739546127 738780670 738294907 737982178 737523041 738032761 737933044 738717728 738782349 738161774 738057251
2295.2 738057251 737292175 736835251 736226044 736816483 737206879 737356262 737393646 736513672 735978851 735221100
2304.9 735221100 735151672 734610825 734712296 735010986 735059357 735181427 733722382 733615036 732896194 732462158
2314.5 732462158 732634735 731859055 731448669 730563507 731081314 731042938 730725021 730409698 729431534 728318787
2324.2 728318787 727483597 728472519 728876724 729011917 727297592 726958313 727582397 725987778 725058136
2332.8 725058136 723913345 725351639 725957947 725885010 725788803 724586563 724910965 724601212 724623413 724209518
2342.5 724209518 724563217 724151382 724134598 725048904 724300842 725349655 726481476 726742630 725342789
2351.2 725342789 723377609 722878036 722971649 722472610 720692673 721582260 720336075 717902298 717648697
2359.8G17648697J380615J825638j380997q3313L72238N11628j143036k41623Q26034
2368.5G19715881r9716K293778J231384M86069n28489m94384j21384l21350O47201
2377.2G22808990K2355J74865J74256J004333N28412q50906l76282k95792J26953j08947
2386.8G23208237O2484J56403J41373J86233n88302l52936p98035o65817k44675j60370
2396.5G20944595R3384J76315J77689n37491l47595o55975n30472k23007k42691K27813
2406.1G19082565k01416k46811n98449j90049m10156j067581l84598k01797L30429
2414.8G16112137K68249p6675n25208m55627l40042o75659n66025o29883J88446O9122
2424.5G13368835p8277k90909n40161k51236q12759m75312q13293l88794K51541K39792
$$ plain form
2359.8 717648697 719029312 720854950 719473953 719390640 719762878 720274506 719131470 718889847 719715881
2368.5 719715881 719616165 721909943 723141327 723627396 723098907 722604523 722483139 722161789 722808990
2377.2 722808990 722831345 723006210 723180466 724184799 724713211 723862305 723486023 723190231 723317184 723208237
2386.8 723208237 723270721 723427124 723568497 723754730 723166428 722813492 722015457 721349640 721104965 720944595
2396.5 720944595 721037979 721214294 721391983 720854492 720506897 719850922 719320450 719097443 718854752 719082565
2406.1 719082565 718881149 718634338 718035889 717845840 717435684 716368103 715983505 715781708 716112137
2414.8 716112137 716380386 716303711 715778503 715322876 714982834 714307175 713741150 713111267 713299713 713368835
2424.5 713368835 713290558 712999649 712459488 712208252 711395493 710920181 710106888 709718094 709969635 710209427
2434.1G10209427K53448q59832p42493m98352k85568m04511k32544j27868n35355N8517
2443.7G06834869l92303n93262r87778n56640l3722o01654l4027j27487k35901n03922
2453.4G02768173j22757k79464r98765o78710o87485k594j94626m9515k01340o07605
2463F98945312l38287q33511l79410m97589k87933k59629k94037j35955r14536n79681
2472.7F94424744m58222k18811m65164o05469m12216m62418m8828l84750n85251j235962
2482.3F89547653o38504k6398l01818j52054p04193k85492l57132k88391k99683p22275
2492F85771713m53491o70929o61011o05240r4680n07584q89358p51648m50058J56936
2501.6F80844650p22427o11878n24749l88642J76010k57720o54831r02329n92346p23801
$$ plain form
2434.1 710209427 710462875 709603043 708860550 708362198 708076630 707672119 707439575 707311707 706776352 706834869
2443.7 706834869 706442566 705849304 704861526 704304886 704271164 703669510 703635483 703507996 703272095 702768173
2453.4 702768173 702645416 702365952 701367187 700688477 700000992 699998398 699803772 699754257 699552917 698945312
2463 698945312 698607025 697773514 697394104 696896515 696608582 696348953 696054916 695918961 695004425 694424744
2472.7 694424744 693966522 693747711 693282547 692677078 692264862 691802444 691753616 691368866 690783615 689547653
2482.3 689547653 688909149 688882751 688580933 688428879 687724686 687439194 687082062 686793671 686493988 685771713
2492 685771713 685318222 684647293 683986282 683381042 683286362 682778778 681889420 681137772 680687714 680844650
2501.6 680844650 680122223 679510345 678985596 678596954 678772964 678515244 677860413 676958084 676365738 675641937
2511.2F75641937m52347m29534l85209j12457m18396m74548r64813m10843n25742o01654
2520.9F70866394m14810o54068J20621k08893k03476m71802p70187p36542o43082p9803
2530.5F66804352j94016j8387p34024n03769m71801q55789n03922p55539K10877j66474
2540.2F62811508o80313o55441m48685j26800p43180k90222m74167l40042l29132l34167
2549.8F58389359k45667p59125l10440m48761j32522l91465o25534p36389p97272j907
2559.5F53940277n22995l86963n36041j29318J03607p50809o44913p39975j43432k82974
2569.1F49906464l46222m09546m72794k59323q97674m37317m84314l37296l87649l79639
2578.7F45494690r9487q02689o03485q62198o28433j40305J10169J63345l91312o98547
$$ plain form
2511.2 675641937 675189590 674760056 674374847 674262390 673843994 673369446 672404633 671993790 671468048 670866394
2520.9 670866394 670451584 669797516 669918137 669709244 669505768 669033966 668263779 667527237 666884155 666804352
2530.5 666804352 666610336 666591949 665857925 665354156 664882355 664026566 663522644 662767105 662977982 662811508
2540.2 662811508 662131195 661475754 661027069 660900269 660157089 659866867 659392700 659052658 658723526 658389359
2549.8 658389359 658143692 657384567 657074127 656625366 656492844 656101379 655475845 654739456 653942184 653940277
2559.5 653940277 653417282 653030319 652494278 652364960 652468567 651717758 651072845 650332870 650189438 649906464
2569.1 649906464 649560242 649150696 648677902 648418579 647520905 647083588 646599274 646261978 645874329 645494690
2578.7 645494690 645395203 644592514 643989029 643126831 642498398 642358093 642468262 642631607 642240295 641541748
2588.4F41541748r94110l04642l30467l87268n03388p04536j88408m49943l55568n52521
2598F36770897n87540q68950o10885q4458n65948j89552o38733p39022m62074l29666
2607.7F31694069l60222p36771m66995p68585k49100m50897p79343l25508q34694r69047
2617.3F25752907o37627L8262k33384n17387o82220n62897n0469o46820o32133p62787
2627F21065445p08122m74358m22211l99246n78461j22070o35147r46617q37631n59006
2636.6F15382576l2234r5482j58539q25500j118737o35986j67007p09191j210708o42701
2646.3F09786491o9656K9755l85666l30811p64007o76232l62091o61773o68107n66940
2655.9F05330963M42886j56898p07283m23126p22389m59748o28357j98021m11529n77660
$$ plain form
2588.4 641541748 640547638 640242996 639912529 639525261 639021873 638317337 638128929 637678986 637323418 636770897
2598 636770897 636183357 635314407 634703522 634619064 634053116 633863564 633224831 632485809 632023735 631694069
2607.7 631694069 631333847 630597076 630130081 629361496 629112396 628661499 627882156 627556648 626721954 625752907
2617.3 625752907 625115280 625153542 624920158 624402771 623720551 623157654 623107185 622460365 621828232 621065445
2627 621065445 620357323 619882965 619460754 619061508 618483047 618360977 617725830 616779213 615941582 615382576
2636.6 615382576 615350342 615254860 615096321 614270821 613152084 612516098 612349091 611639900 610429192 609786491
2646.3 609786491 609716835 609746590 609360924 609030113 608266106 607589874 607227783 606566010 605897903 605330963
2655.9 605330963 605773849 605616951 604909668 604486542 603764153 603304405 602676048 602478027 602066498 601488838
2665.5F01488838j97182j61590j18332q30154o38085n62362j74599J0185o64864k37655
2675.2E97914200J42555j85280j141929p16134j21574n86853n09300m18091j21956
2683.9E94255638K747l37067p42989o38694o48957k85568J06888l24707k59552l89786
2693.5E90737953k38418k92168j89400k31285p34596k14920n47562n74112m69856n89409
2703.1E86656227k91519l11394l24325n54734p6446m1809k31018n46837n62630j36528
2712.8E83578987n38406o9046l35541o00548m31175n08080l1509o3210j76086o48804
2722.4E80176582m35218k74277j86196k62527q96835l60604j59530J50299k02370n75867
2732.1E76973457k27699j85051M9591l37295j74675m63753n40657j60446j93596j49536
$$ plain form
2665.5 601488838 601291656 601130066 601011734 600181580 599543495 598981133 598806534 598816719 598151855 597914200
2675.2 597914200 598056755 597871475 596729546 596013412 595891838 595304985 594795685 594377594 594255638
2683.9 594255638 594258385 593921318 593178329 592539635 591890678 591605110 591711998 591387291 591127739 590737953
2693.5 590737953 590499535 590207367 590017967 589786682 589052086 588837166 588289604 587715492 587245636 586656227
2703.1 586656227 586364708 586053314 585728989 585174255 585097809 585056000 584824982 584278145 583715515 583578987
2712.8 583578987 583040581 582971535 582635994 582035446 581604271 581096191 581064682 581001472 580825386 580176582
2722.4 580176582 579741364 579467087 579280891 579018364 578121529 577760925 577601395 577751694 577549324 576973457
2732.1 576973457 576745758 576560707 576610298 576273003 576098328 575634575 575093918 574933472 574739876 574590340
2741.7E74590340n47295j10512l79410j44348M49639l69759p79266m71878j69220o45600
2751.4E71422691m8599J37253j67732j22300o44989m17594l67241o0807m65164l93677
2761E68871841K7886m95911j28631p05452p49970k12974q7662q2817k66342j89019
2770.7E65980949n46226j87836l35274m55169m01497p79648n61752l87192p2708l79143
2780.3E61874504l55339m65279p02972o26183p82432k98271l30696k83966o45524o29768
2789.9E56754074k05345n90630o23893q57315l03994k58789o40564n08842p71599p87926
2799.6E51205177q71200p38793r82589r81217p62977p57981l32298j62010m88243q84934
2809.2E44242935o80084j045876j195907p07436l92113p58934j172218l77998o74286
$$ plain form
2741.7 574590340 574043045 573932533 573553123 573408775 573858414 573488655 572709389 572237511 572068291 571422691
2751.4 571422691 571374092 571511345 571343613 571221313 570576324 570158730 569791489 569730682 569265518 568871841
2761 568871841 568899727 568403816 568275185 567569733 566819763 566606789 566519127 566436310 566169968 565980949
2770.7 565980949 565434723 565246887 564911613 564456444 564054947 563275299 562713547 562326355 562253647 561874504
2780.3 561874504 561519165 561053886 560350914 559724731 558942299 558644028 558313332 558029366 557383842 556754074
2789.9 556754074 556548729 555958099 555334206 554476891 554172897 553914108 553273544 552764702 551993103 551205177
2799.6 551205177 550333977 549595184 548612595 547631378 546868401 546110420 545778122 545616112 545127869 544242935
2809.2 544242935 543562851 542516975 541321068 540613632 540221519 539462585 538290367 537912369 537238083
2817.9E37238083p20368p59277j121101p58400j176186r33227p65839p74345j079445
2826.6E29149895j055718o68640j038437n49011o91910j017837j156922r95407q39042
2835.3E21136971j243477j249161j601830j209449j473885j644783j676292j985360
2843E09052734j286049j825370k214241k599984k023925j701508k731514j975860j627694
2851.7D91066589j241645j143303j195221o03752n42298l53775r6817L72543j26075
2860.3D86136246n08194m53377k33269l91311j055184o50711j077423j293983j289864
2869D79182930j242027q82759r95636o37741q06923n08232n56145r47838r15985j006050
2878.7D70683594o38428p34711p81555j104736q31833o43158j186562j088600j076393
$$ plain form
2817.9 537238083 536517715 535758438 534637337 533878937 532702751 531769524 531003685 530229340 529149895
2826.6 529149895 528094177 527425537 526387100 525838089 525146179 524128342 522971420 521976013 521136971
2835.3 521136971 519893494 518644333 517042503 515833054 514359169 512714386 511038094 509052734
2843 509052734 507766685 505941315 503727074 501127090 499103165 497401657 494670143 492694283 491066589
2851.7 491066589 489824944 488681641 487486420 486882668 486340370 485986595 485889778 486262321 486136246
2860.3 486136246 485628052 485174675 484941406 484550095 483494911 482844200 481766777 480472794 479182930
2869 479182930 477940903 477058144 476062508 475424767 474617844 474109612 473553467 472605629 471689644 470683594
2878.7 470683594 470045166 469310455 468528900 467424164 466592331 465949173 464762611 463674011 462597618
2887.3D62597618m93088q08143j456948j346054j144447n57137n91163r87244j259117
2896D53954277j016922j022186r91020q64678r56230o94580j066322j079712o61087
2904.7D45601540l46947o86531j006890q81919j251831q88672j176033j772881j686554
2913.4D35903282j541557j654434j618271r16100j655235k226677j776619j007042
2921.1D23507347n85365q60062o28280j009522n73196k45896m36897O9351K9106n5504
2930.7D19211082k09159K02026O09970Q62312N02587K0942Q20427O16722M67988J086273
2940.4D24191170R73129N80482P08123R12018P17430P94830R05876O19049K41242Q50219
2950D31493568Q10433N39284R71222M46472P00988O31524N9166K99491O11268M46128
$$ plain form
2887.3 462597618 462104530 461296387 459839439 458493385 457348938 456791801 456200638 455213394 453954277
2896 453954277 452937355 451915169 450924149 450059471 449103241 448408661 447342339 446262627 445601540
2904.7 445601540 445254593 444568062 443561172 442679253 441427422 440538750 439362717 437589836 435903282
2913.4 435903282 434361725 432707291 431089020 430172920 428517685 426291008 424514389 423507347
2921.1 423507347 422921982 422061920 421433640 420424118 419850922 419605026 419168129 419237480 419266586 419211082
2930.7 419211082 419001923 419203949 419813919 420676231 421178818 421199760 422020187 422636909 423104897 424191170
2940.4 424191170 425164299 425744781 426452904 427364922 428082352 428877182 429783058 430402107 430643349 431493568
2950 431493568 432304001 432843285 433814507 434260979 434961967 435593491 435652657 435952148 436563416 437009544
2959.7D37009544K5902O11839O89583N67780N00755M60930P61299O98204Q04825M06952
2969.3D42537613N44090Q36907P61337P23686O21147P26967L63083M83856N44815R09729
2979D49053230P47223M9782N68886M5852j31378M24500N31502O59751K43760l26920
2988.6D51866188l45154L01361O12145K91214m97551k33650J06887n03196l71819m63066
2998.2D50763359l49884k50092j19743k08855q97483o06766m11949l86620o37703p81631
3007.9D46112633l46298l45078p69081q94852n21545p41654q38928q34808q66165r67675
3017.5D38986549p50312k19498p05223n61371n52368p63550r27353j366653j038475
3026.2D32101746r07860o09436q65517q43506n26390o83784q26111j481781r84230
$$ plain form
2959.7 437009544 437035446 437647285 438336868 438904648 439405403 439866333 440627632 441325836 442130661 442537613
2969.3 442537613 443081703 443918610 444679947 445403633 446024780 446751747 447114830 447598686 448143501 449053230
2979 449053230 449800453 449850235 450419121 450464973 450333595 450758095 451289597 451949348 452193108 451866188
2988.6 451866188 451521034 451822395 452434540 452725754 452228203 451994553 452101440 451598244 451226425 450763359
2998.2 450763359 450413475 450163383 450043640 449834785 448937302 448330536 447918587 447531967 446894264 446112633
3007.9 446112633 445766335 445421257 444652176 443757324 443235779 442494125 441655197 440820389 439954224 438986549
3017.5 438986549 438236237 438016739 437311516 436750145 436197777 435434227 434506874 433140221 432101746
3026.2 432101746 431193886 430584450 429718933 428875427 428349037 427665253 426839142 425357361 424373131
3034.9D24373131q01430r81789j073799r95788j38817p64389j099053o97136q02726
3043.6D17018204j218720j234054r69277j185264q07839n28412n26733j045914j328010
3052.2D08173981j293412j296653o35300r13696q05893q92906j386338r33418o48804
3060.9C99367561n83229r77897o84586o44646j140899r55887q05740o54259q84323
3069.6C92036095q18482n88875o76307j076012j033249j90735j08871p56989j210327
3078.3C85576248q31528p25097q51975q62503j059341o65741m78325p28493j183281
3087C78189964r52224n23911p64198q79174n70640l35617j091843q59833n77468r29261
3096.6C70705795k93503o56776r94530o07948o86378j014176r10187o43081q75588
$$ plain form
3034.9 424373131 423571701 422589912 421516113 420520325 420381508 419617119 418518066 417820930 417018204
3043.6 417018204 415799484 414565430 413596153 412410889 411603050 411074638 410547905 409501991 408173981
3052.2 408173981 406880569 405583916 404948616 404034920 403229027 402336121 400949783 400016365 399367561
3060.9 399367561 398784332 397806435 397121849 396477203 395336304 394380417 393574677 392920418 392036095
3069.6 392036095 391217613 390628738 389952431 388876419 387843170 387652435 387543564 386786575 385576248
3078.3 385576248 384744720 384019623 383167648 382305145 381245804 380580063 380101738 379373245 378189964
3087 378189964 377237740 376713829 375949631 375070457 374499817 374164200 373072357 372212524 371635056 370705795
3096.6 370705795 370412292 369755516 368760986 368153038 367466660 366452484 365542297 364899216 364023628
3105.3C64023628r08661j016273q65212n72967o94885q51479r36203p30515l31916
3114C57115517m21181r06754n46035o69327j185341j064682j085892j132087j240883
3122.6C48863335n85366l36189r28345j234016r93080n31922p33413o55022p43370
3131.3C42122612q08983j159706j475639k66762k17476j153488j212578o77834p18078
3140C34432068q67348o74248j128540r45434n98831r20868j246109o48918l12844j020431
3149.6C26068497q66242p78694r23080r55429j028443j194305j065350p06711q93383
3158.3C17656860o35490p89471n77736o89582j146584o20556q84323n77316j088124
3167C10647678j628799p20100m16928l04222p94353r96437j100159q17356o62174j123810
$$ plain form
3105.3 364023628 363114967 362098694 361233482 360660515 359965630 359114151 358177948 357447433 357115517
3114 357115517 356694336 355787582 355241547 354572220 353386879 352322197 351236305 350104218 348863335
3122.6 348863335 348277969 347941780 347013435 345779419 344786339 344254417 343521004 342865982 342122612
3131.3 342122612 341313629 340153923 338678284 338411522 338194046 337040558 335827980 335150146 334432068
3140 334432068 333564720 332890472 331761932 330816498 330217667 329296799 328050690 327401772 327088928 326068497
3149.6 326068497 325202255 324423561 323500481 322545052 321516609 320322304 319256954 318550243 317656860
3158.3 317656860 317021370 316231899 315654163 314964581 313817997 313197441 312313118 311735802 310647678
3167 310647678 309018879 308298779 307881851 307577629 306783276 305786839 304686680 303869324 303207150 302083340
3176.6C02083340q89340j121311q20351o69117p41043n46894q11500p08428r31148
3185.3B94844208j027146j036758j096840p48272m08630n80845p11041p81040j449451
3194B87004185r54743m56562o25496n54561o18916p94906p52678j73474r10110j082821
3203.6B80079918o30894p49721j24741n95798p48902o19240j020736o62136l25623
3212.3B74602127l28979p85523q68015n15804k12441k03609j26744n14240r29394o39038
3222B69478340j106644p91072m43497n48229o23627j151218m67415N3158j20965o83231
3231.6B63595600p33700m24060o46191l75481p60364o82259k91786n54543o80732q36716
3241.3B57609768m02088k79846o26488p55425k68325j03894m58889k91137p02916q82454
$$ plain form
3176.6 302083340 301194000 300072689 299252338 298583221 297842178 297295284 296483784 295775356 294844208
3185.3 294844208 293817062 292780304 291683464 290935192 290526562 289945717 289234676 288453636 287004185
3194 287004185 286049442 285592880 284967384 284412823 283793907 282999001 282246323 282072849 281162739 280079918
3203.6 280079918 279449024 278699303 278574562 277978764 277229862 276610622 275589886 274927750 274602127
3212.3 274602127 274273148 273487625 272619610 272103806 271891365 271687756 271561012 271046772 270117378 269478340
3222 269478340 268371696 267580624 267137127 266588898 265965271 264814053 264346638 264399796 264278831 263595600
3231.6 263595600 262861900 262437840 261791649 261416168 260655804 259973545 259681759 259127216 258446484 257609768
3241.3 257609768 257207680 256927834 256301346 255545921 255277596 255173702 254714813 254423676 253720760 252838306
3250.9B52838306l66363k78492l55835n82542p77073n45998n93719m93851j80073o83994
3260.5B47980366n97954n66044o05564l61500m52881J88942m81720j068115l03001
3269.2B43732529j00499k74543o80905m42791k65636j47171m27475q10223j55658j51139
3278.9B40276489m80461n90706k61440k48375k93484j46675n74341l20320n77392n50938
3288.5B36232357l0823m23584l10726k21271l53794m15478m42200n34573n23166k28920
3298.2B32747822k23026k41757l00636j06144n8727m63715p99503n37644J15776m02317
3307.8B29730129q90770k09255o1779m09546k77271l03631n37758m28753o20002p86877
3317.4B25204487l85094k81525m17194P7648k34031q07591j33018l16334q54702r13258
$$ plain form
3250.9 252838306 252471943 252193451 251837616 251255074 250478001 249932003 249338284 248844433 248664360 247980366
3260.5 247980366 247382412 246816368 246210804 245849304 245396423 245585365 245103645 244035530 243732529
3269.2 243732529 243632030 243357487 242676582 242233791 241968155 241820984 241393509 240583286 240427628 240276489
3278.9 240276489 239796028 239205322 238943882 238695507 238402023 238255348 237681007 237360687 236783295 236232357
3288.5 236232357 236201534 235777950 235467224 235245953 234892159 234476681 234034481 233499908 232976742 232747822
3298.2 232747822 232524796 232283039 231982403 231876259 231817532 231353817 230554314 230016670 230132446 229730129
3307.8 229730129 228839359 228630104 228568325 228158779 227881508 227577877 227040119 226611366 225991364 225204487
3317.4 225204487 224819393 224537868 224120674 224198322 223964291 223156700 223023682 222707348 221852646 220939388
3327.1B20939388q01849m39167o22788p29522m56848L0155r0161m01210l59974q40168
3336.7B16227856q45280n58414n65873o81419o94046n00355m91085k98366l45517n47523
3346.4B10699978m09222l19786k65980k08854l85628n27077m71363k02808J9474l66421
3356B07562313k40383k81086q11958n11284l06454j14193K13184K88430r7256m96960
3365.7B05204353o02455l35407J92070m85039k46525J57433o72894l49102Q0948J17798
3375.3B03061180j38416l62396j47076J08375l204l62644P5626k67m99954n62496j33362
3385.9B01035366J50681k31858m0874L44448L97911l30372n16128m3526N970L24383
3395.6B01096001j32847p08370n09014M78782L53985n08041L7803k041K37236L04146
$$ plain form
3327.1 220939388 220137539 219698372 219075584 218346062 217889214 217919369 217829208 217427998 217068024 216227856
3336.7 216227856 215382576 214824162 214258289 213576870 212882824 212382469 211891384 211593018 211247501 210699978
3346.4 210699978 210290756 209970970 209704990 209496136 209110508 208583431 208112068 207909260 207928734 207562313
3356 207562313 207321930 207040844 206228886 205717602 205411148 205296955 205510139 205798569 205701313 205204353
3365.7 205204353 204601898 204266491 204458561 203973522 203726997 203884430 203211536 202862434 202943382 203061180
3375.3 203061180 202922764 202560368 202413292 202521667 202518463 202155819 202231445 202231178 201731224 201168728 201035366
3385.9 201035366 201186047 200954189 200913315 201257763 201655674 201325302 200809174 200765648 200771618 201096001
3395.6 201096001 200963154 200254784 199745770 200224552 200578537 200070496 200108299 200106258 200343494 200647640
3405.2B00647640k88067l50933M5643L23696k57168L94726N13420j84192J5163P8907
3414.8B00938835M28124L03249P3853J02882K61040K06432J19724K60659M1618M15726
3424.5B03152142L54003K38400O6280k62317L93581O85444N88055L17402O5174J32141
3434.1B05730305O93969P82853K84519k42500m75331N96810N90190M31691P75871N32703
3443.8B09701080N00717K53163R05609P16190M96140M95167q660Q36411Q73203O27880
3453.4B15396900N63259N57556L11947M1275O22559N03387O44379R91592J004010J04789
3463.1B20741653Q8826J079101J106491J153088j6003K61097J158982O55746P24335
3471.7B26953316Q26416J311722J127491R82399O76918M60834R07688N17273M43535
$$ plain form
3405.2 200647640 200359573 200008640 200054283 200377979 200120811 200515537 201028957 200844765 200859928 200938835
3414.8 200938835 201366959 201670208 201744061 201846943 202107983 202314415 202434139 202694798 202736416 203152142
3424.5 203152142 203506145 203744545 203810825 203548508 203942089 204627533 205215588 205532990 205598164 205730305
3434.1 205730305 206424274 207207127 207491646 207249146 206773815 207370625 207960815 208392506 209168377 209701080
3443.8 209701080 210201797 210454960 211360569 212076759 212572899 213068066 213059406 213895817 214769020 215396900
3453.4 215396900 215960159 216517715 216829662 216870937 217493496 217996883 218641262 219632854 220636864 220741653
3463.1 220741653 220830479 221909580 223016071 224169159 224153156 224414253 225573235 226228981 226953316
3471.7 226953316 227779732 229091454 230218945 231201344 231878262 232339096 233246784 233764057 234207592
3480.4B34207592M48017Q89988P79419J013718J642608J019039P64218L12347Q38547
3489.1B41915493J028938O08254P69806P37724J180744J347275J564312N58624K29283
3497.8B49940453J025104R75399J309853R53006J497994J394520K3784N94082J269017
3506.5B58983212J521072J224956N98946O37417J473236J112556R49898J595078J023216
3515.1B69119587P63168R76410J316662J021881Q94528J663322J348972P18403J174793
3523.8B78997726J601677J194878J567287J461754Q73928J313725J600876R59758R14536
3532.5B90486145K108498J364631J484452J221218L49540K070580J036987J049443
3540.2C01171494J901836J800632J753407O69098J153316J390591J881561J510754
$$ plain form
3480.4 234207592 234655609 235545597 236325016 237338734 238981342 240000381 240764599 241076946 241915493
3489.1 241915493 242944431 243552685 244322491 245060215 246240959 247588234 249152546 249711170 249940453
3497.8 249940453 250965557 251940956 253250809 254203815 255701809 257096329 257120113 257714195 258983212
3506.5 258983212 260504284 261729240 262328186 262965603 264438839 265551395 266501293 268096371 269119587
3515.1 269119587 269882755 270859165 272175827 273197708 274092236 275755558 277104530 277822933 278997726
3523.8 278997726 280599403 281794281 283361568 284823322 285697250 287010975 288611851 289571609 290486145
3532.5 290486145 292594643 293959274 295443726 296664944 297014484 299085064 300122051 301171494
3540.2 301171494 303073330 304873962 306627369 307296467 308449783 309840374 311721935 313232689
3547.9C13232689J561012J620655J638489K630024O24847J422882K240944J974678
3555.6C26946220J587563P77321K612266K155991J512070J263733K190437J906929
3563.4C40952530R67636L631439P75376P48252J542511J320458L828583J869316K433014
3572C58069115K614975K086906J893234J522141J937599J341209L064576K263031J257362
3580.7C76050148K382698K966347K308578J251831L779335J447068j4878L957138K058487
3589.4C96186752K769013K728195L404312J494942J532173M549141j13907J763649
3597.1D14314270L578796K044449L588028K303734K169189K746697K276192K570800
3604.8D35592155L642540L655816M58793L516808R54284N37529P225342J964798o42204
$$ plain form
3547.9 313232689 314793701 316414356 318052845 320682869 321307716 322730598 324971542 326946220
3555.6 326946220 328533783 329311104 331923370 334079361 335591431 336855164 339045601 340952530
3563.4 340952530 341920166 345551605 346326981 347075233 348617744 349938202 353766785 355636101 358069115
3572 358069115 360684090 362770996 364664230 366186371 368123970 369465179 372529755 374792786 376050148
3580.7 376050148 378432846 381399193 383707771 384959602 388738937 390186005 390171127 394128265 396186752
3589.4 396186752 398955765 401683960 405088272 406583214 408115387 412664528 412550621 414314270
3597.1 414314270 417893066 419937515 423525543 425829277 427998466 430745163 433021355 435592155
3604.8 435592155 439234695 442890511 443349304 446866112 447820396 448357925 455583267 457548065 456905861
3613.5D56905861M629517R94606M890747M972152Q33359L252449J867485J195831L117905
3622.2D82659912L724403L250123L868179L600922K828445O562843K408791p622986
3629.9E01280632M508476N794754N708580K849541P50809L475342L992309L504219
3637.6E31864662K226601K596550L566131L507004J885987J028480L137169N215835
3645.3E55028419P208825N84564j603775Q591804K442894k801284P68737N412407M232674
3654E79865265M229927N494118n374337K844429N488968K027054K768402J840325L491440
3662.7F02675591K214813J895256J996383J184082N500718L345680J81847J466484
3670.4F20460854n487976L016586Q368912R328842J248283j7172813K070427Q631668
$$ plain form
3613.5 456905861 461535378 462529984 467420731 472392883 473226242 476478691 478346176 479542007 482659912
3622.2 482659912 486384315 489634438 493502617 497103539 499931984 506494827 508903618 501280632
3629.9 501280632 505789108 511583862 517292442 520141983 520892792 524368134 528360443 531864662
3637.6 531864662 534091263 536687813 540253944 543760948 545646935 546675415 549812584 555028419
3645.3 555028419 562237244 562821808 561218033 569809837 572252731 569451447 570220184 575632591 579865265
3654 579865265 584095192 589589310 584214973 587059402 592548370 594575424 597343826 599184151 602675591
3662.7 602675591 604890404 606785660 608782043 609966125 615466843 618812523 618994370 620460854
3670.4 620460854 614972878 617989464 626358376 635687218 636935501 619762688 621833115 630464783
3678.1F30464783O340255j638870k81753K857551K498207K219620P26395K746M230118
3686.8F47419052P415619q243561k249069Q640823n942764N55191N543366J012878
3694.5F54151535K012558M46320p0191J553650R19647L411866K879867n965805j306457
3703.2F58032990N249710J514816k69165M76456L334808L859634q006286M130401O455460
3711.9F74778824j1851807L856049M278183M10690O50406K169266K004623l635406
3719.6F72660828P48062O709671l241577n150910N104752J394806p17545k535553K71225
3728.3F75243759L385086J293183O361770k434845p774505R462585J832199j0553894
3736F76815338r07059L769226K445603K435989K274475l906402L438568J1889114r991302
$$ plain form
3678.1 630464783 636805038 635166168 634884415 637741966 640240173 642459793 643186188 643188934 647419052
3686.8 647419052 654834671 646591110 644342041 652982864 647040100 647595291 653138657 654151535
3694.5 654151535 656164093 656610413 656540222 658093872 659013519 662425385 665305252 659339447 658032990
3703.2 658032990 663282700 664797516 664528351 665004807 668339615 672199249 664192963 668323364 674778824
3711.9 674778824 662927017 666783066 671061249 671471939 672122345 674291611 676296234 672660828
3719.6 672660828 673408890 680118561 676876984 671726074 676830826 678225632 677508087 674972534 675243759
3728.3 675243759 678628845 679922028 686283798 683848953 676074448 685537033 687369232 676815338
3736 676815338 675908279 679677505 682123108 684559097 686833572 682927170 686365738 698254852 688263550
3744.7F88263550j6266709R304657N846405O745224l776550j0295410J2276611m444275
3752.4F87653503p426834N687867M549331K964554n149612K982025N628509p917480
3760.1F88971863j158753L833084O60477L25775L572998l043441m005204M285813M630432
3768.8F98073044l42941q505707K304382L732376J73264M32663k87705Q83255M120
3777.4F96466751K526779j7929p249832L102112K335586J409913K968978l503036j621246
3786.1F96418076J823654R31396O90155r2468k99377l67432L72925J17874J551742
3794.8G01146545L195496m583054m417572L143998M648666N936813n890808r899521
3802.5F93280563L531952K373505M822388N430221r884338l541794M839859J692505
$$ plain form
3744.7 688263550 671996841 681301498 687147903 693893127 690116577 679821167 692097778 687653503
3752.4 687653503 680226669 685914536 690463867 693428421 688278809 691260834 696889343 688971863
3760.1 688971863 687813110 691646194 692306671 692632446 696205444 693162003 689156799 693442612 698073044
3768.8 698073044 697730103 689224396 691528778 695261154 695434418 695867081 695579376 696462631 696466751
3777.4 696466751 698993530 698975601 691725769 694827881 697163467 698573380 701542358 698039322 696418076
3786.1 696418076 698241730 699173126 699863281 699770813 699471436 699104004 699476929 699594803 701146545
3794.8 701146545 704342041 699758987 695341415 698485413 703134079 709070892 703180084 693280563
3802.5 693280563 696812515 699186020 704008408 709438629 699554291 696012497 700852356 702544861
3810.2G02544861K23541L93295j71890J204071N485916k399444j4736710N285645O596908
3818.9G04426193N648499K658462j7922897J613464O307068K781754K032928r82971
3826.6G06562500m459839K92053K165375L307037J933594q681869J811065O576767
3834.3G09506683n608978J018295Q571701j0427169o104203P776261n195771K28882
3842.1F99765701Q173676k222138l696823K907791R38797O13556K139283q36182J787262
3850.7G09570923M918442n398713J175614j5922699J517639J0449677j542511j798020
3858.4G02970352L052292L485260K838898o314469j28555P109070n413666o376266
3866.2G01222916L720550N790634N950013r239960r698486M711380P357406L834381
$$ plain form
3810.2 702544861 702768402 703161697 702989807 704193878 709679794 707280350 692543640 697829285 704426193
3818.9 704426193 710074692 712733154 694810257 696423721 702730789 705512543 707545471 706562500
3826.6 706562500 702102661 702394714 704560089 707867126 709800720 701118851 702929916 709506683
3834.3 709506683 703897705 704916000 713487701 703060532 696956329 704732590 699536819 699765701
3842.1 699765701 707939377 705717239 702020416 704928207 705867004 706480560 708619843 707783661 709570923
3850.7 709570923 714489365 709090652 710266266 694343567 695861206 706310883 704768372 702970352
3858.4 702970352 706022644 709507904 712346802 706032333 705903778 713012848 707599182 701222916
3866.2 701222916 704943466 710734100 716684113 707444153 697745667 702457047 709814453 713648834
3873.9G13648834j1407242O2333M227447Q17108L632736M625779p037735p805863N715866
3882.6G06479263J259537J913605N083313j2655106J100006L787232P72171M710388
3890.3G12450409j226807r497680J718139M154511j229325J355439J400604K219009
3898G11344299K426606r521943L895798J011276n067672N687103k563095j563645P29599
3906.7G06378326J009064K125473j83792p4692j115417l79639N70908r8648J269378
3915.3G09500961K090836l818436k951431M765472r78393l912506K890320K113571
3923.1G09700394Q54721k122574k403870J973419J771470L15399k023316m69513K109375
3931.7G09705505j668930j021118P24716l00445m7913l09067K17896M38690j69372
$$ plain form
3873.9 713648834 702241592 702303925 706531372 707348480 710981216 715606995 708569260 700763397 706479263
3882.6 706479263 707738800 709652405 714735718 702080612 703180618 706967850 707740021 712450409
3890.3 712450409 711223602 701725922 703444061 707598572 706369247 707724686 709125290 711344299
3898 711344299 713770905 704248962 708144760 709156036 704088364 709775467 707212372 705648727 706378326
3906.7 706378326 707387390 709512863 709329071 709254379 708138962 707759323 708330231 708231583 709500961
3915.3 709500961 711591797 707773361 704821930 709587402 708609009 704696503 707586823 709700394
3923.1 709700394 710555115 708432541 706028671 708002090 709773560 710088959 708065643 707596130 709705505
3931.7 709705505 708036575 707015457 707740173 707439728 707391815 707082748 707300644 707739334 707569962
3940.4G07569962J150207J203384k667617p18537J071778J39846L95432k116241J276702
3949.1G07304916J644898k430420J341171L81851m51202N4703n76172P42035l10822
3957.8G07700958L75214N93643P21817L94669j344300J36567L43627l58505m42428
3966.5G08121262j73188m14047m59061P02362Q25196l25165j252213l32260J97907
3975.1G06890793L73230L50799P85218Q94088k90527k75116j44272L4027o01654j08947
3984.8G07907639K72064p76062N5313O62918Q47397n16358k29873L47137l65219P46155
3994.4G08951111o95343o87332L84292O81381O22559p40967
4000.2G08515701
$$ plain form
3940.4 707569962 708720169 709923553 707255936 706537399 707609177 707749023 708144455 706028214 707304916
3949.1 707304916 708949814 706519394 707860565 708242416 707791214 707845917 707269745 708011780 707700958
3957.8 707700958 708076172 708669815 709391632 709786301 708442001 708578568 708922195 708563690 708121262
3966.5 708121262 707948074 707534027 707074966 707777328 708602524 708277359 707025146 706692886 706890793
3975.1 706890793 707264023 707614822 708400040 709294128 709003601 708728485 708584213 708618240 708016586 707907639
3984.8 707907639 708179703 707403641 707458954 708121872 708969269 708452911 708223038 708570175 708204956 708951111
3994.4 708951111 708255768 707568436 707952728 708634109 709256668 708515701
4000.2 708515701
##END=$$ End of the data block
