##TITLE=$$ Begin of the data block
##JCAMP-DX=5.00 $$ ACD/SpecManager v 10.08
##SPECTROMETER/DATA SYSTEM=Varian
##DATE=08 Jan 2013 16:21:14
##DATA TYPE=INFRARED SPECTRUM
##DATA CLASS=XYDATA
##ORIGIN=
##OWNER=
##NPOINTS=3735
##FIRSTX=399.26403809
##LASTX=4000.35498047
##MAXX=4000.35498047
##MINX=399.26403809
##MAXY=74.13877106
##MINY=24.93537712
##XFACTOR=1.0000000000
##YFACTOR=0.000000100000000
##FIRSTY=47.63451385
##DELTAX=0.96440572
##XUNITS=1/CM
##YUNITS=TRANSMITTANCE
##XYDATA=(X++(Y..Y))
$$ plain form
399.3 476345139 472681503 459986572 469437027 470320473 458492317 452444801 455485573 460605392
407 460605392 453473625 456794128 471775589 472648430 467225990 464112358 462882004 462745895 461314621
415.7 461314621 459239693 461990433 471340637 467997169 462654381 457795639 455570679 454025383
423.4 454025383 450277748 457613602 462771034 456749840 453630829 454313049 456931152 456999474 455031090
432.1 455031090 455487785 456078758 452803383 450668602 455903435 457110710 455165787 454607430 456130066
440.7 456130066 460403824 457029305 453982849 456481628 455019913 454756012 458864174 462057838 464371643
449.4 464371643 463662529 459042625 454210167 454978943 457208557 456646996 455358696 449127426 444547577
458.1 444547577 448494034 450504913 452769127 450051765 451164856 455850792 456644096 455110054 450748787
$$ packed form
399.3D76345139l663636j2694931R450455Q83446j1828156o047516L040772N119819
407D60605392p131767L320503J4981461Q72841n422440l113632j230354j36109j431274
415.7D61314621k074928K750740R350204l343468n342788m858742k224960j545296
423.4D54025383l747635P335854N157432o021194l119011O82220K618103O8322j968384
432.1D55031090M56695N90973l275375k134781N234833J207275j944923n58357J522636
440.7D56130066M273758l374519l046456K498779j461715k63901M108162L193664K313805
449.4D64371643p09114m619904m832458P68776K229614n61561j288300o231270m579849
458.1D44547577L946457K010879K264214k717362J113091M685936P93304j534042m361267
$$ plain form
466.8 450748787 451737099 453452911 449362221 446723709 447087898 445050926 439076576 442129784 446021309
475.5 446021309 448572388 450170937 445510559 443486557 444385757 442699890 440486450 440738525 443227921
484.1 443227921 444550095 441936264 439378967 442452774 444388733 443137016 440773125 435972939
491.8 435972939 432973137 435796661 438365364 436857719 437128334 438199081 439371758 437034683 436174812
500.5 436174812 439981155 437430687 437103882 437748833 436652794 435159531 432554893 435848351 436584282
509.2 436584282 434519196 432463074 429855652 431155052 434250336 435168190 434035225 433314362 431395798
517.9 431395798 429135780 427019539 425715065 425419769 425100479 426681519 428715286 429972191 426622772
526.6 426622772 423991966 425295792 425750542 425495415 423524666 422125740 423217125 424740067 426249847
$$ packed form
466.8D50748787R88312J715812m090690k638512L64189k036972n974350L053208L891525
475.5D46021309K551079J598549m660378k024002Q99200j685867k213440K52075K489396
484.1D43227921J322174k613831k557297L073807J935959j251717k363891m800186
491.8D35972939k999802K823524K568703j507645K70615J070747J172677k337075q59871
500.5D36174812L806343k550468l26805O44951j096039j493263k604638L293458P35931
509.2D36584282k065086k056122k607422J299400L095284R17854j132965p20863j918564
517.9D31395798k260018k116241j304474k95296l19290J581040K033767J256905l349419
526.6D26622772k630806J303826M54750k55127j970749j398926J091385J522942J509780
$$ plain form
535.2 426249847 426618614 424971085 424074516 426025734 425910530 422965355 421030998 421463394 422591438
543.9 422591438 422028656 421145554 418918457 417081451 417867088 419815063 420515175 418670425 416694298
552.6 416694298 416772346 419277649 419673538 416871071 413718491 412941704 414362640 413837585 413790283
561.3 413790283 414576302 414720192 415502129 415877266 415471306 415746307 415931320 414597816 414300156 414652290
570.9 414652290 415276680 415279236 414189491 414240036 413678932 413110542 412187805 412011719 413811874 414223061
580.6 414223061 413098335 412016182 412857132 413836288 413839455 414016609 414045715 415482750 416330299 414377251
590.2 414377251 413771935 416515579 417319717 417158241 417558022 417392082 416893425 415257530 414615974
598.9 414615974 414506187 414773293 415943527 416704903 417374306 416993942 416228561 415508423 415471725 415574493
$$ packed form
535.2D26249847L68767j647529q96569J951218j15204k945175j934357M32396J128044
543.9D22591438n62782q83102k227097j837006P85637J947975P00112j844750j976127
552.6D16694298P8048K505303L95889k802467l152580p76787J420936n25055m7302
561.3D13790283P86019J43890P81937L75137m05960K75001J85013j333504k97660L52134
570.9D14652290O24390K556j089745N0545n61104n68390r22737j76086J800155M11187
580.6D14223061j124726j082153Q40950R79156L167J77154K9106J437035Q47549j953048
590.2D14377251o05316K743644Q04138j61476L99781j65940m98657j635895o41556
598.9D14615974j09787K67106J170234P61376O69403l80364p65381p20138l6698J02768
$$ plain form
608.5 415574493 415434418 415272903 413940773 413308640 412380753 411223679 410244637 409246826 410103645
617.2 410103645 412179375 413852692 413474236 412728996 412026329 412557411 413723488 413266525 414259796
625.9 414259796 416051445 418907127 420913353 421102676 422886314 424669342 425618362 426301956 427425957
634.6 427425957 428492813 429943962 432088852 433290901 433732033 433404732 434215775 436285515 438088493
643.3 438088493 438963928 439093399 440730019 443128052 443981323 443173752 443649864 445262833 446820602
651.9 446820602 448472099 448337936 448483696 448320084 447132034 446784439 446022034 446778221 448464584
660.6 448464584 449247017 449365349 449094810 449330482 449078941 448333321 447833748 449952736 451060944
669.3 451060944 450922928 451001549 452122841 453115005 452766151 453029175 453808212 455609703 457595634
$$ packed form
608.5D15574493j40075j61515j332130o32133r27887j157074r79042r97811Q56819
617.2D10103645K075730J673317l78456p45240p02667N31082J166077m56963R93271
625.9D14259796J791649K855682K006226J89323J783638J783028R49020O83594J124001
634.6D27425957J066856J451149K144890J202049M41132l27301Q11043K069740J802978
643.3D38088493Q75435J29471J636620K398033Q53271q07571M76112J612969J557769
651.9D46820602J651497j34163J45760j63612j188050l47595p62405P56187J686363
660.6D48464584P82433J18332k70539K35672k51541p45620m99573K118988J108208
669.3D51060944j38016P8621J121292R92164l48854K63024P79037J801491J985931
$$ plain form
678 457595634 458358269 459841385 461341972 461861191 462466812 464476776 465980301 465325203 464783974
686.7 464783974 466062355 468291550 469154739 469833717 470172005 469493370 470527992 472418098 473070564
695.3 473070564 473633308 474397240 474520988 475140533 475192680 475513573 477244034 477963562 478835716 479496994
705 479496994 479909019 479818687 479520607 481019249 482172432 483638420 484718552 484923439 485065842 485238152
714.6 485238152 486432991 487145805 488148537 488837776 490404663 491942406 491568184 492765045 493410492
723.3 493410492 493699989 493468781 493473854 495424118 496851883 498683777 500038300 500785522 501292458
732 501292458 501920395 502541237 501903114 502096252 503391418 504549217 504644547 504908791 504571686 504541702
741.6 504541702 506666679 508066101 508708458 508824654 509825630 510219688 509996262 511703072 512348251
$$ packed form
678D57595634P62635J483116J500587N19219O05621K009964J503525o55098n41229
686.7D64783974J278381K229195Q63189O78978L38288o78635J034622J890106O52466
695.3D73070564N62744P63932J23748O19545N2147L20893J730461P19528Q72154O61278
705D79496994M12025r0332k98080J498642J153183J465988J080132K04887J42403J72310
714.6D85238152J194839P12814J002732O89239J566887J537743l74222J196861O45447
723.3D93410492K89497k31208N073J950264J427765J831894J354523P47222N06936
732E01292458O27937O20842o38123J93138J295166J157799R5330K64244l37105k9984
741.6E04541702K124977J399422O42357J16196J000976L94058k23426J706810O45179
$$ plain form
750.3 512348251 512149467 511988907 512888794 514011536 514395218 514867935 515116577 516829681 518856468
759 518856468 520512161 521614151 522432899 522688179 522354546 523363800 524654236 526565704 526783142
767.7 526783142 525265694 525176544 526897049 528574142 528066673 527799225 527493935 527932968 528846130
776.4 528846130 528409309 527996292 527951660 528789330 528685036 528812675 529532547 529926300 530331650 530359421
786 530359421 530914154 530996399 532067375 532443352 531888466 532605438 532681084 532532616 532084961 531920319
795.6 531920319 531611595 531219597 530635414 529729919 529610405 529380798 528969727 527436485 525863724
804.3 525863724 523393707 520798111 519387093 517128944 516177444 515719948 514855766 513479996 511819267
813 511819267 510826492 508907623 507331161 506657333 505897713 505017052 505019455 505953827 506366501 506339569
$$ packed form
750.3E12348251j98784j60560Q99887J122742L83682M72717K48642J713104K026787
759E18856468J655693J101990Q18748K55280l33633J009254J290436J911468K17438
767.7E26783142j517448q9150J720505J677093n07469k67448l05290M39033R13162
776.4E28846130m36821m13017m4632Q37670j04294J27639P19872L93753M05350K7771
786E30359421N54733Q2245J070976L75977n54886P16972P5646j48468m47655j64642
795.6E31920319l08724l91998n84183r05495j19514k29607m11071j533242j572761
804.3E25863724k470017k595596j411018k258149r51500m57496q64182j375770j660729
813E11819267r92775j918869j576462o73828p59620q80661K403R34372M12674k6932
$$ plain form
822.6 506339569 507046280 508698997 510596466 512953644 515170250 517696075 520015221 522078934 525066299
831.3 525066299 527626305 530313797 532235336 534616928 537584190 540449219 543644714 544227676 545559273
840 545559273 547770271 549820862 552023010 553570900 555879593 557443237 558733788 558790054 559176750
848.7 559176750 560541725 562062187 564308090 565427933 566909447 568287888 569957428 571315231
856.4 571315231 572936249 574844551 575978165 578035774 578543701 579854736 580797386 580343246 580013237
865.1 580013237 579813499 580937729 580833626 581330490 580498009 578330116 576045647 574069710 574385109
873.8 574385109 573851051 573790474 573094444 572504158 572025452 570547523 569886246 568381271 567548370 566725082
883.4 566725082 566347542 565586739 564898300 565476227 564851875 564208603 562837448 562422485 561860275 560729179
$$ packed form
822.6E06339569P06711J652717J897469K357178K216606K525825K319146K063713K987365
831.3E25066299K560006K687492J921539K381592K967262K865029L195495N82962J331597
840E45559273K210998K050591K202148J547890K308693J563644J290551N6266L86696
848.7E59176750J364975J520462K245903J119843J481514J378441J669540J357803
856.4E71315231J621018J908302J133614K057609N07927J311035R42650m54140l30009
865.1E80013237j99738J124230j04103M96864q32481k167893k284469j975937L15399
873.8E74385109n34058o0577o96030n90286m78706j477929o61277j504975q32901q23288
883.4E66725082l77540p60803o88439N77927o24352o43272j371155m14963n62210j131096
$$ plain form
893 560729179 560820885 561019287 562556686 563678436 563767929 562982292 562458496 561905594 561192398 561187935
902.7 561187935 560760765 562355461 564445000 565635529 566145020 567388763 569707985 570765800 571881218
911.4 571881218 571701584 571390381 570835342 569071503 567158623 565756721 565078316 562728539 560788460
920 560788460 558730431 555779037 552473526 549172058 546698418 543516388 540747414 537653351 534896011
928.7 534896011 532716293 530685883 528495140 524917831 522787933 521789970 521330452 520917206 520152931
937.4 520152931 519350586 518151932 517535286 515932693 514441071 513890305 513908043 514194298 513474083
946.1 513474083 512645264 511894569 511644211 511459351 511603546 511753540 511857071 511877022 510297279 508656158
955.7 508656158 506526299 504189034 501926155 499920082 498567619 497049294 495771523 492888870
$$ packed form
893E60729179R1706J98402J537399J121750Q9493p85637n23796n52902p13196m463
902.7E61187935m27170J594696K089539J190529N09491J243743K319222J057815J115418
911.4E71881218j79634l11203n55039j763839j912880j401902o78405k349777j940079
920E60788460k058029k951394l305511l301468k473640l182030k768974l094063k757340
928.7E34896011k179718k030410k190743l577309k129898r97963m59518m13246p64275
937.4E20152931q02345j198654o16646j602593j491622n50766J7738K86255p20215
946.1E13474083q28819p50695k50358j84860J44195J49994J03531J9951j579743j641121
955.7E08656158k129859k337265k262879k006073j352463j518325j277771k882653
$$ plain form
963.4 492888870 489982376 487892151 485675583 484177399 482130089 480219040 478717613 476941566
971.2 476941566 474732513 472215691 469208984 465579948 462379684 458981934 455329933 452112160
978.9 452112160 448900108 444543076 439286423 434465027 429781227 425153465 420734100 416087303
986.6 416087303 411413460 406750298 402270393 397817383 393424454 389764252 385646248 381410904
994.3 381410904 377657318 374290504 371307564 368281021 365495720 362156258 359357452 356786041
1002 356786041 354376869 352831688 351150703 349744987 348021889 346575813 344753304 343175583 342210922
1010.7 342210922 340587921 339278030 337342186 335697899 333774529 331081810 328901024 326900673
1018.4 326900673 325068398 322721977 319879990 317089291 315606575 313503304 311222649 309512787
$$ packed form
963.4D92888870k906494k090225k216568j498184k047310j911049j501427j776047
971.2D76941566k209053k516822l006707l629036l200264l397750l652001l217773
978.9D52112160l212052m357032n256653m821396m683800m627762m419365m646797
986.6D16087303m673843m663162m479905m453010m392929l660202m118004m235344
994.3C81410904l753586l366814k982940l026543k785301l339462k798806k571411
1002C56786041k409172j545181j680985j405716j723098j446076j822509j577721r64661
1010.7C42210922j623001j309891j935844j644287j923370k692719k180786k000351
1018.4C26900673j832275k346421k841987k790699j482716k103271k280655j709862
$$ plain form
1026.1 309512787 307185650 305788860 303791771 302633305 301800480 300675316 299773808 298366508 298184166
1034.8 298184166 298146915 298857117 299441528 300338554 301443501 302674999 304747715 305005589 305072594
1043.5 305072594 305590134 306447830 305877132 305208950 305310745 303917351 303512497 302818909 302017403
1052.2 302017403 300843506 300066452 299499130 297839394 296969051 295873985 296600342 296914959 298190098
1060.9 298190098 300650997 301962700 304508953 306355591 308929119 310733280 312167549 313476791
1068.6 313476791 314376774 316178703 316960373 318688545 319326706 319744263 320290642 320763092 322295723
1077.2 322295723 322494278 323549919 324161072 324183655 324622116 325724258 327236519 328791542 331299667
1085.9 331299667 332335243 333279228 334139633 335270958 336752357 338159256 340616989 342020798 343432503
$$ packed form
1026.1C09512787k327137j396790j997089j158466q32825j125164r01508j407300j82342
1034.8B98184166l7251P10202N84411Q97026J104947J231498K072716K57874O7005
1043.5C05072594N17540Q57696n70698o68182J01795j393394m04854o93588q01506
1052.2C02017403j173897p77054n67322j659736q70343j095066P26357L14617J275139
1060.9B98190098K460899J311703K546253J846638K573528J804161J434269J309242
1068.6C13476791Q99983J801929P81670J728172O38161M17557N46379M72450J532631
1077.2C22295723J98555J055641O11153K2583M38461J102142J512261J555023K508125
1085.9C31299667J035576R43985Q60405J131325J481399J406899K457733J403809J411705
$$ plain form
1094.6 343432503 345004005 346353607 347238235 348458290 350021896 350531654 351959114 353791199 355906677
1103.3 355906677 357647247 358646545 359239769 359809685 360793114 360933151 361790085 362645264 363311119
1112 363311119 364669342 365896301 366794739 367305527 367698174 367269020 367601242 368306007 368050499 367320404
1121.6 367320404 367397003 368182068 367304382 367471352 368677597 369882011 371607513 373373947 375290031
1130.3 375290031 376514511 378913155 381453896 383530731 385097008 385554085 387331581 390253067
1138 390253067 392911301 394492912 395949326 396897850 397299767 398395119 399483719 400596581 401525764
1146.7 401525764 402517090 402947044 402967949 403180695 402944145 402672462 401782112 401421547 401882477 401453857
1156.3 401453857 400535316 399959488 399524574 398513527 397727852 397334290 397379417 398051987 399327927
$$ packed form
1094.6C43432503J571502J349602Q84628J220055J563606N09758J427460J832085K115478
1103.3C55906677J740570R99298N93224N69916R83429J40037Q56934Q55179O65855
1112C63311119J358223J226959Q98438N10788L92647m29154L32222P04765k55508p30095
1121.6C67320404P6599P85065q77686J66970J206245J204414J725502J766434J916084
1130.3C75290031J224480K398644K540741K076835J566277M57077J777496K921486
1138C90253067K658234J581611J456414R48524M01917J095352J088600J112862R29183
1146.7D01525764R91326M29954K0905K12746k36550k71683q90350l60565M60930m28620
1156.3D01453857r18541n75828m34914j011047p85675l93562M5127O72570J275940
$$ plain form
1165 399327927 401186905 402636185 403830719 405366058 407731476 410509605 413352051 415965881 418585014
1173.7 418585014 421076241 423614693 426861687 429563942 432278671 434500504 436258202 438744507
1181.4 438744507 440713310 442424774 444197731 445663033 447094955 448330383 449507828 450529823
1189.1 450529823 450914650 451121407 451159325 451084061 450781288 450227394 449832268 448835297 447916985 447555733
1198.8 447555733 446659546 445455132 444597626 443879089 443251801 442716560 442255211 441791954 440869179
1207.4 440869179 440160522 439890785 439644547 439416618 439180527 439391747 439370575 439260674 439428444 438791084
1217.1 438791084 438278313 438391228 438355331 438301659 438119087 437819748 437897453 437947083 437431602 436663246
1226.7 436663246 435764885 435211945 434590492 433603859 433046341 432627258 432222977 431509132 430479965
$$ packed form
1165C99327927J858978J449280J194534J535339K365418K778129K842446K613830K619133
1173.7D18585014K491227K538452L246994K702255K714729K221833J757698K486305
1181.4D38744507J968803J711464J772957J465302J431922J235428J177445J021995
1189.1D50529823L84827K06757L7918p5264l02773n53894l95126r96971r18312l61252
1198.8D47555733q96187j204414q57506p18537o27288n35241m61349m63257r22775
1207.4D40869179p08657k69737k46238k27929k36091K11220k1172j09901J67770o37360
1217.1D38791084n12771J12915l5897n3672j82572k99339P7705M9630n15481p68356
1226.7D36663246q98361n52940o21453r86633n57518m19083m04281p13845j029167
$$ plain form
1235.4 430479965 430044823 429745331 429184990 428948898 429053421 428990440 428808212 428550949 427930183 427179947
1245 427179947 426560745 426274261 425835876 425315552 425122414 424631653 424543495 424656868 424409599 424409103 424244232
1255.7 424244232 424062996 423890800 423633652 423574524 423681335 423845024 424151840 424659195 425000153 425681572
1265.3 425681572 426501160 427180367 427809715 428234901 428924866 430044861 431363258 432253761 433078957
1274 433078957 434114876 435257225 436338539 437343636 438485336 439421806 440558014 441620140 442762299
1282.7 442762299 444295883 445686798 447086487 448623009 450133743 451251717 452377167 453557510
1290.4 453557510 454469376 454963913 455669670 456584740 457334442 458327446 459098854 459882851 460353966 460594673
1300 460594673 460829659 461001892 461261635 461245880 461683998 461813316 461677475 461506271 461076393 460961914
$$ packed form
1235.4D30479965m35142k99492n60341k36092J04523o2981j82228k57263o20766p50236
1245D27179947o19202k86484m38385n20324j93138m90761q8158J13373k47269m96j64871
1255.7D24244232j81236j72196k57148n9128J06811J63689L06816N07355L40958O81419
1265.3D25681572Q19588O79207O29348M25186O89965J119995J318397Q90503Q25196
1274D33078957J035919J142349J081314J005097J141700R36470J136208J062126J142159
1282.7D42762299J533584J390915J399689J536522J510734J117974J125450J180343
1290.4D53557510R11866M94537P05757R15070P49702R93004P71408P83997M71115K40707
1300D60594673K34986J72233K59743j5755M38118J29318j35841j71204m29878j14479
$$ plain form
1309.7 460961914 460592346 460140305 459428940 458814125 458573837 458668289 458740425 458390808 458692894 459126892
1319.3 459126892 459683418 460700226 461979256 462918015 463365784 464155922 464623833 464775963 464692116
1328 464692116 465046310 465466347 465315132 465210609 464657021 464018059 463417549 463154182 463026886 463019409
1337.6 463019409 463350639 463283348 463433609 463813057 464542770 464904022 465147743 465842323 466624718 467649498
1347.3 467649498 467910881 468332405 468611031 468292847 467724190 467053757 467091293 467048264 466842346 466270905
1356.9 466270905 465938034 465778999 465431061 464860077 464299049 464299088 462969971 463001709 463252373 462615891
1366.6 462615891 461932068 460705414 460161018 459592438 459620285 460137100 460104218 459811974 459686089 460021744
1376.2 460021744 459375458 458604660 458126869 458248291 458579674 458369560 457642937 456052094 455026550
$$ packed form
1309.7D60961914l69568m52041p11365o14815k40288R4452P2136l49617L02086M33998
1319.3D59126892N56526J016808J279030R38759M47769P90138M67911J52130q3847
1328D64692116L54194M20037j51215j04523n53588o38962o00510k63367j27296p477
1337.6D63019409L31230o7291J50261L79448P29713L61252K43721O94580P82395J024780
1347.3D67649498K61383M21524K78626l18184n68657o70433L7536m3029k05918n71441
1356.9D66270905l32871j59035l47938n70984n61028L9j329117L1738K50664o36482
1366.6D62615891o83823j226654n44396n68580K7847N16815l2882k92244j25885L35655
1376.2D60021744o46286p70798m77791J21422L31383k10114p26623j590843j025544
$$ plain form
1384.9 455026550 454010582 452969933 450884361 449241600 448801346 447845078 446548767 444489365 442776222
1393.6 442776222 440010986 436825905 435511742 433769951 432592850 429928131 427508163 426045303
1401.3 426045303 423939819 422047005 420139656 417150040 414498444 413817978 412893715 411185760 409746857
1409.9 409746857 407839928 406249199 404633064 403213730 402371674 401676483 401515350 401022720 401144600
1418.6 401144600 400210342 399410706 399974327 399911690 400122910 399968948 401130066 402531319 402950974
1427.3 402950974 403862457 404726448 405720367 406472130 407955551 409481697 410878067 412624779 413491516
1436 413491516 414804802 416466827 418401031 419661255 420942802 422665100 423938332 425222168 425741577
1444.7 425741577 426981430 428471909 429866104 430094452 430784798 432820358 434401627 436024590 436631126
$$ packed form
1384.9D55026550j015968j040649k085572j642761m40254r56268j296311k059402j713143
1393.6D42776222k765236l185081j314163j741791j177101k664719k419968j462860
1401.3D26045303k105484j892814j907349k989616k651596o80466r24263j707955j438903
1409.9D09746857j906929j590729j616135j419334q42056o95191j61133m92630J21880
1418.6D01144600r34258p99636N63621o2637K11220j53962J161118J401253M19655
1427.3D02950974R11483Q63991R93919P51763J483421J526146J396370J746712Q66737
1436D13491516J313286J662025J934204J260224J281547J722298J273232J283836N19409
1444.7D25741577J239853J490479J394195K28348O90346K035560J581269J622963O06536
$$ plain form
1453.3 436631126 438073349 439544144 439988289 441236649 441896629 445360451 446800728 448839989 450225220
1462 450225220 451355247 453427467 453841171 455983429 458098755 460686302 462906303 465302582 468506622
1470.7 468506622 471022530 474427147 476141243 478595619 480851631 482489243 485141106 487791519
1478.4 487791519 490094681 491962929 493720436 495068550 496846848 498827133 500385933 502071991
1486.1 502071991 503507233 504014091 505445442 505138092 503118858 503581619 503806229 503538170 502969627
1494.8 502969627 501628342 496767769 496675987 495442162 492527466 492322655 491176338 490001221 489299431
1503.5 489299431 489999733 490959663 488127480 482084503 481349831 482716980 482374153 483428726 482692070
1512.2 482692070 480537300 480315933 479137154 478210487 476467247 475246811 476322517 477697754 476534348
$$ packed form
1453.3D36631126J442223J470795M44145J248360O59980L463822J440277K039261J385231
1462D50225220J130027K072220M13704K142258K115326K587547K220001K396279L204040
1470.7D68506622K515908L404617J714096K454376K256012J637612K651863K650413
1478.4D87791519K303162J868248J757507J348114J778298J980285J558800J686058
1486.1E02071991J435242N06858J431351l07350k019234M62761K24610k68059n68543
1494.8E02969627j341285m860573r1782j233825k914696k04811j146317j175117p01790
1503.5D89299431P00302R59930k832183o042977p34672J367149l42827J054573p36656
1512.2D82692070k154770k21367j178779r26667j743240j220436J075706J375237j163406
$$ plain form
1520.8 476534348 473735466 475197563 476252251 478020248 477700882 478212204 479851990 480397186 481878281
1529.5 481878281 483394470 484666977 485610275 485861893 485592880 487180176 488248978 489380760 491902313
1538.2 491902313 493685913 491213455 490071182 490443039 490369492 491981049 494091606 494444313 495963364
1546.9 495963364 496641808 497826653 498063087 496868477 497875175 498451042 499191475 496365166 497150764
1555.6 497150764 499495888 501029129 497793007 486625977 492570305 493008118 493646889 492406387
1563.3 492406387 491056747 488651466 486037674 485024223 482860756 481754875 473775826 471730385
1571 471730385 470055237 466633873 464199104 461556740 460010910 447775307 446073074 442862396
1578.7 442862396 438513412 434543877 429421883 425976562 420023270 416065712 410797997 406654892
$$ packed form
1520.8D76534348k798882J462097J054688J767997l19366N11322J639786N45196J481095
1529.5D81878281J516189J272507R43298K51618k69013J587296J068802J131782K521553
1538.2D91902313J783600k472458j142273L71857p3547J611557K110557L52707J519051
1546.9D95963364O78444J184845K36434j194610J006698N75867P40433k826309P85598
1555.6D97150764K345124J533241l236122j1167030N944328M37813O38771j240502
1563.3D92406387j349640k405281k613792j013451k163467j105881p979049k045441
1571D71730385j675148l421364k434769k642364j545830j2235603j702233l210678
1578.7D42862396m348984l969535n121994l445321n953292l957558n267715m143105
$$ plain form
1586.4 406654892 402432175 397120094 393509789 387180634 383767166 378542557 375604515 371717033
1594.1 371717033 366092834 362656860 357438087 355428696 350933838 348418198 344489784 340442963
1601.9 340442963 337907753 333828964 332709694 328824310 327381783 324024773 322220421 320550613
1609.6 320550613 317254543 317137470 314339199 314497108 312418461 312573776 312685585 307325306 308899078
1618.2 308899078 307400188 308378696 306886940 308152523 307688065 305824413 307782211 306981144 308913670
1626.9 308913670 307620850 309279022 309920464 310616302 311728401 311783295 314474621 314588184 317402534
1635.6 317402534 315522289 318542957 320676460 321811829 324559364 325336990 328062363 328298912 330765953
1644.3 330765953 332482529 332687569 337723427 336335411 339081573 339738808 342682381 344732933 344339218
$$ packed form
1586.4D06654892m222717n312081l610305o329155l413468n224609k938042l887482
1594.1C71717033n624199l435974n218773k009391m494858k515640l928414m046821
1601.9C40442963k535210m078789j119270l885384j442527l357010j804352j669808
1609.6C20550613l296070j17073k798271J57909k078647J55315J11809n360279J573772
1618.2C08899078j498890R78508j491756J265583m64458j863652J957798q01067J932526
1626.9C08913670j292820J658172O41442O95838J112099N4894K691326J13563K814350
1635.6C17402534j880245L020668K133503J135369K747535P77626K725373K36549K467041
1644.3C30765953J716576K05040N035858j388016K746162O57235K943573K050552l93715
$$ plain form
1653 344339218 345858650 345061264 348966980 349803658 351859856 352909622 355011787 357275963 359009666
1661.6 359009666 362238579 362906456 366586189 368650475 371995049 375099335 377471809 381096420
1669.4 381096420 383132553 388296242 390304909 394626923 398654060 402184868 405577240 408663330
1677.1 408663330 413509521 416563530 420648918 424044724 429527245 435442581 436797066 441320610
1684.8 441320610 445290108 451577263 455871315 460170555 464291077 468217964 473789711 478553543
1692.5 478553543 483771667 488661385 493552780 495579376 500856590 506594658 511947174 515981293
1700.2 515981293 516156921 522968254 528033142 532566147 535627747 538717728 541331635 543891869
1707.9 543891869 548160439 551348610 553558922 555872917 558676262 561802483 563106232 563644562
$$ packed form
1653C44339218J519432p97386L905716Q36678K056198J049766K102165K264176J733703
1661.6C59009666L228913O67877L679733K064286L344574L104286K372474L624611
1669.4C81096420K036133N163689K008667M322014M027137L530808L392372L086090
1677.1D08663330M846191L054009M085388L395806N482521N915336J354485M523544
1684.8D41320610L969498O287155M294052M299240M120522L926887N571747M763832
1692.5D78553543N218124M889718M891395K026596N277214N738068N352516M034119
1700.2E15981293J75628O811333N064888M533005L061600L089981K613907K560234
1707.9E43891869M268570L188171K210312K313995K803345L126221J303749N38330
$$ plain form
1715.6 563644562 566241989 567067947 563348160 568667717 573041916 575359116 577056160 578434639
1723.4 578434639 579315376 580471230 582233963 583744049 585686646 588058434 588102875 588389130 591805801
1732 591805801 595515137 594294472 590546684 594679222 598718262 601292572 603981438 604507484 604071198
1740.7 604071198 608057709 611326790 612622871 614573555 618444519 621662636 623976173 626185684
1748.4 626185684 627320824 631914673 633791504 634764786 639410553 642586060 645947723 649457016
1756.2 649457016 650332947 651944504 654553757 656847458 660391464 660822678 661009827 664571686 666715088
1764.8 666715088 668510590 670253067 671768188 670452042 672519836 676857681 677123032 675336380
1772.5 675336380 674852219 679029465 681283112 680878754 682970886 683670654 685254745 686155472 685737457
$$ packed form
1715.6E63644562K597427Q25958l719787N319557M374199K317200J697044J378479
1723.4E78434639Q80737J155854J762733J510086J942597K371788M4441K86255L416671
1732E91805801L709336j220665l747788M132538M039040K574310K688866N26046m36286
1740.7F04071198L986511L269081J296081J950684L870964L218117K313537K209511
1748.4F26185684J135140M593849J876831R73282M645767L175507L361663L509293
1756.2F49457016Q75931J611557K609253K293701L544006M31214J87149L561859K143402
1764.8F66715088J795502J742477J515121j316146K067794M337845K65351j786652
1772.5F75336380m84161M177246K253647m04358K092132O99768J584091R00727m18015
$$ plain form
1781.2 685737457 686959305 688844757 690427246 689810791 690094757 691646805 693293228 694087753 695075684
1789.9 695075684 695675354 696345062 695836945 695324631 698630371 699730225 699612198 700797882 702427216
1798.6 702427216 703484650 702599030 704058914 703982391 704844666 706366425 706690674 707818832 708515396
1807.3 708515396 709110184 710199966 711959457 710794449 710342102 711522827 712147751 713474197 713631668
1815.9 713631668 714289780 714403305 715337524 716556244 716447372 717260513 717253265 718828659 720029984
1824.6 720029984 717612000 717483063 719302444 721385651 721677780 719158325 719612503 721755600 722383041
1833.3 722383041 723070526 723706894 724180984 724336548 723292847 724263763 724404526 725012817 726064911
1842 726064911 727339859 728331985 723629913 725447311 727420807 727368393 727058105 727704315 729036484
$$ packed form
1781.2F85737457J221848J885452J582489o16455K83966J552048J646423P94525R87931
1789.9F95075684N99670O69708n08117n12314L305740J099854j18027J185684J629334
1798.6G02427216J057434q85620J459884p6523Q62275J521759L24249J128158O96564
1807.3G08515396N94788J089782J759491j165008m52347J180725O24924J326446J57471
1815.9G13631668O58112J13525R34219J218720j08872Q13141p248J575394J201325
1824.6G20029984k417984j28937J819381K083207K92129k519455M54178K143097O27441
1833.3G22383041O87485O36368M74090J55564j043701R70916J40763O08291J052094
1842G26064911J274948R92126m702072J817398J973496n2414l10288O46210J332169
$$ plain form
1850.7 729036484 729202042 729895630 729607468 730027161 730408173 730279694 730733795 730464325 731124573 731054611
1860.3 731054611 731440964 731941452 732218094 732383270 732205582 733000565 733054733 734260101 733546143 731889648
1869.9 731889648 732706528 733522034 734103546 733834152 734483109 734477081 734563065 735117645 735344925 735688934
1879.6 735688934 735574493 735969086 735759201 736020508 735708160 735592651 736442032 736509094 737531891 737222214
1889.2 737222214 735751572 736162720 737282333 737770309 738100357 738243179 737686386 738499908 738484955
1897.9 738484955 738534622 738409119 738124695 738719406 738838654 739369812 738895874 738854828 738844604 738545303
1907.6 738545303 738924561 739004288 739438477 739214706 739644470 739504395 739372559 739400177 739455414 740785904
1917.2 740785904 739394150 738665771 739427109 740359344 741206131 739870071 739185486 739744797 740289383
$$ packed form
1850.7G29036484J65558O93588k88162M19693L81012j28479M54101k69470O60248o9962
1860.3G31054611L86353N00488K76642J65176j77688P94983N4168J205368p13958j656495
1869.9G31889648Q16880Q15506N81512k69394O48957o028Q5984N54580K27280L44009
1879.6G35688934j14441L94593k09885K61307l12348j15509Q49381O7062J022797l09677
1889.2G37222214j470642M11148J119613M87976L30048J42822n56793Q13522j4953
1897.9G38484955M9667j25503k84424N94711J19248N31158m73938m1046j0224k99301
1907.6G38545303L79258P9727M34189k23771M29764j40075j31836K7618N5237J330490
1917.2G40785904j391754p28379P61338R32235Q46787j336060o84585N59311N44586
$$ plain form
1925.9 740289383 740200195 740563202 740752182 740787506 740914688 740812836 741063004 740236282 740280304 740503082
1935.5 740503082 740632248 740973129 740739441 740842285 740475388 741387711 741095734 739345093 740189972
1944.2 740189972 741005325 740880661 740166931 740359192 740548553 740464783 739984207 739710083 740095367 740245590
1953.8 740245590 740817337 740631638 740565186 740262833 739824295 739921036 739809647 740104980 739999161 740353165
1963.5 740353165 740538254 740479584 740327606 739636383 739283829 739000702 739318542 739216080 739492950 739918594
1973.1 739918594 740169907 740368271 739570541 739422150 739213486 739150162 739207916 739469833 739787369 739667892
1982.8 739667892 740025940 739451981 739076004 739019241 738985519 738943329 738700638 739163513 739218292 738763199
1992.4 738763199 738182602 738491669 738482361 738233185 738376694 737996597 738139801 737834167 737936630 737927628
$$ packed form
1925.9G40289383q9188L63007J88980L5324J27182j01852K50168q26722M4022K22778
1935.5G40503082J29166L40881k33688J02844l66897R12323k91977j750641Q44879
1944.2G40189972Q15353j24664p13730J92261J89361q3770m80576k74124L85284J50223
1953.8G40245590N71747j85699o6452l02353m38538R6741j11389K95333j05819L54004
1963.5G40353165J85089n8670j51978o91223l52554k83127L17840j02462K76870M25644
1973.1G39918594K51313J98364p97730j48391k08664o3324N7754K61917L17536j19477
1982.8G39667892L58048n73959l75977n6763l3722m2190k42691M62875N4779m55093
1992.4G38763199n80597L09067r308k49176J43509l80097J43204l05634J02463r002
$$ plain form
2002.1 737927628 737657547 737865448 737525711 737380753 737066193 737198410 737039490 736848450 736789474 736502533
2011.7 736502533 736869736 736837692 736902084 736527939 736088104 735638733 735519333 735815659 735622864 736077957
2021.3 736077957 735805817 735681305 735516205 735059891 734995956 734679031 735005722 734911041 735135956 734917145
2031 734917145 734278259 734167175 734006729 734115753 733748932 733682861 733298721 733570709 734022141 733776016
2040.6 733776016 733648300 732979355 733125610 732667389 732404480 732663116 732877274 733236771 732646790 732506790
2050.3 732506790 732125244 732325363 732265091 731781006 732083282 732159576 732564011 732071228 731745987 731664505
2059.9 731664505 731849365 731882553 731297684 731701126 731257858 731185608 731413956 731158752 731009979 730908051
2069.6 730908051 731009369 730616608 730942993 731111221 731221466 731075974 730821686 731194992 730898209 730690460
$$ packed form
2002.1G37927628k70081K07901l39737j44958l14560J32217j58920j91040n8976k86941
2011.7G36502533L67203l2044O4392l74145m39835m49371j19400K96326j92795M55093
2021.3G36077957k72140j24512j65100m56314o3935l16925L26691r4681K24915k18811
2031G34917145o38886j11084j60446J09024l66821o6071l84140K71988M51432k46125
2040.6G33776016j27716o68945J46255m58221k62909K58636K14158L59497n89981j40000
2050.3G32506790l81546K00119o0272m84085L02276P6294M04435m92783l25241q1482
2059.9G31664505J84860L3188n84869M03442m43268p2250K28348k55204j48773j01928
2069.6G30908051J01318l92761L26385J68228J10245j45492k54288L73306k96783k07749
$$ plain form
2079.2 730690460 730172119 730249557 730494232 730482330 730582199 730116959 729971008 729590302 729633331 729624481 729784698
2089.8 729784698 730023575 729734955 729776382 729445953 729430313 729095612 729077225 729048462 728627777 728887558
2099.5 728887558 728919525 729017944 728448105 728306046 728609924 728590088 728084259 727318878 727522202 727176285
2109.1 727176285 727203369 727369690 727420273 727442093 727129669 727304764 726967010 727199173 727069397 726696014
2118.7 726696014 726637039 726618271 726960373 726609344 726758652 726592255 726325836 726105499 726027756 726129150
2128.4 726129150 725528107 725930939 726055374 726361542 726664352 726338196 726066742 725585785 726033020 726118851
2138 726118851 726215591 726023254 725821457 726274872 726205139 726341629 726275940 726233597 725963440 726277390 726682281
2148.6 726682281 726400452 726599426 726450119 726385880 726060867 726018066 726045456 726037445 726474457 726326981
$$ packed form
2079.2G30690460n18341P7438K44675j1902R9869m65240j45951l80706M3029q850J60217
2089.8G29784698K38877k88620M1427l30429j5640l34701j8387k8763m20685K59781
2099.5G28887558L1967R8419n69839j42059L03878j9836n05829p65381K03324l45917
2109.1G27176285K7084J66321N0583K1820l12424J75095l37754K32163j29776l73383
2118.7G26696014n8975j8768L42102l51029J49308j66397k66419k20337p7743J01394
2128.4G26129150o01043M02832J24435L06168L02810l26156k71454m80957M47235Q5831
2138G26118851R6740j92337k01797M53415o9733J36490o5689m2343k70157L13950M04891
2148.6G26682281k81829J98974j49307o4239l25013m2801K7390q011M37012j47476
$$ plain form
2158.3 726326981 726628647 726729507 726658859 726397781 726141891 726392212 726450272 726749191 726852417 727144623
2167.9 727144623 727103195 726740570 726265488 725997314 726389923 726490631 727068253 727469635 727438736 726931458
2177.6 726931458 726662598 726810532 726355286 726599274 726910172 727269211 727551956 727570038 727427597 727318878
2187.2 727318878 727510605 727096558 727187347 727294083 727856140 728167267 727617340 727644119 727368469 727456207
2196.9 727456207 727319794 727557907 728025589 728118896 728341217 727831879 727667465 727419815 727554016 727635803
2206.5 727635803 727597046 727949829 728149948 728752823 728303070 727935028 727680359 727806702 728357162 728090057
2216.1 728090057 728390350 728492889 728906021 728759232 728301544 728517990 728392792 728594208 728556061 728799057
2225.8 728799057 728687439 728344345 728332901 728212814 728218689 728090820 728306198 728118439 728296051 728534622
$$ packed form
2158.3G26326981L01666J00860p0648k61078k55890K50321N8060K98919J03226K92206
2167.9G27144623m1428l62625m75082k68174L92609J00708N77622M01382l0899n07278
2177.6G26931458k68860J47934m55246K43988L10898L59039K82745J8082j42441j08719
2187.2G27318878J91727m14047R0789J06736N62057L11127n49927K6779k75650Q7738
2196.9G27456207j36413K38113M67682R3307K22321n09338j64414k47650J34201Q1787
2206.5G27635803l8757L52783K00119O02875m49753l68042k54669J26343N50460k67105
2216.1G28090057L00293J02539M13132j46789m57688K16446j25198K01416l8147K42996
2225.8G28799057j11618l43094j1444j20087N875j27869K15378j87759J77612K38571
$$ plain form
2235.4 728534622 728631363 728784485 728078308 727824631 727693634 727830734 728002853 728255005 728665009 728683090
2245.1 728683090 728414536 727576065 727777481 728204575 728413544 728513641 728444519 728557205 728160248 728080139
2254.7 728080139 727779312 727874451 727869415 727815933 728215866 728026886 728382339 728315887 728339996 728308487 727912979
2265.3 727912979 728067322 728205414 728405533 728326645 728581161 728050385 727597504 727805710 727692642 727817383
2275 727817383 727580414 728005219 728197021 728049698 727595215 726862793 726814957 726791916 727437134 727493362
2284.6 727493362 727547913 727777939 727706909 727866745 727450409 727290573 727048416 727392578 727723618 727937546
2294.3 727937546 727971802 727362366 727586365 727110138 727063675 727331924 727538223 728061066 727967377 727968292 727520905
2304.9 727520905 728192139 728440857 728184509 728701859 728321991 728646851 729242020 729999390 730049210 729464798
$$ packed form
2235.4G28534622R6741J53122p06177k53677j30997J37100J72119K52152M10004J8081
2245.1G28683090k68554q38471K01416M27094K08969J00097o9122J12686l96957q0109
2254.7G28080139l00827R5139n036n3482L99933j88980L55453o6452K4109l1509l95508
2265.3G27912979J54343J38092K00119p8888K54516n30776m52881K08206j13068J24741
2275G27817383k36969M24805J91802j47323m54483p32422m7836k3041O45218N6228
2284.6G27493362N4551K30026p1030J59836m16336j59836k42157L44162L31040K13928
2294.3G27937546L4256o09436K23999m76227m6463K68249K06299N22843r3689R15m47387
2304.9G27520905O71234K48718k56348N17350l79868L24860N95169P57370M9820n84412
$$ plain form
2314.5 729464798 729264603 728794632 729008408 728919907 729338226 730805817 731549301 730829239 730288010 730077438
2324.2 730077438 729671478 730248795 730750198 731513443 731770630 731920624 731715698 730881729 730995407 730992050
2333.8 730992050 731488953 731819458 732557678 732500534 731875229 731997833 731417313 731116257 730628586 730944519
2343.4 730944519 730546951 728851166 727284851 726274796 726172791 726856384 728945236 729729843 730211487
2352.1 730211487 731457062 731828156 732071152 730860977 732302628 734573669 735025940 732782288 732204895
2360.8 732204895 733212738 730383530 729242477 728618927 729513779 730534973 729348984 727385483 726159210
2369.5 726159210 726429825 725534363 725476913 724545135 723202209 722328186 720934830 720368500 719831619
2378.2 719831619 719477463 718497086 717779388 717356033 716701508 716474686 715809326 715186691 714473953 714392014
$$ packed form
2314.5G29464798k00195m69971K13776q8501M18319J467591P43484p20062n41229k10572
2324.2G30077438m05960N77317N01403P63245K57187J49994k04926q33969J13678l357
2333.8G30992050M96903L30505P38220n7144o25305J22604n80520l01056m87671L15933
2343.4G30944519l97568j695785j566315j010055j02005O83593K088852P84607M81644
2352.1G30211487J245575L71094K42996j210175J441651K271041M52271k243652n77393
2360.8G32204895J007843k829208j141053o23550Q94852J021194j185989j963501j226273
2369.5G26159210K70615q95462n7450r31778j342926q74023j393356n66330n36881
2378.2G19831619l54156r80377p17698m23355o54525k26822o65360o22635p12738q1939
$$ plain form
2387.8 714392014 714403915 713958282 713930893 713605652 713414612 713094940 713212357 713518753 713021545 712388153
2397.4 712388153 711955032 711811905 711404419 711139832 711091995 711160889 710901642 710519257 710442200 710095978
2407.1 710095978 710251465 710348892 710076828 709507599 709165878 709001236 708193207 707899857 708007812 708057098
2416.7 708057098 707446671 707039261 707022171 706408768 706130066 706073227 706168365 705776215 705483932 705482254
2426.4 705482254 705149002 704843445 704290619 704148636 703913269 703815842 703716202 703521271 703307343 702623749
2436 702623749 702538528 701869125 700974579 700599213 700696945 700815353 700357971 700419159 700167007 699999695
2445.7 699999695 699694824 699284592 699155655 698557892 698324280 698216858 698056946 697210922 696635895 696490479
2455.3 696490479 696165848 696250153 695785141 695496979 695030441 694624252 694473419 694229584 694044266 693059540
$$ packed form
2387.8G14392014J1901m45633k7389l25241j91040l19672J17417L06396m97208o33392
2397.4G12388153m33121j43127m07486k64587m7837O8894k59247l82385p7057l46222
2407.1G10095978J55487R7427k72064n69229l41721j64642q08029k93350J07955M9286
2416.7G08057098o10427m07410j7090o13403k78702n6839R5138l92150k92283j678
2426.4G05482254l33252l05557n52826j41983k35367r7427r9640j94931k13928o83594
2436G02623749q5221o69403q94546l75366R7732J18408m57382O1188k52152j67312
2445.7F99999695l04871m10232j28937n97763k33612j07422j59912q46024n75027j45416
2455.3F96490479l24631Q4305m65012k88162m66538m06189j50833k43835j85318r84726
$$ plain form
2465 693059540 692581787 692300949 692131577 691961899 691597977 691654663 691291046 690869064 690062714 689551544
2474.6 689551544 689290314 688916321 688935013 688615494 688353577 688050232 687656403 687064133 686839294 686497498
2484.2 686497498 685542374 685318832 685190048 685089798 684649124 683863602 683294754 682996750 682993317 682513962
2493.9 682513962 681980362 681673126 681738358 681277924 680215912 679636536 679595032 679818192 679101715 678381271
2503.5 678381271 678050690 677382660 676812057 676699066 676797791 676248398 675796051 675598297 675504837 675314713
2513.2 675314713 674628448 674017105 673483582 672832947 672174377 672106857 672049484 671840668 671520691 670825729
2522.8 670825729 670458832 670412445 670342560 669589462 668941574 668603134 668524399 668376923 667276077 666903915
2532.5 666903915 666854248 666732788 666567841 666080627 665710144 665039902 664747772 664376984 663877945 663408356
$$ packed form
2465F93059540m77753k80838j69372j69678l63922N6686l63617m21982q06350n11170
2474.6F89551544k61230l73993J8692l19519k61917l03345l93829n92270k24839l41796
2484.2F86497498r55124k23542j28784j00250m40674p85522n68848k98004l433m79355
2493.9F82513962n33600l07236O5232m60434j062012n79376m1504K23160p16477p20444
2503.5F78381271l30581o68030n70603j12991R8725n49393m52347j97754r3460j90124
2513.2F75314713o86265o11343n33523o50635o58570o7520n7373k08816l19977o94962
2522.8F70825729l66897m6387o9885p53098o47888l38440p8735j47476j100846l72162
2532.5F66903915m9667j21460j64947m87214l70483o70242k92130l70788m99039m69589
$$ plain form
2542.1 663408356 663129501 663206863 663013229 662742920 661987915 661563950 661045074 660345383 660145416 659660492
2551.7 659660492 659522629 659636383 659710007 659370880 658822632 658235626 657582550 657042160 656281128 656019897
2561.4 656019897 655711746 655657196 655606766 655142670 654892197 654136887 653557053 652922363 652533875 652625885
2571 652625885 652451172 652170258 651646194 651424942 651084137 650638351 650311050 649905090 649565125 649271088
2580.7 649271088 649033737 648683853 648531570 648118134 647563400 646795883 646074066 645940475 645760498 645771637
2590.3 645771637 645453033 644970856 644461288 643853378 643372879 643009872 642944489 642322922 641928101 641647034
2600 641647034 641146469 640946579 640775528 640656738 639981918 639369774 638864479 638304214 637787247 637563629
2609.6 637563629 637664986 636960144 636291885 635708160 635274696 635069199 634627266 634276657 633816872 633749809
$$ packed form
2542.1F63408356k78855P7362j93634k70309p55005m23965n18876o99691j99967m84924
2551.7F59660492j37863J13754P3624l39127n48248n87006o53076n40390p61032k61231
2561.4F56019897l08151n4550n0430m64096k50473p55310n79834o34690l88488R2010
2571F52625885j74713k80914n24064k21252l40805m45786l27301m05960l39965k94037
2580.7F49271088k37351l49884j52283m13436n54734p67517p21817j33591j79977J1139
2590.3F45771637l18604m82177n09568o07910m80499l63007o5383o21567l94821k81067
2600F41647034n00565j99890j71051j18790o74820o12144n05295n60265n16967k23618
2609.6F37563629J01357p04842o68259n83725m33464k05497m41933l50609m59785o7063
$$ plain form
2619.3 633749809 633624535 633092804 632337112 631750526 631286392 630660934 630260162 629704895 629519501 629132652
2628.9 629132652 628505020 628052635 627619591 627513924 626717873 625954056 625521278 625283356 625381851 624893074
2638.5 624893074 624055748 623642845 623350449 622374496 621794777 621342812 620796547 620824928 620922585 620690269
2648.2 620690269 619722977 619365807 618939667 618412209 618486023 617960663 617626762 617289810 616845284 616166267
2657.8 616166267 615873070 616137428 615532112 614828110 614235649 613759499 613131523 612701950 612537117 612227898
2667.5 612227898 612312775 612041626 611949158 611791649 611063347 610454216 610092888 609819069 609283943 609059258
2677.1 609059258 608800087 608597679 608540726 608041916 607405243 606962166 606727562 606250153 605844383 605474777
2686.8 605474777 605373154 605338821 604870567 604419022 603762627 603332481 603106041 603204498 603227730 602454300
$$ packed form
2619.3F33749809j25274n31731p55692n86586m64134o25458m00772n55267j85394l86849
2628.9F29132652o27632m52385m33044j05667p96051p63817m32778k37922R8495m88777
2638.5F24893074q37326m12903k92396r75953n79719m51965n46265K8381R7657k32316
2648.2F20690269r67292l57170m26140n27458P3814n25360l33901l36952m44526o79017
2657.8F16166267k93197K64358o05316p04002n92461m76150o27976m29573j64833l09219
2667.5F12227898Q4877k71149r2468j57509p28302o09131l61328k73819n35126k24685
2677.1F09059258k59171k02408n6953m98810o36673m43077k34604m77409m05770l69606
2686.8F05474777j01623l4333m68254m51545o56395m30146k26440R8457K3232p73430
$$ plain form
2696.4 602454300 601760597 601413727 601266899 601083069 600906639 600314865 599625435 599609718 599886551 599877548
2706 599877548 599312630 598983154 598443680 597913094 597649422 597084007 596964874 596942368 596709824 596108131
2715.7 596108131 595457840 595258598 595320320 595021706 594339981 594366531 594317856 593998451 593820992 593866425
2725.3 593866425 593652878 592841492 592467232 591894073 591484337 591395302 591362686 591415062 590694923 590214081
2735 590214081 590129700 590037460 589935913 589681931 589252510 589027252 589161606 588600159 588153839 588280144
2744.6 588280144 588338318 588504639 588726616 588424034 587685242 587362900 587047653 586807632 586610451 586152000
2754.3 586152000 585687141 585401077 585335999 584884949 584571762 584629211 584601822 584181137 583590202 583094368
2763.9 583094368 582659988 582790260 582581367 582059097 581702995 581515656 581525269 581349564 581292763 580819778
$$ packed form
2696.4F02454300o93703l46870j46828j83830j76430n91774o89430j5717K76833r003
2706E99877548n64918l29476n39474n30586k63672n65415j19133k2506k32544o01693
2715.7E96108131o50291j99242O1722k98614o81725K6550m8675l19405j77459M5433
2725.3E93866425k13547q11386l74260n73159m09736q9035l2616N2376p20139m80842
2735E90214081q4381r2240j01547k53982m29421k25258J34354n61447m46320J26305
2744.6E88280144N8174J66321K21977l02582p38792l22342l15247k40021j97181m58451
2754.3E86152000m64859k86064o5078m51050l13187N7449k7389m20685n90935m95834
2763.9E83094368m34380J30272k08893n22270l56102j87339R613j75705n6801m72985
$$ plain form
2773.5 580819778 580319710 579833527 579162788 578775673 578403854 578237267 577861900 577503777 577109337 576541748
2783.2 576541748 576119537 575697289 575276642 574798775 574713364 574400597 573949738 573477821 572619209 571778793
2792.8 571778793 571058540 570797653 570305290 569996567 569950676 569501305 568836479 567836380 566999550 566364746
2802.5 566364746 565879669 564832230 564077415 564041634 563539085 563047485 562251968 561896324 561468658 560459862
2812.1 560459862 560003700 559418602 558621445 557830048 557493706 556973495 556054192 555356827 554666252 554154320
2821.8 554154320 553389282 552451057 551323204 550718040 550580559 549743042 548467522 546945381 546086922
2830.4 546086922 545816689 545397491 544669952 543661156 542619514 541610298 540733643 539486427 538283958
2839.1 538283958 537099380 535769615 534350204 532444115 530680466 528946304 527124901 525336113
$$ packed form
2773.5E80819778n00068m86183o70739l87115l71819j66587l75367l58123l94440n67589
2783.2E76541748m22211m22248m20647m77867q5411l12767m50859m71917q58612q40416
2792.8E71778793p20253k60887m92363l08723m5891m49371o64826j000099q36830o34804
2802.5E66364746m85077j047439p54815l5781n02549m91600p95517l55644m27666j008796
2812.1E60459862m56162n85098p97157p91397l36342n20211r19303o97365o90575n11932
2821.8E54154320p65038r38225j127853o05164j37481q37517j275520j522141q58459
2830.4E46086922k70233m19198p27539j008796j041642j009216q76655j247216j202469
2839.1E38283958j184578j329765j419411j906089j763649j734162j821403j788788
$$ plain form
2846.8 525336113 523446083 521312599 519432678 517838516 515906296 514638290 513917046 513743553 513895531
2855.5 513895531 513390579 512942581 512827492 512860107 512412949 511723518 511231575 510857430 510847015 510342751
2865.2 510342751 509288559 508329849 507187271 506155167 505848656 505431709 504823380 504337997 503470154
2873.8 503470154 502531700 501557312 500817909 500248032 499669762 499072723 498479881 497935867 497029800 496633911
2883.5 496633911 496037750 495025749 494185104 492880974 491984253 490997047 489960670 489428177 488585472
2892.2 488585472 487432976 486346779 485818291 485508957 484899368 483778152 482788925 482117424 481371765
2900.8 481371765 480837669 480138092 479415283 478568192 477698326 477137833 476344414 475339966 474610558
2909.5 474610558 473879776 472498016 471330643 470221214 468781166 467162514 465121880 463716087
$$ packed form
2846.8E25336113j890030k133484j879921j594162j932220j268006p21244j73493J51978
2855.5E13895531n04952m47998j15089L2615m47158o89431m91943l74145j0415n04264
2865.2E10342751j054192r58710j142578j032104l06511m16947o08329m85383q67843
2873.8E03470154r38454r74388p39403n69877n78270n97039n92842n44014r06067l95889
2883.5D96633911n96161j012001q40645j304130q96721r87206j036377n32493q42705
2892.2D88585472j152496j086197n28488l09334o09589j121216r89227o71501p45659
2900.8D81371765n34096o99577p22809q47091q69866n60493p93419j004448p29408
2909.5D74610558p30782j381760j167373j109429j440048j618652k040634j405793
$$ plain form
2917.2 463716087 462692528 461866760 461395683 460372696 458894844 457681961 456983871 456746407 456967697
2925.9 456967697 456770325 456597023 456780014 456518364 456109962 455986824 456659203 457272301 458034325 458872337
2935.6 458872337 458638687 458960915 459701920 460180664 461067543 461822624 462512970 463511887 464196548 464366760
2945.2 464366760 464986954 465853806 466180496 466723747 467481499 467740517 468232803 468658524 468376350 468626862
2954.8 468626862 469433174 469921799 470149841 470305519 470539513 471240501 472040977 472416763 472959251 473602409
2964.5 473602409 473934174 474231834 475147552 476198769 476569824 476780624 477377548 478313828 478773766
2973.2 478773766 479448166 480289841 480350723 480720406 481143684 481421661 481820984 482017746 482042084 482260399
2982.8 482260399 482483177 482367859 482766838 483023987 483012733 482989731 482871552 483129616 483096619 483022804
$$ packed form
2917.2D63716087j023559q25768m71077j022987j477852j212883o98090k37464K21290
2925.9D56967697j97372j73302J82991k61650m08402j23138O72379O13098P62024Q38012
2935.6D58872337k33650L22228P41005M78744Q86879P55081O90346R98917O84661J70212
2945.2D64366760O20194Q66852L26690N43251P57752K59018M92286M25721k82174K50512
2954.8D68626862Q06312M88625K28042J55678K33994P00988Q00476L75786N42488O43158
2964.5D73602409L31765K97660R15718J051217L71055K10800N96924R36280M59938
2973.2D78773766O74400Q41675O0882L69683M23278K77977L99323J96762K4338K18315
2982.8D82260399K22778j15318L98979K57149j1254k3002j18179K58064l2997p3815
$$ plain form
2992.5 483022804 482846985 482751427 482562332 482099762 482037888 481592522 481262360 481150818 480930138 480640602
3002.1 480640602 480115128 479547195 478732338 478157997 477688980 477288208 476847382 476350060 475873070 474987259
3011.7 474987259 474621658 474564590 473952217 473137512 472470093 471565666 471042938 470818291 469668045 468792953
3021.4 468792953 468280144 467779198 467099266 466013565 465286674 464543228 464115334 463801079 463255692
3030.1 463255692 462651634 461888161 461242943 460697098 459952316 458661003 457676201 456915359 456275063
3038.7 456275063 455826302 455048828 454195251 453153992 452338600 451374016 450671921 450425415 449469795
3047.4 449469795 447983093 446574821 446234856 446149940 445599442 444324684 443108063 443105507 442673416
3056.1 442673416 441664124 440373230 439341583 438937073 438385315 437409744 436422310 436458244 436150398
$$ packed form
2992.5D83022804j75819r5558j89095m62570o1874m45366l30162j11542k20680k89536
3002.1D80640602n25474n67933q14857n74341m69017m00772m40826m97322m76990q85811
3011.7D74987259l65601n7068o12373q14705o67419r04427n22728k24647j150246q75092
3021.4D68792953n12809n00946o79932j085701p26891p43446m27894l14255n45387
3030.1D63255692o04058p63473o45218n45845p44782j291313r84802p60842o40296
3038.7D56275063m48761p77474q53577j041259q15392r64584p02095k46506r55620
3047.4D49469795j486702j408272l39965q4916n50498j274758j216621k556m32091
3056.1D42673416j009292j290894j031647m04510n51758r75571r87434L5934l07846
$$ plain form
3064.8 436150398 435537758 434727898 433127403 432285728 431955948 431700897 430839043 429723396 429012222
3073.5 429012222 428459511 427943687 427030945 426648521 426308212 425781555 425254517 424222260 423538322
3082.1 423538322 422938766 422260361 421704865 420993309 420384331 420089149 419331398 418130875 417380905
3090.8 417380905 416832314 416350975 415597610 414868927 414405899 413569145 412777176 412213669 411836014 411664162
3100.5 411664162 411180801 410055313 408794708 407829552 407397614 407062302 406622200 406254082 405013733
3109.1 405013733 403950005 403354530 402463531 401780052 401188354 400905914 399950256 398880272 398533707
3117.8 398533707 397834053 397207680 396647034 396054878 395363197 394495010 393619270 392814140 392125359 391240921
3127.5 391240921 390575180 390106888 389407158 388514252 387918396 387116470 386000786 385448418 384818611
$$ packed form
3064.8D36150398o12640q09860j600495q41675l29780k55051q61854j115647p11174
3073.5D29012222n52711n15824r12742l82424l40309n26657n27038j032257o83938
3082.1D23538322n99556o78405n55496p11556o08978k95182p57751j200523p49970
3090.8D17380905n48591m81339p53365p28683m63028q36754p91969n63507l77655j71852
3100.5D11664162m83361j125488j260605r65156m31938l35312m40102l68118j240349
3109.1D05013733j063728n95475q90999o83479n91698k82440r55658j069984l46565
3117.8C98533707o99654o26373n60646n92156o91681q68187q75740q05130o88781q84438
3127.5C91240921o65741m68292o99730q92906n95856q01926j115684n52368o29807
$$ plain form
3136.1 384818611 383902817 382752190 381940117 381439400 380607910 379863434 378795662 377751923 377181320
3144.8 377181320 376863976 376203346 375105782 374497261 374320183 374035988 373033752 371919441 371038475
3153.5 371038475 369899445 368784561 368272972 368104401 367244263 366230888 365129585 364333611 363925934
3162.2 363925934 363167839 362942123 362293777 361078644 360264587 359787712 359484329 358566551 357196579
3170.9 357196579 355993881 355686798 355524445 354360352 353028488 352115364 351524200 351141357 350598831
3179.5 350598831 349671631 348930588 348074722 347078819 346689339 346404037 345818710 344971313 344196167 343529167
3189.2 343529167 342973633 342379150 341559677 340612373 339584007 338816833 337821121 337349892 337187958
3197.9 337187958 336436920 336090736 335369911 334520149 334087639 333400726 332688141 332230911 331681061 330769653
$$ packed form
3136.1C84818611r15794j150627q12073n00717q31490p44476j067772j043739n70603
3144.8C77181320l17344o60630j097564o08521j77078k84195j002236j114311q80966
3153.5C71038475j139030j114884n11589j68571q60138j013375j101303p95974m07677
3162.2C63925934p58095k25716o48346j215133q14057m76875l03383r17778j369972
3170.9C57196579j202698l07083j62353j164093j331864r13124n91164l82843n42526
3179.5C50598831r27200p41043q55866r95903l89480k85302n85327q47397p75146o67000
3189.2C43529167n55534n94483q19473r47304j028366p67174r95712m71229j61934
3197.9C37187958p51038l46184p20825q49762m32510o86913p12585m57230n49850r11408
$$ plain form
3207.5 330769653 330294495 329902840 329198570 328483391 328079033 327735214 326674881 325756226 325004654
3216.2 325004654 324679146 324784546 324363823 323627167 322806282 322332306 321715126 321037178 320478516 319746494
3225.8 319746494 319439030 319004402 318321857 317551498 316711178 316302338 316096058 315485535 314667130 314309807
3235.5 314309807 313720417 312903748 312543755 312151871 311733627 311524601 311223125 310465164 309462357
3244.2 309462357 309132366 309414520 309182053 308456173 307514000 306736298 306674557 306504211 305540066 304531498
3253.8 304531498 304250259 304156780 303710384 302998753 302608833 302560368 302052841 301327209 300654469 300551853
3263.4 300551853 300397377 299851952 299745941 299010468 298430805 298473854 298225613 297685318 297246723 297295532
3273.1 297295532 296476421 296081829 296226940 295061722 294374008 294245281 294210682 294442596 294015789 293348656
$$ packed form
3207.5C30769653m75158l91655p04270p15179m04358l43819j060333r18655p51572
3216.2C25004654l25508J05400m20723p36656q20885m73976o17180o77948n58662p32022
3225.8C19746494l07464m34628o82545p70359q40320m08840k06280o10523q18405l57323
3235.5C14309807n89390q16669l59993l91884m18244k09026l01476p57961j002807
3244.2C09462357l29991K82154k32467p25880r42173p77702o1741j70346r64145j008568
3253.8C04531498k81239r3479m46396p11631l89920m8465n07527p25632o72740j02616
3263.4C00551853j54476n45425j06011p35473n79663M3049k48241n40295m38595M8809
3273.1B97295532q19111l94592J45111j165218o87714j28727l4599K31914m26807o67133
$$ plain form
3282.7 293348656 293094177 292673855 291963634 291477718 290987301 290620537 290532284 290387383 290055962 289607811
3292.4 289607811 289437847 289255047 288572617 288114929 288235054 287876987 286973858 286116714 285795364 285939999
3302 285939999 285639496 285208225 284934883 284689350 284313202 283913460 283812447 283813858 283615761 282603722
3311.7 282603722 281890221 281848392 281340942 280797939 280642509 280582066 279921188 279245224 278817921 278232975
3321.3 278232975 277640705 276900368 276826859 276892452 276105213 275071049 274415951 274260502 273807602 272855129
3330.9 272855129 272172451 271657810 270977345 270918941 270914650 270181408 269423141 268727627 268107262 267536068
3340.6 267536068 266993980 266205597 265519848 265237446 264935074 264873161 264442997 263659992 262982788 262710800
3350.2 262710800 262578297 261960793 261466084 260850163 260538864 260547504 260159760 259421654 258855782 259120274
$$ packed form
3282.7B93348656k54479m20322p10221m85916m90417l66764q8253j44901l31421m48151
3292.4B89607811j69964j82800o82430m57688J20125l58067r03129q57144l21350J44635
3302B85939999l00503m31271k73342k45533l76148l99742j01013J411j98097j012039
3311.7B82603722p13501m1829n07450n43003j55430o0443o60878o75964m27303n84946
3321.3B78232975n92270p40337p3509O5593p87239j034164o55098j55449m52900r52473
3330.9B72855129o82678n14641o80465n8404m291p33242p58267o95514o20365n71194
3340.6B67536068n42088p88383o85749k82402l02372o1913m30164p83005o77204k71988
3350.2B62710800j32503o17504m94709o15921l11299Q640l87744p38106n65872K64492
$$ plain form
3359.9 259120274 258901672 258419533 258307343 257959785 257623138 257267551 256620560 255957203 255899105 255761604
3369.5 255761604 255685329 255428314 254760780 254544888 254254379 254134865 253927116 253975868 254018745 253511715
3379.2 253511715 253262501 252734661 252599850 252340279 252050400 252034225 251668301 251869125 251550598 251103535
3388.8 251103535 250849762 250846157 251378002 251018105 250710449 250607986 250145397 249938240 250200577 250386734
3398.4 250386734 250242786 250455379 250702820 250547142 250238667 250267315 250209599 249860058 249494438 249353771
3408.1 249353771 249616871 249510536 249529705 249560566 249467278 249598217 249462566 249676170 250056934 250306358
3417.7 250306358 250377121 250390034 250360279 250468025 251448135 251871662 251354275 251193371 251658897 252015533
3427.4 252015533 252342663 252906456 252553501 251937962 252548237 253556118 253543739 253241920 253814468 254547729
$$ packed form
3359.9B59120274k18602m82139j12190l47558l36647l55587o46991o63357n8098j37501
3369.5B55761604p6275k57015o67534k15892k90509j19514k07749M8752M2877n07030
3379.2B53511715k49214n27840j34811k59571k89879j6175l65924K00824l18527m47063
3388.8B51103535k53773l605N31845l59897l07656j02463m62589k07157K62337J86157
3398.4B50386734j43948K12593K47441j55678l08475K8648n7716l49541l65620j40667
3408.1B49353771K63100j06335J9169L0861r3288J30939j35651K13604L80764K49424
3417.7B50306358P0763J2913k9755J07746R80110M23527n17387j60904M65526L56636
3427.4B52015533L27130N63793l52955o15539O10275J007881j2379l01819N72548P33261
$$ plain form
3437 254547729 254640541 254728565 255138588 255543861 256536446 256893959 256623402 256903667 257264519 258277187
3446.7 258277187 259001274 259456654 259994736 260335407 260787468 260994606 261464062 261815929 262445469 263186607
3456.3 263186607 263734913 264126759 264416695 265566692 266282196 267424870 268471642 268731022 269470501
3465 269470501 269640064 270044765 270500183 271190777 271605415 271935902 273605976 274486008 275103760 275675278
3474.6 275675278 276154861 277047081 277476635 278145714 278943691 279751301 280686646 281499577 281703606 282282391
3484.3 282282391 283323364 284148712 285588989 286119938 286190662 287239819 288222790 289074783 290236568
3493 290236568 291586781 292358017 293011742 293693638 294350338 295344734 296353149 296976643 297462578 298400879
3502.6 298400879 299265366 300350780 301549263 302721558 303900146 304947662 305575123 305490589 306912308
$$ packed form
3437B54547729R2812Q8024M10023M05273R92585L57513k70557K80265L60852J012668
3446.7B58277187P24087M55380N38082L40671M52061K07138M69456L51867O29540P41138
3456.3B63186607N48306L91846K89936J149997P15504J142674J046772K59380P39479
3465B69470501J69563M04701M55418O90594M14638L30487J670074Q80032O17752N71518
3474.6B75675278M79583Q92220M29554O69079P97977Q07610R35345Q12931K04029N78785
3484.3B82282391J040973Q25348J440277N30949P0724J049157R82971Q51993J161785
3493B90236568J350213P71236O53725O81896O56700R94396J008415O23494M85935R38301
3502.6B98400879Q64487J085414J198483J172295J178588J047516O27461q4534J421719
$$ plain form
3511.3 306912308 308679333 309642754 310582485 311227303 312361526 313583527 314691658 315527992 315829067
3520 315829067 316672039 318483677 320238876 320652618 321247902 322873993 324749870 325602493 326062393
3528.6 326062393 326941948 327910385 328905792 329762230 330794182 331795731 334052200 335793381 336089478
3537.3 336089478 337771492 339146805 340077515 341042137 342722702 343929253 344435349 346391296 348365936
3546 348365936 350610504 351100769 351991119 353837852 355474319 357820091 358033066 359233818 360767632
3554.7 360767632 362531471 364654579 365331306 367577209 369192734 369948959 371030540 373238144 375287933
3563.4 375287933 376128998 379183998 380053558 380969810 382255516 383249168 386720810 388138008 389564056
3572 389564056 391926613 394402771 395983124 397648354 400087242 400993767 403425941 405369110 405834465
$$ packed form
3511.3C06912308J767025R63421R39731O44818J134223J222001J108131Q36334L01075
3520C15829067Q42972J811638J755199M13742N95284J626091J875877Q52623M59900
3528.6C26062393Q79555R68437R95407Q56438J031952J001549K256469J741181K96097
3537.3C36089478J682014J375313R30710R64622J680565J206551N06096J955947J974640
3546C48365936K244568M90265Q90350J846733J636467K345772K12975J200752J533814
3554.7C60767632J763839K123108O76727K245903J615525P56225J081581K207604K049789
3563.4C75287933Q41065L055000Q69560R16252J285706R93652L471642J417198J426048
3572C89564056K362557K476158J580353J665230K438888R06525K432174J943169M65355
$$ plain form
3580.7 405834465 407622452 410248680 412053871 413413048 417741089 419797287 418953514 421257095
3588.4 421257095 422498245 425566521 428707962 431865501 433407631 434242401 437487869 438030624 440598488
3597.1 440598488 443842697 444989014 448271675 450170784 451478691 453905640 455993271 458401108
3604.8 458401108 461364212 464063950 464523468 467980957 468806419 469477425 476567230 478354263 477266426
3613.5 477266426 481641922 482715378 487021294 491308098 492130470 494362144 494892197 497047043 501273193
3622.2 501273193 504966354 507752724 510569229 512669640 515554810 522664642 523635864 515711327
3629.9 515711327 520149994 525102844 530571899 533268814 533400536 536794815 540524635 542986679
3637.6 542986679 544169655 546477051 549770889 552773361 555098534 557051353 560403099 564793739
$$ packed form
3580.7D05834465J787987K626228J805191J359177M328041K056198q43773K303581
3588.4D21257095J241150L068276L141441L157539J542130Q34770L245468N42755K567864
3597.1D40598488L244209J146317L282661J899109J307907K426949K087631K407837
3604.8D58401108K963104K699738M59518L457489Q25462O71006P089805J787033j087837
3613.5D77266426M375496J073456M305916M286804Q22372K231674N30053K154846M226150
3622.2E01273193L693161K786370K816505K100411K885170P109832R71222p924537
3629.9E15711327M438667M952850N469055K696915J31722L394279L729820K462044
3637.6E42986679J182976K307396L293838L002472K325173J952819L351746M390640
$$ plain form
3645.3 564793739 570466614 571522522 569773865 573379822 572818108 573180847 575053444 580187378 584464264
3654 584464264 588762550 594659462 589530563 591564369 596912880 599016876 601467781 602835884 605198593
3662.7 605198593 606760521 609026642 611235352 612696419 617742653 620288124 621270714 622866898
3670.4 622866898 616365204 618544693 626327400 634964104 633765526 618226585 621930542 630151634
3678.1 630151634 635475311 634255714 634758530 636419945 638240395 640607452 641489563 642189789 645962677
3686.8 645962677 651927490 643306808 641038361 649198227 643637924 643963089 649285202 651070251
3694.5 651070251 653525925 653885422 653372574 654884644 655909576 658438492 661047821 656677322 655625381
3703.2 655625381 660125504 661626358 661910934 662422104 664809875 667905273 660966263 663731689 666826324
$$ packed form
3645.3E64793739N672875J055908j748657L605957n61714L62739J872597N133934M276886
3654E84464264M298286N896912n128899K033806N348511K103996K450905J368103K362709
3662.7F05198593J561928K266121K208710J461067N046234K545471R82590J596184
3670.4F22866898o501694K179489P782707Q636704j198578j5538941L703957Q221092
3678.1F30151634N323677j219597N02816J661415J820450K367057Q82111P00226L772888
3686.8F45962677N964813q620682k268447Q159866n560303L25165N322113J785049
3694.5F51070251K455674L59497n12848J512070J024932K528916K609329m370499j051941
3703.2F55625381M500123J500854K84576N11170K387771L095398o939010K765426L094635
$$ plain form
3711.9 666826324 655895844 660788116 665473557 666274490 667665253 670467072 671336746 667354584
3719.6 667354584 668192368 674423904 673128052 669029922 673611679 674226608 672787018 670763779 670985947
3728.3 670985947 674210663 675244370 681180649 679199448 671847610 680977707 681280365 671252289
3736 671252289 671663361 673774872 673807983 675556183 678819046 676101303 679304733 689573059 678446655
3744.7 678446655 664781494 674064713 679523087 684844818 680937729 671727676 682034836 676595001
3752.4 676595001 670476990 676951218 682099228 685144958 679767609 682146225 687646179 680145111
3760.1 680145111 678732376 683021851 685098267 685214767 687846756 686215057 681649933 683792725
3767.8 683792725 687849274 688008881 680347366 682456894 684930267 685050049 686920776 686760712 687622375
$$ packed form
3711.9F66826324j0930480M892272M685441Q00933J390763K801819Q69674l982162
3719.6F67354584Q37784O231536j295852m098130M581757O14929j439590k023239K22168
3728.3F70985947L224716J033707N936279j981201p351838R130097L02658j0028076
3736F71252289M11072K111511L3111J748200L262863k717743L203430J0268326j1126404
3744.7F78446655j3665161R283219N458374N321731l907089r210053J0307160n439835
3752.4F76595001o118011O474228N148010L045730n377349K378616N499954p501068
3760.1F80145111j412735M289475K076416J16500K631989j631699m565124K142792
3767.8F83792725M056549J59607p661515K109528K473373J19782J870727j60064Q61663
$$ plain form
3776.5 687622375 688606415 690855789 690330734 682967987 685483551 687678223 688325500 690654221 689028778
3785.2 689028778 687928696 688553391 689579086 690067673 688831482 688536453 689016571 689475861 689602966
3793.8 689602966 691408920 694130859 690286179 686082764 687844849 692885513 699689789 693284531
3801.5 693284531 683063354 685906219 688441391 693793106 698799973 687800827 683494797 688281784
3809.3 688281784 691072922 692213058 693204193 693243942 694008331 699118347 697031631 683830566 688462601
3817.9 688462601 693993683 699137955 700483627 683019257 684949341 690105896 692613297 695784836
3825.7 695784836 695366135 690073318 690292358 693071823 697127533 698769989 689887238 692527008 698964996
3834.3 698964996 691469421 691369629 700942001 693069534 687462845 694816437 689976883 690310135 696899109
$$ packed form
3776.5F87622375R84040K249374n25055p362747K515564K194672O47277K328721j625443
3785.2F89028778j100082O24695J025695M88587j236191k95029M80118M59290J27105
3793.8F89602966J805954K721939l844680m203415J762085N040664O804276o405258
3801.5F93284531j0221177K842865K535172N351715N006867j0999146m306030M786987
3809.3F88281784K791138J140136R91135L9749P64389N110016k086716j3201065M632035
3817.9F88462601N531082N144272J345672j7464370J930084N156555K507401L171539
3825.7F95784836m18701n292817K19040K779465M055710J642456q882751K639770O437988
3834.3F98964996p495575r9792R572372p872467n606689P353592m839554L33252O588974
$$ plain form
3843 696899109 694284439 691071854 693618927 694692078 694933395 697095795 696299820 697695999 704172134
3851.7 704172134 699509277 697474747 683528824 685305786 694157639 692948914 692655106 695188980
3859.4 695188980 696739426 698533401 693678513 694263687 700286407 693727570 687995300 691614456
3867.1 691614456 697041092 703024445 695045395 687058640 690690002 696255417 698688507 688838501
3874.8 688838501 690735092 695319214 696341476 698916702 702579727 697088089 689082108 694562454
3882.6 694562454 695971756 696801529 701241531 689830475 690474167 693701630 694862900 699372711
3890.3 699372711 698550568 690625534 691954193 695203247 693200607 694196472 695605545 696814728 697204819
3898.9 697204819 689078522 694964294 697435608 692497559 696790390 694080353 692312164 692727661
$$ packed form
3843F96899109k614670l212585K547073J073151K41317K162400p95975J396179O476135
3851.7G04172134m662857k034530j3945923J776962Q851853j208725k93808K533874
3859.4F95188980J550446J793975m854888N85174O022720o558837n732270L619156
3867.1F91614456N426636N983353p979050p986755L631362N565415K433090r850006
3874.8F88838501J896591M584122J022262K575226L663025n491638q005981N480346
3882.6F94562454J409302Q29773M440002j1411056O43692L227463J161270M509811
3890.3F99372711q22143p925034J328659L249054k002640R95865J409073J209183L90091
3898.9F97204819q126297N885772K471314m938049M292831k710037j768189M15497
$$ plain form
3906.7 692727661 693825378 695667191 695313110 695411072 695439148 695949936 696130447 695327148 695350952 696569366
3916.3 696569366 693776245 691448593 696231995 696505508 693020096 694691544 696391144 698038635
3924 698038635 695843201 692002945 692758560 694096222 695471954 695133972 694796829 696126633 693443604
3932.7 693443604 692482529 694068756 693757477 694579315 695335922 694602203 694370270 694467468 696487808
3941.4 696487808 698058701 694003220 692679901 693697739 694500046 695849762 693799286 694297333 694222336
3950.1 694222336 691089020 693223267 694256592 693475571 694001999 694809647 695060349 693622208 693360214
3958.7 693360214 693194504 693854294 694222794 692775574 693117981 693359451 693650970 694824524 695525131
3967.4 695525131 695224915 693754120 693099518 694165192 694530640 693943787 694457169 694621353 694261246
$$ packed form
3906.7F92727661J097717J841813l54081R7962K8076N10788J80511q03299K3804J218414
3916.3F96569366k793121k327652M783402K73513l485412J671448J699600J647491
3924F98038635k195434l840256P55615J337662J375732l37982l37143J329804k683029
3932.7F93443604r61075J586227l11279Q21838P56607p33719k31933R7198K020340
3941.4F96487808J570893m055481j323319J017838Q02307J349716k050476M98047p4997
3950.1F94222336l133316K134247J033325p81021N26428Q07648K50702j438141k61994
3958.7F93360214j65710O59790L68500j447220L42407K41470K91519J173554P00607
3967.4F95525131l00216j470795o54602J065674L65448n86853N13382J64184l60107
$$ plain form
3976.1 694261246 694100418 694139709 694226990 694564438 695167999 694299850 694041138 694831696 695210876 695002213
3985.7 695002213 694237289 694123459 694275208 694994202 694660416 694044647 694709473 694487000 694470749 694656372
3995.4 694656372 694232864 693571701 693323669 693493881 693578491
4000.2 693578491
$$ packed form
3976.1F94261246j60828L9291Q7281L37448O03561q68149k58712P90558L79180k08663
3985.7F95002213p64924j13830J51749P18994l33786o15769O64826k22473j6251J85623
3995.4F94656372m23508o61163k48032J70212Q4610
4000.2F93578491
##END=$$ End of the data block
