##TITLE=$$ Begin of the data block
##JCAMP-DX=5.00 $$ ACD/SpecManager v 10.08
##SPECTROMETER/DATA SYSTEM=Varian
##DATE=08 Jan 2013 15:11:22
##DATA TYPE=INFRARED SPECTRUM
##DATA CLASS=XYDATA
##ORIGIN=
##OWNER=
##NPOINTS=3735
##FIRSTX=399.26403809
##LASTX=4000.35498047
##MAXX=4000.35498047
##MINX=399.26403809
##MAXY=75.56517792
##MINY=39.22834015
##XFACTOR=1.0000000000
##YFACTOR=0.000000100000000
##FIRSTY=59.36576462
##DELTAX=0.96440572
##XUNITS=1/CM
##YUNITS=TRANSMITTANCE
##XYDATA=(X++(Y..Y))
399.3 593657646 591374741 595713730 594922714 591673393 589241753 591339035 594406471 599064140 597991257
407.9 597991257 594702377 594630165 593894539 593809547 591646805 587737350 585550308 583644829 586350288
416.6 586350288 588401527 581633835 600146255 600909195 591018791 587756615 585269547 586722908
424.3 586722908 585510445 585578880 588578453 588865128 593946114 596315498 594707336 591333008 587085304
433 587085304 588394089 586874084 582851105 585095215 588272133 588545914 589048615 590656166 592311211
441.7 592311211 592870331 590961952 590940208 589659653 586264229 588398476 590553780 588757248 585934372
450.4 585934372 586923370 590323372 585917854 580975342 581400719 583289948 586551056 584519539 583247604
459.1 583247604 585352516 582334900 580072670 584907875 587572365 586672630 588210220 588476524 585960274
467.7 585960274 585865593 585163727 581291389 575045471 573737106 576683540 574559441 574147148 575243530
476.4 575243530 575583496 576744461 576194572 573983002 575540657 580837898 581838722 582281265 584495850
485.1 584495850 580497475 575668488 576335716 577082291 574137917 573359795 577973557 579240494 575295677
493.8 575295677 574749756 577755318 575436974 572768326 574013062 572442322 571465378 572456856 575355797
502.5 575355797 578878593 576788177 573414955 574027710 577740860 578577805 575281982 573983498 574092331
511.1 574092331 574367027 575743713 574151573 573838692 574040565 570497322 570239372 568816643 566494789
519.8 566494789 568945770 570145302 569088593 567406082 567486687 566196823 562831116 565414047 568614082
528.5 568614082 569807701 569648819 569092102 569363937 568742104 568551064 568045006 567180481 566315231 565656395
538.1 565656395 567010460 566530571 565221672 565723000 565289345 564573212 564599075 563678665 563538170 564966431
547.8 564966431 564493675 564619408 565773239 565209541 564155312 563345528 563065910 561620064 560841827
556.5 560841827 561647377 562705536 563325653 561418152 560224571 561247063 562826004 562215347 560252533
565.1 560252533 561275024 561548042 562096901 564354172 562974586 561293602 561322098 561336975 561068115
573.8 561068115 559007607 557134705 558107948 560373001 561991768 561658478 562014999 562203865 560431480
582.5 560431480 560099487 560250626 560176163 560236359 560140190 560761070 561561584 562856598 563614388 564519920
592.1 564519920 565783119 565567551 565202713 565116310 565471191 565132408 564432411 565585022 565803108 565169182
601.8 565169182 565176430 564854317 564669456 563744202 562670517 563262100 563389130 561693916 561298523 562171974
611.4 562171974 562648506 563146935 561566315 559546814 558965034 558644142 561305084 563472328 562506447
620.1 562506447 562262268 562329407 563264618 565219269 566450272 567118607 567264481 567567673 568396950 568879318
629.8 568879318 569004402 570458832 572774200 574157143 573765526 572540436 573169250 574645844 575819855
638.4 575819855 577310715 578841133 579460068 579061241 579710350 581741638 583470612 584068832 583806419
647.1 583806419 583549309 583855209 584694061 585297432 585262871 585764427 587223434 588411636 588660355 588049431
656.8 588049431 587656784 587887115 587867088 587795296 587857208 588556900 589771271 589266205 588078384 588533440
666.4 588533440 589865837 588705559 587525711 588391418 590019951 591831169 592081070 591333885 591890984
675.1 591890984 593155441 594574089 594795265 594639473 595768661 596392403 597344360 598332062 599145470
683.8 599145470 599848557 599797211 600730591 601089516 600837212 601281471 601918221 602801323 603674469 604961777
693.4 604961777 605911217 606320763 606099052 605330009 605261383 606157303 607045708 607493629 608418961 608952980
703.1 608952980 609282417 609457207 609464951 609997253 610204010 610853577 611304626 611332359 611285820 612622337
712.7 612622337 614809952 614870720 615530891 615988503 615509796 615937653 616914139 617850838 617853661 618734131
722.3 618734131 618817596 618061676 618019943 618543472 620054131 620893250 622333412 624105759 624870949 624226990
732 624226990 623912964 625514641 625973053 625983124 626108856 627481155 629086685 627770004 626982079 628032417
741.6 628032417 628641319 628585205 629692574 631020203 631379814 631173782 631015892 631810036 631754189 632556114
751.3 632556114 633998070 633899460 634262390 635057182 635212669 635263824 637246361 638643990 637370911
760 637370911 636972389 637752914 638372116 639115562 640048294 640934753 641362000 640813980 640329056 640563431
769.6 640563431 641207581 641382446 640874557 640817184 640581131 641871414 643854752 644060516 643867722 642818756
779.2 642818756 641828003 641724701 642064285 642605743 643163071 643516312 643782578 644838791 645223846 645289307
788.9 645289307 645273666 645292435 646147232 646241531 645789413 645679169 646214600 646501389 645897369 644510727
798.5 644510727 643339462 642828827 641846313 641347275 641404953 641911469 642108536 641134720 639827156 638936920
808.2 638936920 638327599 636803703 635648079 634828300 633952827 633442688 633311920 633824196 633250351
816.9 633250351 631916733 630851250 630493927 630392799 630599976 631414909 631698380 632702751 633345566
825.5 633345566 634047928 636414986 638694954 640474167 641156464 642119598 643938065 645988541 648293076
834.2 648293076 650089798 651279297 651681900 652086487 653244095 654901581 655516052 656091919 657869644
842.9 657869644 659826660 661004944 661012878 662111511 663486557 664259109 664197006 663793869 665193405
851.6 665193405 665978317 666801071 669214249 670292206 670234680 672451782 674877701 674939575 674782562
860.3 674782562 674891281 676063843 677694016 679133606 679621201 678852005 678079834 677652054 679136734
868.9 679136734 680259018 678938370 675988388 674774399 675402756 674676285 674130478 673684006 673685760
877.6 673685760 673069534 672317047 673004227 673300705 673305817 672744370 672743225 672110367 671483459 671550522 670597992
888.2 670597992 670185318 669625092 669517746 669196320 668906708 669453506 669379654 669222031 668746872 668725281
897.9 668725281 668361816 667580338 666890488 666153488 665686646 665687027 666495819 666799622 667995224 669015503
907.5 669015503 669564209 670981293 671768341 672227402 671277924 670540161 670305328 669783478 669824219 669347687
917.2 669347687 668503113 667229996 666101456 664374084 662060623 660337753 658665695 656626358 655186844
925.8 655186844 653892975 651694717 651138687 650503769 648906708 647918396 646000366 644333572 644156494
934.5 644156494 644411163 643195953 642046509 642004852 641600418 641187592 640554276 639479866 637920456
943.2 637920456 637384872 637471924 637457581 637578392 636830063 635849380 634729881 634791908 634967079 634225883
952.8 634225883 633705139 632400742 631075172 630151291 629415398 628105965 626490479 624849815 623082542
961.5 623082542 621866798 620303040 618902016 617587814 616675415 615850754 614608574 613630829 612178116
970.2 612178116 610880203 609124489 607193298 605332222 603226433 601852341 600249023 598317947
977.9 598317947 596150551 593779030 591007690 588072243 584892426 581084976 577960777 574749718
985.6 574749718 571322212 568630333 566226501 563353920 559819450 556875763 554561195 551843491
993.3 551843491 548962440 546645012 545167618 543377991 540636597 538084335 535887527 533417931
1001.1 533417931 531099434 529703140 528240814 526485825 525132217 523983345 522814941 521072083
1008.8 521072083 520046196 519225044 517713280 515962029 513746338 512472153 511676254 510584984 508544655
1017.5 508544655 505957069 503650169 501625862 500297394 497928009 495903931 494547005 493410454
1025.2 493410454 492574348 490885162 489749870 488679695 487866974 486607285 485210800 484066696 483086510
1033.8 483086510 483971291 484631805 484910812 485031548 485959129 487079887 487593994 488876305 489779282
1042.5 489779282 490485992 489963684 489948654 490658150 490010796 489180984 488494568 487754059 486066437 485406036
1052.2 485406036 485111885 484427948 483646355 482770042 483627510 483395729 482515411 482443542 483846626 485716858
1061.8 485716858 487301559 490023537 491336594 492350922 493893051 495495071 496587944 497127380
1069.5 497127380 498380547 499619789 500657539 501049538 501510696 501457672 501859818 502919159 503165550
1078.2 503165550 503491325 503611526 504603729 505365448 506370239 507341194 507230492 508322449 509589157
1086.9 509589157 510178032 510199890 511648369 513081436 513525658 514886208 515813866 517113380 518201408
1095.6 518201408 519446182 520583000 520507927 520686913 520938911 521920891 523944702 526202507 527370720
1104.2 527370720 527659912 527871284 528346634 528888741 529229774 530224609 531049042 531680298 531801987 532360878
1113.9 532360878 533429413 534041252 534883232 534122238 533369827 533460808 534012032 534669342 534125443 534639473
1123.5 534639473 535087776 535432510 536159668 536238136 536648407 537672806 539504242 541073418 542361031
1132.2 542361031 543496056 545167389 547016907 547809753 549176598 550596428 551523590 553282738 555545540
1140.9 555545540 556532516 556364517 556532516 557091522 557984619 558426895 558121758 558293228 558992882 559367485
1150.5 559367485 559520760 560034561 560221786 559339104 558703346 558930054 558160210 556898232 556544991
1159.2 556544991 556273308 556102219 555995750 555932999 555971413 556269302 557358398 558907738 560221672
1167.9 560221672 561307487 562980537 564848671 566832390 568563843 570129547 572009125 574053726
1175.6 574053726 576775208 578931732 580658455 582793999 584227371 585258293 586617203 588017998
1183.3 588017998 589544487 590524712 590877304 591949883 593375626 594209518 594693146 595226936 594896240
1192 594896240 593900223 593422050 593615761 593985977 593675308 593509865 593260880 592581673 591940575 590773697
1201.6 590773697 589820023 589142227 588473930 587940636 587470169 587108459 586455765 585867653 585254517 584874611
1211.3 584874611 584765282 584028854 583755989 583980331 583870430 583665161 583449440 583452034 583123283 582290497
1220.9 582290497 581315842 580493279 580372429 580395279 580322189 580609207 580565872 579480934 578572617 578391991
1230.6 578391991 577764091 576547890 575528908 575435333 575654640 575897636 576149139 575465927 574652977
1239.3 574652977 574388771 574283257 574076996 573953590 574164734 574251328 574211617 573960953 573550529 573073082
1248.9 573073082 572451096 572043343 571924934 572055626 572290497 572649002 572963715 572884331 572259636 571728477
1258.5 571728477 572045326 572320137 572257118 572636528 573226891 573616066 573901672 574410934 575180130 575507431
1268.2 575507431 575573959 575687599 575951538 577141914 578554535 579693718 580793762 581662483 582338371
1276.9 582338371 582921066 583648148 584498024 585373535 586231461 587303619 588524284 589679794 590784836
1285.5 590784836 591810913 592925797 593864212 594488449 595190048 596047783 596624756 597443199 598540840
1294.2 598540840 599470406 600087547 600212212 600559425 600636406 600729980 601090698 601420631 602104721 602215729
1303.9 602215729 601960907 602009773 602239723 602161369 601659470 601071167 600688210 600772476 600557671 599881248
1313.5 599881248 599529495 599701347 599576302 599487762 599878006 599902534 600078926 600627518 601675758 602757835
1323.2 602757835 603114700 603137970 603410797 603884659 603861542 603991814 603840790 603555870 603739853 603650627
1332.8 603650627 603417892 602944374 602454834 601739311 601348724 601174316 600920334 601726265 602529182 603249092
1342.4 603249092 603707008 604099388 604556313 604593506 604731712 605105858 605457001 605065880 605215530 605350151
1352.1 605350151 604890594 604866295 604471397 604098282 603796120 603695717 603512840 603255920 603037148 602897377
1361.7 602897377 603123550 601803436 601406784 601438332 601046562 600894852 600353432 599981575 599744644 599773674
1371.4 599773674 599724083 599261703 597935982 597290878 598211746 598432732 598248558 598169670 598517342 598322906
1381 598322906 597631187 597124596 595961647 595185585 594829712 594388390 592982216 592777405 593288689 592438278
1390.7 592438278 591207771 590157547 589275856 586783791 584695358 584217072 582904167 581710663 579328270
1399.3 579328270 578557243 578591156 577498283 576239281 574723473 572065620 570268250 569843826 568911476
1408 568911476 567982979 566964264 565390587 564355202 563518906 562990456 562018394 560644684 559374199
1416.7 559374199 558845825 559569931 556848068 556882935 558636360 558772202 558583031 558001137 558670921
1425.4 558670921 559550362 559738846 560531960 560856285 561128769 561853561 562833214 563607216 564343224 565993767
1435 565993767 567441139 566900139 567087555 568908157 570215645 571117783 571847420 572309456 573341522
1443.7 573341522 573608932 574085846 575128555 575694504 575855598 576896286 578211060 578650513 579261017
1452.4 579261017 580080719 581203728 581794777 581541252 580706863 581100311 584308701 585783195 587671852
1461.1 587671852 589006462 589996109 591692390 591350098 592546349 594549675 596458092 597949600 599344025
1469.7 599344025 601291695 601539116 601166344 603651886 607615128 610437355 610749512 612305908 614530144
1478.4 614530144 615879936 617233124 617959900 618573036 619924965 621053886 622219772 623333282 622832909
1487.1 622832909 622175293 623403549 622168541 620259552 621743889 623117218 622933311 622265663 621872406
1495.8 621872406 617628632 617834854 616950607 614583702 615253563 614436493 613605537 613485756 614032440
1504.5 614032440 613583374 606108475 603060684 605726471 607235222 606908913 608090210 607466888 605714493
1513.1 605714493 606060905 605133896 604256897 602826653 601147881 602331467 603286018 601367073 599161224
1521.8 599161224 599715996 601378822 603464432 602762794 602891922 603600883 603399506 604096756 604946022
1530.5 604946022 605604324 606218796 606120834 603251381 604921112 606374092 607060738 608830910 603536453
1539.2 603536453 598707657 604105339 605740128 606126938 607995377 608082390 606610985 608654709 609550247
1547.9 609550247 610219383 609194221 608233109 610685081 611744423 612163086 609418259 610062561 612715836
1556.5 612715836 614406433 611011810 600555763 605005722 607652588 609371071 609099312 608341331
1564.2 608341331 606309242 604572029 604246254 603261070 602721176 596812172 596967278 596884079 594880409
1572.9 594880409 593375816 591734962 591282310 582059784 581082268 579622154 577420540 575225334 571424103
1581.6 571424103 569207420 565249863 562685585 559122772 555930672 552926826 548849030 546446724
1589.3 546446724 542332077 540146370 536171722 532914200 529474373 525574989 523708649 520161934
1597 520161934 518512802 514622192 512079544 509353561 506676331 504693756 500748711 499438477 496637840
1605.7 496637840 495263748 492538948 491143417 489795227 486998405 486831741 484172363 483413658 481399307
1614.4 481399307 481534805 480958405 474261246 476450348 475646820 476366386 475146217 475721855 475209274
1623.1 475209274 472315407 473969574 473881950 475339851 473524323 474114151 475060654 475673676 476485977
1631.7 476485977 476364861 478612823 479163742 478677406 476786194 479056053 480876808 482241440 484262238
1640.4 484262238 484412308 486947403 487748566 489214401 490140457 489689560 492883072 491721764 494543610
1649.1 494543610 496256294 499693489 502772827 502013168 498613777 500685616 505234795 506549377
1656.8 506549377 508340721 509593658 511362267 513203545 515091515 517664528 517529907 520811119
1664.5 520811119 523000793 525048866 527159119 529261398 530839005 531443558 535389023 537253876
1672.3 537253876 541174927 545049973 546817245 548124962 551106834 554877777 557041779 559981537
1680 559981537 562050514 565570030 570122070 571468010 572560959 574976921 579990158 583443222 586024742
1688.6 586024742 589322205 592139664 595585327 598727875 602004662 605796623 609090347 607718620
1696.4 607718620 611696320 616847076 622083626 623806458 620981026 627546654 631938896 634969444
1704.1 634969444 637152748 639273186 640418701 642448654 645451736 647002487 648434448 650611877
1711.8 650611877 652567368 654407425 654127808 653519287 656699371 657685318 653087540 657764816 661288834
1720.5 661288834 662878799 664071274 664745789 665078430 666180725 667367172 667938385 668894577 670251389
1729.1 670251389 669707489 670024643 673444061 676872940 675322418 670019760 673543091 676935349 678428116
1737.8 678428116 681167068 681512375 679460678 682890396 685029373 684652634 685545425 687957077 689872131
1746.5 689872131 691183243 692383652 693538437 696917496 696796570 697097092 701141281 703545456 705668106
1755.2 705668106 707736206 707217789 708236847 710825424 712762146 715003891 713473892 712634964 715336761
1763.9 715336761 716458817 717601929 719311447 720236511 718243790 719616394 722439575 721867599 720487518
1772.5 720487518 719677048 723122711 725242538 724783478 726488876 726956253 727783279 727941895 726938248
1781.2 726938248 727672043 728768768 730077057 729953003 730047684 731228638 731953659 732215805 732844849
1789.9 732844849 732475052 732420578 731607971 731346970 734633865 735753937 734851761 735748825 737315750
1798.6 737315750 736956100 735220261 736642303 736604691 737216110 738893661 739545822 740300293 740390549
1807.3 740390549 740418243 740803986 741169891 739881516 740125961 741255493 741678543 742889633 743383102
1815.9 743383102 743974686 743351364 743047714 743438873 743199081 744281158 744170074 744812012 746052399
1824.6 746052399 744399490 744405746 745760727 746677780 745645752 742669525 743689117 745947113 746482239
1833.3 746482239 746861191 747740402 748346939 748133926 746907883 747162094 747382507 747725830 747705841 748689957
1842.9 748689957 750109253 746458893 748034134 749851761 749318924 748635941 748755951 749389954 749391785
1851.6 749391785 749979095 750366898 751164017 751368103 750929642 751068344 750334549 750384293 750660629 750861816
1861.3 750861816 750813980 751113663 751871567 752082596 752386246 751967087 752167892 750650253 749225769
1869.9 749225769 750960464 752269897 752745819 752814560 753267441 753110123 752891159 752431030 752094421
1878.6 752094421 752396164 752394791 753470917 753604050 753457642 753808289 753716736 753765182 753167648 753564682
1888.3 753564682 753604889 752234726 752804337 753950882 753992844 753935013 753678284 752900543 753640442 754029465
1897.9 754029465 754031372 754063950 753730469 753897095 754140015 754350204 753869247 753936768 754317627 754232025
1907.6 754232025 754251556 754236298 754067841 753959961 754969177 754797440 754238892 754186325 754130630 755330734
1917.2 755330734 754084549 752976303 754079056 755003586 755651779 754639893 753635864 753890686 754243393
1925.9 754243393 754324036 754563599 754749527 755086670 755086594 754502945 754362106 753847427 753760376 753750992 753949432
1936.5 753949432 754514999 754498444 754614639 754500809 755199585 754810104 753123322 753596497 753768082 753562698
1946.1 753562698 753496933 753731766 753933258 754156570 754460907 754320984 754116821 753496704 752883530 752702713
1955.8 752702713 753233261 753725891 753822250 754145203 754115448 753967285 753593826 753275070 753334503 753210602
1965.4 753210602 752631989 752165985 752477417 752898712 753221664 753143692 752842712 752567291 752625198 752722092
1975.1 752722092 752713318 753006363 753025055 753217392 753188324 753025284 752871094 752326584 751945267 751654205
1984.7 751654205 751852493 752103043 752432938 752314453 751950455 752483826 752270126 751360245 751352768 751757126
1994.3 751757126 751499405 751313553 751533661 751763763 752226639 751784744 751531754 751364594 751104126 751421127
2004 751421127 751174927 750851288 750798187 750928116 750763931 750631027 750351944 749799347 749879456 749968872
2013.6 749968872 750285263 750412979 750219269 749739075 749436340 749718323 749452667 749277496 749323730 749545517
2023.3 749545517 749504318 748994370 748817062 749162521 749650497 749335251 749251938 749301376 748851166 748392944
2032.9 748392944 748349075 748671341 748599167 748683701 748468399 748155365 747997742 747754211 747555084 747348709
2042.6 747348709 747754440 747780762 747917862 748093796 747896271 747996292 747566147 747046280 746840057 747157440
2052.2 747157440 747258911 747416229 747736130 747197113 747119980 747246323 747122421 746845245 746616135 746573181
2061.9 746573181 746616135 747043152 747014236 746811981 746848145 746896820 746578140 746316986 746416473 746239395
2071.5 746239395 746130447 746061554 746255722 746348724 746341248 746045074 745688629 746102448 746099319 746088181 746043701
2082.1 746043701 746005402 746219406 746141129 745967865 745524826 745415421 745257111 745305862 745467377 745332489
2091.7 745332489 745562668 745644531 745548782 745161133 745046158 744995880 744624100 744209061 744175949 744872971
2101.4 744872971 745285568 745563965 745166016 744692459 744471893 743967285 744052582 744111633 744332581 744350815
2111 744350815 744474258 744646835 744270859 744150467 743851395 743674927 743404846 743472977 743621826 743449860
2120.7 743449860 743876572 744310455 744368744 743773117 743390732 743121033 743033905 743121643 742811890 743146286
2130.3 743146286 743305969 743449631 743619995 743570480 743448868 743086929 743194351 743331223 743559418 743385849
2140 743385849 743259659 743577347 743704376 743585052 743238983 743358231 743048172 743059540 743366699 743211060
2149.6 743211060 743383255 743269806 743329620 743483353 743497467 743136978 742888641 742961349 742718811 743030243
2159.3 743030243 743426361 743711777 743460922 743230133 743446198 743186111 742999802 742714386 742840118 743071899
2168.9 743071899 743078003 743274689 743343658 743189850 742879181 742852020 742614975 742776413 743368988 743969040
2178.5 743969040 744273224 743786926 743653259 743404770 743118896 743108063 743147888 743381500 743719482 744040298
2188.2 744040298 743955765 744148331 743961716 743524170 743373566 743274078 743326340 743077545 743200531 743258972
2197.8 743258972 743367615 743674774 743694229 743546906 743258209 743451691 743588791 743910065 744093781 744081192
2207.5 744081192 744198227 744093018 744363937 744057693 743684769 743553391 743351822 743469925 743505936 743907776
2217.1 743907776 744388580 744535980 744373245 744298401 744057846 743687592 743523178 743491364 744017487 744176636
2226.8 744176636 744274750 744332123 744249115 744164276 743665009 743773575 743885040 743836517 743962860 744287033
2236.4 744287033 744387054 744010239 743918839 743786392 743737411 743310699 743203125 743470612 743536606 743806992
2246 743806992 743703003 744113464 744145050 743599854 743413010 743315201 743396072 743239746 743471680 743764343
2255.7 743764343 743843079 743703461 743597717 743837585 743924484 744131241 743829956 743394089 743228683 743382874
2265.3 743382874 743481903 743206635 743434219 743650894 743510132 743056641 743181000 743420944 743243866 743282242
2275 743282242 743278580 743677902 743709259 743434677 743137741 743214493 743209915 742499008 742573242 742432938 742485352
2285.6 742485352 742656174 742446518 742706528 742821426 742918549 742602463 742625275 742602768 742522430 742706680
2295.2 742706680 742460022 742989883 743303528 743207016 742845230 742482376 742352600 741854477 741902847 742088470
2304.9 742088470 742525177 742427750 742194672 742306671 742122879 742049332 741318207 741859131 742799606 742742996
2314.5 742742996 742854843 742931061 743332367 743375397 742961960 742620850 743172455 743113937 742491074 742723160
2324.2 742723160 742468796 743542099 744481354 743808136 743231812 742873840 742824936 743331909 743744888 742957458
2333.8 742957458 743087921 743841400 743815536 743318176 742820358 742413940 741948471 742594910 742444916 741943436
2343.4 741943436 741899872 741226501 740940323 740607300 740200424 740611877 741728973 741915359 742044678 742827759
2353.1 742827759 743432312 744173050 743718491 743993759 743632889 742037735 741039810 741255875 742088547
2361.8 742088547 741763916 742037735 741916733 742838821 743121338 741422806 740638885 739943161 739873810 739693069
2371.4 739693069 739357224 739031448 738408279 738433685 738691330 738461533 737843552 737473831 737170639 737155380
2381.1 737155380 737143097 736890106 736585770 735987396 735908127 736051483 735829926 735648804 736006699 736405411
2390.7 736405411 735948105 735407104 735039139 734720535 734633789 734958038 735185013 734761734 734590683 734784012
2400.3 734784012 734719620 734278793 734167633 734300537 733946991 733520737 733370514 733384933 733450241 733742218
2410 733742218 733771667 733447952 733178024 732890854 732755280 732523575 732316895 732373886 732432175 732385635 732461777
2420.6 732461777 732219162 731604080 731244049 730769882 730606461 730879517 731209717 731195755 730801315 730657349
2430.2 730657349 730482254 730295334 729653625 729137955 729158173 729111099 729403229 729699249 729791794 729326630
2439.9 729326630 728927994 728790970 728507767 728419647 728070831 728001556 728003845 728032913 728091888 727880249 727711716
2450.5 727711716 727280350 726932755 726473160 726459961 726433334 725802917 725977173 726506577 726616898 726296616
2460.1 726296616 725946503 725419159 724994736 724944534 724781723 724696045 724555283 724546432 724223938 723814545
2469.8 723814545 723445892 723110809 723162613 722785110 722598495 722500992 722628555 722902527 722849121 722920151
2479.4 722920151 722385712 721964035 721721497 721253815 720509338 719927673 720274811 720362320 720195160 719998322
2489.1 719998322 719935150 719872208 719518051 719368515 719051437 718588791 718212585 718058853 717773819 717739029
2498.7 717739029 717875519 717534637 717269669 716959000 716895065 716673660 716297760 716244431 716200333 716208496
2508.3 716208496 715756531 715283508 715169373 715074539 714512939 713964386 714004288 714012985 714121246 714035416
2518 714035416 713740158 713423843 713168259 713020401 713060837 713031540 712373428 712407608 712548904 712152328
2527.6 712152328 711978149 711837082 711729889 711344528 711237030 711136551 710752640 710540771 710529861 710486145
2537.3 710486145 709870834 709432831 709453430 709736328 709481125 708820190 708565674 708181763 708124237 708081436
2546.9 708081436 707887802 707842789 707619019 707209396 707145233 707305222 706894989 707002182 706915894 706200638
2556.6 706200638 705909424 705481491 705296326 705273743 704986572 704584274 704663086 704882965 704511032 704216537
2566.2 704216537 703869629 703470078 703430557 703746033 703611145 703335876 703405457 702829819 702106171 701646118
2575.9 701646118 701803970 701900482 701292725 701362000 701723175 701724472 701454849 700856628 700250854 700047836
2585.5 700047836 699939270 699641724 699419937 699213104 699487839 699647446 699134674 698952866 698966751 698480225
2595.1 698480225 697912750 697600403 697392807 697348785 697121048 697181168 697414780 696997604 696673660 696499710
2604.8 696499710 695999527 695403442 695434189 695745163 695594101 695319824 695023804 694801636 694417801 693975525
2614.4 693975525 693750076 693531113 693076706 692659760 692514572 692154007 692161713 692281342 692089386 691987762
2624.1 691987762 691808319 691628876 690997849 690346451 690342407 690564346 690386047 689864960 689498520 689225616 689280701
2634.7 689280701 689359131 689199142 688670425 688061371 687839737 687545624 687337646 687260132 687372437 687008972
2644.3 687008972 686432953 686657639 686414795 685732498 685183411 684871216 685075150 685101089 684830856 684500122
2654 684500122 684065628 683706207 683619308 683530045 683251038 683126755 683056107 682619247 682568741 682618103 681901474
2664.6 681901474 681598969 681473846 681184311 681164169 681152344 681049423 680598450 680368881 680184097 679831390
2674.2 679831390 679523849 679386826 679605255 679587860 679383240 678853989 678516617 678492584 678322754 677999115
2683.9 677999115 677408752 677468338 677463531 677197266 677023773 676587067 676567535 676365204 675778427 675457458
2693.5 675457458 675731354 675958862 675515900 675043716 674865875 675039597 674977951 674510956 674111557 673949661
2703.1 673949661 673673096 673377914 673492050 673554687 673646088 673539124 673155594 672638016 672087555 671905823
2712.8 671905823 671802750 671915359 671881256 671404572 671109619 671120453 670794830 670364380 670375214 670266418
2722.4 670266418 670068207 669721680 669570236 669497986 669491730 669779129 669420853 669087143 668695145 668451233
2732.1 668451233 668408737 667953949 668103180 668205032 668253937 668456192 668290482 667997437 667897797 667916641
2741.7 667916641 667298584 666686172 666477356 666511383 666719742 667006607 666923447 666385269 666206894 665708389
2751.4 665708389 665420761 665410919 665298996 665625916 665628967 665517731 665152664 664775543 664388809 663842621
2761 663842621 664217224 664467316 663955078 663667221 663729782 663470306 663014526 662635727 662376480 662265778
2770.7 662265778 661960220 661903458 661919708 661977768 661937027 661487122 661331863 661199951 660861130 660556030
2780.3 660556030 660465698 660255890 659886398 659753265 659495392 659095306 658831406 658698883 658335266 658080826
2789.9 658080826 657919693 657581635 657177353 656767654 656696243 656083069 655615311 655720673 655231171 654675751
2799.6 654675751 654312057 654019623 653500290 653239365 653351364 653137360 652854233 652502213 652375031 652177658
2809.2 652177658 651295242 650140839 649675980 649632416 649441452 649472504 649108505 648481674 647815857 647300034
2818.9 647300034 646917877 646135788 645812378 645494156 644936523 644733658 644442215 643988571 643565140 643204803
2828.5 643204803 642586060 641959229 641706085 641134186 640001297 639302483 638897514 638240204 637901306
2837.2 637901306 637512627 636406212 634997635 634106369 633288269 632380638 631579018 630168724 628786659
2845.9 628786659 627553749 625950012 624159698 622751923 621829376 620759735 619979324 619432449 619056969
2854.6 619056969 618995056 619016342 619105301 619109192 618932953 618421211 618235931 618296356 618592453 618888245 618413811
2865.2 618413811 617929192 617236900 616367226 615744438 615568848 615509949 614880447 614388275 613854866 613309059
2874.8 613309059 613073730 612910118 612506409 612070084 612136154 611966019 611563988 610847893 609859772 609091034
2884.4 609091034 608705368 608722916 608273201 607700272 606803284 605615196 605207748 605121193 604827728 604132729
2894.1 604132729 603600197 602711716 601266785 600881729 600792465 600226936 599984932 599772949 599422760 598745193
2903.7 598745193 597157593 595968437 595844116 595465927 594825783 594491653 593697624 592200546 591259689
2912.4 591259689 590463753 589271088 588445358 587532578 586594810 585874443 584782715 583236046 582039185
2921.1 582039185 581551590 581140480 580749550 580426216 580508041 580848961 580756416 580507126 580452194 580844536
2930.7 580844536 581522827 581901932 581809311 582096252 582925797 583119698 583061714 583704262 584497452 584909592
2940.4 584909592 585143509 585528831 586302986 586954308 587220802 587585297 588049355 588246307 588349495 588954239
2950 588954239 589139366 588820038 589044800 589187813 589344444 589887962 590290871 590287895 590147057 590083199
2959.7 590083199 590311165 590950279 591489182 591913986 592101669 592164536 592355118 592822113 593572464 594086494
2969.3 594086494 594627151 595009079 595394783 595836792 595923271 596104126 596602554 597398643 597640190 597668457
2979 597668457 597977638 598105202 598196602 598091011 598011665 598034973 598467827 598821983 598739548 598930855 599008636
2989.6 599008636 599082146 599219894 599197655 598747063 598633766 599253578 599419556 599207802 598515472 598315010
2999.2 598315010 598532753 597863541 597342110 597062492 596889534 596719704 596425934 596258888 596021690 596126328
3008.8 596126328 596040421 595528450 595121765 594450111 593822212 593492546 593203812 593089256 592894020 592487679
3018.5 592487679 591948090 591259270 590457726 589827156 589669266 589463463 589476089 589511566 588739090 587752342
3028.1 587752342 587137146 587037849 586593781 585954742 585556870 584883118 584449005 583969727 583228836 582703667
3037.8 582703667 582584038 582208900 581597595 581322212 580588913 579555817 578966942 579278526 578939781
3046.5 578939781 577697296 577267723 576737442 576254883 575684891 574905357 574389610 573945465 573982697 573703537
3056.1 573703537 573237686 572523384 571659164 571244507 570756607 570135880 569530716 569324913 568840904 568488846
3065.7 568488846 568481369 567991829 567316208 566239510 565510826 565267296 565103683 564681091 564080849 563835793
3075.4 563835793 563424530 563138733 562794838 562534065 562235527 561403542 560366325 559748878 559996796
3084.1 559996796 559347305 558506699 558592186 558319054 557634583 557057915 556965256 556633377 556001816 555152664
3093.7 555152664 554557762 554693947 554325294 553336487 552385330 552148590 552055931 551697464 550988884 550051460
3103.4 550051460 549840660 549463921 549162827 548967514 548299904 547579918 546964798 546860046 546483841 545945816
3113 545945816 545659447 545280533 544520988 543877525 543848877 542867355 541753960 541555939 541311111 540588150
3122.6 540588150 539377747 538916550 538743439 538050537 537601700 537138290 536233521 535467377 535352974
3131.3 535352974 535233879 534370384 533161545 532250214 532052765 532343712 531975517 531316528 530817413
3140 530817413 529744225 528843880 528566666 528399315 527821655 526853600 526090050 525448494 525031929 524840088
3149.6 524840088 524326172 523323021 522588615 522173996 521317177 520455208 520040016 519801483 519186592
3158.3 519186592 518186798 517308807 516837463 516538582 515900803 515011559 513998489 513386726 513221359
3167 513221359 512795372 512224846 511886673 511553230 510718193 509651222 508676834 507980614 507549171 507312660
3176.6 507312660 507165833 506457748 505576859 504919548 504326859 503562737 502890244 502642937 501870193 500845375
3186.3 500845375 500475655 500321159 499648209 498872414 498139915 496907234 496160507 496047707 495525017
3195 495525017 494599190 494050903 493464661 492534409 492203407 491997147 491803398 491337051 490371628 489867859
3204.6 489867859 489571152 489085770 488384438 487904320 487411804 486411362 485534210 484713135 484093781
3213.3 484093781 483965149 483666229 483033409 482436028 481782837 481249161 480519905 479703827 479490395 479278488
3222.9 479278488 479082108 478585854 477888222 477085571 475653572 475038681 475098724 475055580 474932098 474532776
3232.6 474532776 473901138 473169250 472900696 472464218 471650772 470858727 470211029 469899483 469379158 468898087
3242.2 468898087 468903351 469026718 468771019 468241158 467471771 466660767 465975609 465046158 464577141 464473839
3251.9 464473839 464320030 464178658 463928642 463446426 462394905 461557693 461210709 460803909 460087547
3260.5 460087547 459606667 459794083 459505539 458810349 458612823 458328667 457418900 456881638 456748466 456459198
3270.2 456459198 456442146 456322021 456047821 455479469 454883499 454598732 453768196 453030586 453103523 453232574
3279.8 453232574 452650948 451899109 451701965 451878548 451750374 450892525 450102539 449673233 449532318 449657021
3289.5 449657021 449406929 448932953 448664894 448444443 448002243 447336845 446727180 445949974 445233955 445372314
3299.1 445372314 445197372 444676170 444771271 444598083 444310112 444091606 443761139 442724571 441484642
3307.8 441484642 441314125 440969467 440416946 440054588 439891891 439567032 438764496 438132324 437312851 437240028
3317.4 437240028 437159081 436356888 435965462 435495148 435029526 434612923 434324837 433519936 432480392 431901588
3327.1 431901588 430991821 430282097 429527054 429023514 428731308 427888794 427343483 426932144 426216354 425494232
3336.7 425494232 425133171 424541168 423466110 422604179 421969376 421378784 420915184 420510712 419920235
3345.4 419920235 419367867 418640633 418114204 417728043 416908150 416421280 415901070 415151367 414308395 413698082
3355.1 413698082 413338852 412606201 412095490 411497383 410839119 410642090 410803413 410617714 409759674 409327393
3364.7 409327393 409279289 408861275 407856140 407054596 406631660 405962639 405253716 404964714 405066414 404398956
3374.3 404398956 403330307 402709694 402425499 401876945 401066475 401158752 401376534 401251068 400546837 399432831
3384 399432831 398906746 398749352 398769608 398664436 398762398 398295975 397653008 397916412 397768898 397179832
3393.6 397179832 396477661 396535721 397096176 396554298 395652962 395465469 395764847 395431976 394975052 394962463
3403.3 394962463 394927330 394977837 394687805 394094582 393709221 393707962 393929443 393979301 393697319 393464699
3412.9 393464699 393450089 393289528 392781868 392283401 392443619 392724991 392672234 392570114 392480927 392466660
3422.6 392466660 392649727 392760811 392565193 393006439 393653526 393540001 393242455 393185005 393266792 393313751
3432.2 393313751 393730927 394326744 394592209 394410706 394130287 394369736 395119171 395794449 396431313 396739273
3441.8 396739273 395650177 395835571 396715317 396649399 397368317 397147179 397432442 398343658 398751106 399499626
3451.5 399499626 399427719 399785881 400237770 400866737 401968193 402169228 402391319 402864494 403695183 403963509
3461.1 403963509 404124031 404780998 405119438 405817947 406573677 407159538 407611198 408051720 408469162 409429436
3470.8 409429436 410434113 410789757 411481819 411924133 412428970 412948914 413357315 414239883 415174751
3479.5 415174751 415843010 416289635 416972885 417142067 417999725 419118576 419780426 421057129 421235886
3488.1 421235886 421514511 422494469 422786789 422982559 423633041 424861794 425942955 426561661 426773376
3496.8 426773376 427510757 428729782 429778862 430545616 431316795 432237549 432161903 432579155 433998375
3505.5 433998375 435197868 436039276 437514534 438736534 438021431 438181953 438899345 439918365 441004486
3514.2 441004486 441292267 442082825 442999916 444239044 445240898 445727615 446815491 448626442 450010757
3522.9 450010757 449857826 449775505 450346146 451995888 453342705 453985367 454699783 455497093 456607094
3531.5 456607094 456888809 457495346 458875504 461496277 462899437 461846123 462954254 464404488 465569572
3540.2 465569572 466804008 467854385 468931999 470286217 471641083 471801605 472963753 472954979 474113579
3548.9 474113579 476473885 478241043 480398369 479388771 479274483 479854088 481333961 484374580 485488396
3557.6 485488396 487197037 488486328 488952217 489284515 490878448 492480698 493294067 497496414 498149834
3566.2 498149834 497664375 499279137 498785400 501059532 502378769 503898811 505225334 506314735 507662506
3574.9 507662506 509281082 511875267 512259827 513819733 515637512 516290398 517771530 519496880 521383934
3583.6 521383934 522726288 526510353 527515564 525217476 527294235 527092438 529853096 532901649
3591.3 532901649 535268555 536210747 536623230 540216064 539359512 540415077 543274689 543780899 546888390
3600 546888390 548621063 549722328 551835403 553496895 555407600 557723427 559357986 558272018 561725616
3608.7 561725616 562358360 561679115 568448639 570314713 568630486 572319221 571327019 574218941 578634605
3617.4 578634605 578600273 579418602 578556595 580068741 583996391 586542473 588314476 590541267 592557182
3626 592557182 594135017 598971062 598930626 590292587 594521561 599559021 605066986 606753082 605077705
3634.7 605077705 607610626 610911331 613072052 613247452 614435272 616549644 618813591 620552444
3642.4 620552444 620630608 622287025 625811234 631543694 630817909 625707932 630539246 632766533 630574875
3651.1 630574875 628736992 633239632 637570877 641916199 647678528 639712791 639886246 644679108
3658.8 644679108 646078415 647984009 648822861 650250854 650375519 651756210 654216309 654613724 658471298
3667.5 658471298 661093445 659929962 660496674 654570847 655471725 662357864 670746536 670710526 652874680
3676.2 652874680 654824677 662138748 667660751 665738831 664407654 666718903 668783951 670549393
3683.9 670549393 671087952 670865021 674098206 680886002 673139343 668558197 677669067 671296387 668998108
3692.6 668998108 674805603 676096039 677874985 678486862 677449112 677704086 677692184 680258484 683356018
3701.3 683356018 678403778 675514450 679653778 681569290 682230835 682881088 684927902 688900986 681819534
3709.9 681819534 684547119 690957947 676832657 678523483 682760162 683168564 684126892 686608047
3717.7 686608047 688081131 684799118 684979095 690572586 687376709 682149658 687734604 689256744
3725.4 689256744 688479919 686195068 685773163 689065781 689606018 694804230 691781540 683524246 692537231
3734 692537231 694013977 685153046 683722839 684740601 685567474 688674774 692530289 688481903 690186234
3742.7 690186234 701845856 695360794 676665802 685050125 690418472 696353989 694272308 683379974
3750.4 683379974 694834824 691716309 682983322 687756958 692008057 695553360 689575195 690409622
3758.2 690409622 696611633 690204239 687399368 690799026 692475052 693003998 696644897 694720078
3765.9 694720078 689026108 691334305 696856689 699160995 689798203 689966965 693437729 694138336 694780884
3774.5 694780884 693950119 694637833 695260544 698275909 699463806 691046524 691981430 693551712 694152374
3783.2 694152374 697193680 694872894 692944183 693464584 694203110 695834885 695735474 695239563 695388031
3791.9 695388031 695891342 695360718 696591339 700771103 698072586 693764572 694730759 697610855 704057693
3800.6 704057693 698985062 686209869 689019318 692029114 697204590 704382095 694832916 688378983
3808.3 688378983 693466949 695595322 695287247 696003723 696371536 697180481 702969894 703550491 688606949
3817 688606949 692036362 696942291 701060791 705364227 688456421 687467728 692851410 695869217 698682175
3825.7 698682175 698718796 693993912 693100586 694958572 698820114 701361771 691667175 693264999 702130127
3834.3 702130127 697130356 695126495 703984528 697078247 690694122 698192215 693518066 692857666
3842.1 692857666 700448990 698513565 693174286 694794540 695892334 695608521 697177582 696296616 697421188
3850.7 697421188 703710709 699716263 700815887 687618942 685860596 696041870 696940994 694587021
3858.4 694587021 695609131 697916107 701607437 696549530 695564575 702800293 696206665 688781204
3866.2 688781204 692513428 697551956 705496063 699863434 688158340 691125793 696183701 699645233
3873.9 699645233 690601807 691327209 695838013 695628128 697894135 702651291 698007889 689905243 694937439
3882.6 694937439 696499329 697774887 704350967 691908112 691191940 695664673 695773697 699395294
3890.3 699395294 699310684 690698624 691379852 694674988 693991241 695537415 696534882 698782043 701028976
3898.9 701028976 690549469 695419693 699077606 692965775 697463379 694939651 692329330 692341843
3906.7 692341843 693269424 695577621 694970856 695526886 695520782 694796829 694836578 694598389 696141891 699086838
3916.3 699086838 696609955 692447281 696765060 697405090 692301483 694148560 696014404 696204987 694198608
3925 694198608 691557617 693453140 695542068 696219330 694453735 694261322 696996841 694887619 693134689
3933.7 693134689 694667206 695244522 695797882 695519791 694207153 693874130 693744812 695644913 697778549
3942.3 697778549 693823013 693120804 694818726 695125961 696227493 694111481 694294281 694792557 692352524
3951 692352524 693592911 694158630 694209900 694653702 694828033 694524612 693024063 693911362 694542618 694760437
3960.7 694760437 695334702 694102783 693624725 693722000 693397903 693471985 694589005 695221024 694012680
3969.3 694012680 693424988 694539948 694624176 693682861 693431091 693516159 694055710 693535614 693671951 694786835
3979 694786835 694398804 693951721 693691559 693819122 693755264 693633575 694169006 694664383 694720459 693903427
3988.6 693903427 694005051 693527222 692784805 693752289 694122162 694282379 694209290 693905411 694284592 694449310
3998.3 694449310 693813629 693352814
4000.2 693352814
##END=$$ End of the data block
