##TITLE=$$ Begin of the data block
##JCAMP-DX=5.00 $$ ACD/SpecManager v 10.08
##SPECTROMETER/DATA SYSTEM=Varian
##DATE=08 Jan 2013 15:41:18
##DATA TYPE=INFRARED SPECTRUM
##DATA CLASS=XYDATA
##ORIGIN=
##OWNER=
##NPOINTS=3735
##FIRSTX=399.26403809
##LASTX=4000.35498047
##MAXX=4000.35498047
##MINX=399.26403809
##MAXY=73.52552032
##MINY=30.92878532
##XFACTOR=1.0000000000
##YFACTOR=0.000000100000000
##FIRSTY=47.60574341
##DELTAX=0.96440572
##XUNITS=1/CM
##YUNITS=TRANSMITTANCE
##XYDATA=(X++(Y..Y))
$$ plain form
399.3 476057434 470529404 478846664 493535614 493555450 492781754 492487717 494011192 500837517 496208954
407.9 496208954 491313057 488752708 489704361 488369141 482410202 480467529 481669426 486218872 489023781
416.6 489023781 485006790 470090408 474107971 480549507 482058258 485102043 482788582 486496544
424.3 486496544 491006355 488268661 485472832 486688271 490619965 486772614 482025909 482911110 483657494
433 483657494 483790283 485312920 488969536 486867027 482718582 481635780 482150688 485643311 486162834
441.7 486162834 483366508 485994568 489118347 490100708 489191895 485663795 486274529 488142586 487464981
450.4 487464981 488012009 490155334 488119698 486949425 488881683 483971214 478334351 480144691 481517143
459.1 481517143 481073685 478701820 480430603 483344078 484451523 486052246 484800148 483263893 482206001
$$ packed form
399.3D76057434n528030Q317260J4688950J9836p73696k94037J523475O826325m628563
407.9D96208954m895897k560349R51653j335220n958939j942673J201897M549446K804909
416.6D89023781m016991j4916382M017563O441536J508751L043785k313461L707962
424.3D86496544M509811k737694k795829J215439L931694l847351m746705Q85201P46384
433D83657494J32789J522637L656616k102509m148445j082802N14908L492623N19523
441.7D86162834k796326K628060L123779R82361r08813l528100O10734J868057o77605
450.4D87464981N47028K143325k035636j170273J932258m910469n636863J810340J372452
459.1D81517143m43458k371865J728783K913475J107445J600723j252098j536255j057892
$$ plain form
467.7 482206001 479346581 475309372 476562843 481329956 477932816 473899231 475236855 475703964 475852127
476.4 475852127 474485664 472407150 470810432 469357033 471794930 473988991 470497398 466006241
484.1 466006241 466123619 470800095 475084114 474524002 472937317 471420250 470523643 470202026 469887276
492.8 469887276 470816460 470010643 468839798 468929558 466984940 466843338 468992767 470336113 472497940
501.5 472497940 475409393 474449577 470267029 469032135 470183372 464757957 460104332 463423615 468344269
510.2 468344269 469759483 468877106 466051369 465684204 465649338 461687927 459652710 461235847 462743187
518.9 462743187 461199341 461226654 464313965 463940773 462564735 461734810 459181137 456345787 456906166
527.5 456906166 457990036 457950478 460259056 461362228 460240250 459426613 459652557 460398140 458252754
$$ packed form
467.7D82206001k859420m037209J253471M767113l397140m033585J337624M67109J48163
476.4D75852127j366463k078514j596718j453399K437897K194061l491593m491157
484.1D66006241J17378M676476M284019n60112j586685j517067q96607l21617l14750
492.8D69887276R29184q05817j170845Q9760j944618j41602K149429J343346K161827
501.5D72497940K911453r59816m182548j234894J151237n425415m653625L319283M920654
510.2D68344269J415214q82377k825737l67165l4866l961411k035217J583137J507340
518.9D62743187j543846K7313L087311l73192j376038q29925k553673k835350N60379
527.5D56906166J083870l9558K308578J103172j121978q13637K25944P45583k145386
$$ plain form
536.2 458252754 456674538 456365585 456328735 457178535 457195206 458585434 459342575 458940620 460255699 459118881
545.9 459118881 456148148 454708328 454255676 454824371 454924049 455736275 456482697 455693703 454618797
554.5 454618797 452044792 451712418 452561874 451628571 452191696 452171860 452420006 453500252 454077606 455613670
564.2 455613670 454702263 451821899 451793518 453600883 454059448 454016113 454393311 453722992 451732521 451618080
573.8 451618080 452796135 451135178 449939804 450617447 451080971 451656036 451307106 451267014 451800117
582.5 451800117 451728668 451129761 451347122 451922302 451787720 452655029 453070831 453010216 454910583 456135559
592.1 456135559 455179710 454597282 454706116 455261650 455486603 455412560 456324387 456948776 456753311 456705780
601.8 456705780 456436386 455223274 452982903 451762772 452246361 453602867 454571762 454855728 455488243
$$ packed form
536.2D58252754j578216l08953l6850Q49800J6671J390228P57141m01955J315079j136818
545.9D59118881k970733j439820m52652N68695R9678Q12226P46422p88994j074906
554.5D54618797k574005l32374Q49456r33303N63125j9836K48146J080246N77354J536064
564.2D55613670r11407k880364k8381J807365M58565m3335L77198o70319j990471j14441
573.8D51618080J178055j660957j195374O77643M63524N75065l48930m0092N33103
582.5D51800117p1449n98907K17361N75180j34582Q67309M15802o0615J900367J224976
592.1D56135559r55849n82428J08834N55534K24953p4043R11827O24389j95465m7531
601.8D56705780k69394j213112k240371j220131M83589J356506R68895K83966O32515
$$ plain form
610.5 455488243 455314255 454028130 452366180 451423950 451448898 451510849 452504158 454275436 455507851
619.2 455507851 455683136 455385857 455842857 456276054 455275002 454162712 454126472 455410919 458057747
627.8 458057747 459183121 459532623 461488457 463132095 463293953 462891350 463448906 464832497 465840378
636.5 465840378 466510468 468261452 470844688 472736511 473982773 474456596 474772491 475063629 475238380
645.2 475238380 475748138 476204720 477553787 478957100 480220222 481290970 480595970 479861069 479440994
653.9 479440994 479066086 479042435 479845505 481788788 483131981 483273430 482995224 483275566 483007088 482325745
663.5 482325745 481193275 479711571 481074524 483642502 486259880 486626282 485708237 484546394 483815308
672.2 483815308 484521713 485143623 486243515 487853470 488149529 488699303 489232330 489974899 491466255
$$ packed form
610.5D55488243j73988j286125j661950r42230K4948O1951R93309J771278J232415
619.2D55507851J75285k97279M57000M33197j001052j112290l6240J284447K646828
627.8D58057747J125374L49502J955834J643638J61858m02603N57556J383591J007881
636.5D65840378O70090J750984K583236J891823J246262M73823L15895K91138J74751
645.2D75238380N09758M56582J349067J403313J263122J070748o95000p34901m20075
653.9D79440994l74908k3651Q03070J943283J343193J41449k78206K80342k68478o81343
663.5D82325745j132470j481704J362953K567978K617378L66402r18045j161843p31086
672.2D83815308P06405O21910J099892J609955K96059N49774N33027P42569J491356
$$ plain form
680.9 491466255 492657013 493100433 493455887 493945160 495056953 496698265 496654510 497329369 498333244
689.6 498333244 497913284 498375969 498846016 498943634 498397598 498262634 499143677 500156097 501132584 501000710
699.2 501000710 501229439 501401978 501228409 501885605 501950836 502324600 503601379 504596062 505671806 506056061
708.8 506056061 505208359 505146828 505999298 506008987 505455933 506240692 508112488 509891396 511420135 511903687
718.5 511903687 512146606 512159004 512134857 512048340 511823654 513290291 513862724 514721413 516856041 517470970
728.1 517470970 517975388 518687057 519664574 519865227 519780350 520131531 520620880 521922836 522723732 523917274
737.8 523917274 525157013 525874100 525871849 525519409 525545349 525401421 526411324 527557335 529759598 531264076
747.4 531264076 530841980 531782875 531986008 531892929 532867966 534178085 534697227 534621582 535278130 535819244
$$ packed form
680.9D91466255J190758M43420L55454M89273J111793J641312m3755O74859J003875
689.6D98333244m19960M62685M70047R7618n46036j34964Q81043J012420R76487j31874
699.2E01000710K28729J72539j73569O57196O5231L73764J276779R94683J075744L84255
708.8E06056061q47702o1531Q52470R689n53054P84759J871796J778908J528739M83552
718.5E11903687K42919J2398k4147q6517k24686J466637N72433Q58689K134628O14929
728.1E17470970N04418P11669R77517K00653q4877L51181M89349J301956Q00896J193542
737.8E23917274J239739P17087k251l52440K5940j43928J009903J146011K202263J504478
747.4E31264076m22096R40895K03133r3079R75037J310119N19142p5645O56548N41114
$$ plain form
757.1 535819244 536380501 537524376 538717308 538516006 539441452 540510406 540688744 542441788 542442513 542298660
766.7 542298660 542924118 542960510 542532806 541891327 542667160 542955170 543117447 543231163 543955383 545091362
776.4 545091362 545157356 545394859 545099335 545061569 545263634 546045799 546285362 545982513 547203140 548197670
786 548197670 548860970 548009796 546890030 546839981 547223396 547941437 547686310 547365875 547127800 547687378
795.6 547687378 547807846 546771393 546361313 546649818 546503487 544393997 543062439 543200302 543255806
804.3 543255806 542896500 541730499 540736427 539732666 537736969 535246582 534148140 533322678 531331406
813 531331406 529227180 528866386 529443512 528680992 527830811 527024879 526604195 526580276 526465836 527218246
822.6 527218246 528459663 529690170 530274162 531661224 533562469 534759369 536214676 537704964 539015160
$$ packed form
757.1E35819244N61257J143875J192932k01302R25446J068954J78338J753044P25j43853
766.7E42298660O25458L6392m27704o41479P75833K88010J62277J13716P24220J135979
776.4E45091362O5994K37503k95524l7766K02065P82165K39563l02849J220627R94530
786E48197670O63300q51174j119766n0049L83415P18041k55127l20435k38075N59578
795.6E47687378J20468j036453m10080K88505j46331k109490j331558J37863N5504
804.3E43255806l59306j166001r94072j003761j995697k490387j098442q25462j991272
813E31331406k104226l60794N77126p62520q50181q05932m20684k3919j14440P52410
822.6E27218246J241417J230507N83992J387062J901245J196900J455307J490288J310196
$$ plain form
831.3 539015160 540078316 542081223 544430389 546587219 548210297 549119034 550183411 551060982 553020706
840 553020706 554439278 555497017 556707153 558049393 560187149 561343193 563465843 565184326 566280479
848.7 566280479 567818871 569243011 570676041 571217232 572665749 573616409 575003433 576839905 578001404
857.4 578001404 579449768 580733833 582743340 583342171 583836021 584305115 584938011 585693588 584878693
866 584878693 585142174 584705276 584221344 583469429 582072487 580526619 578240433 577838402 577743683 577563667
875.7 577563667 577087440 576465721 576515312 576754532 576792755 575855904 575862083 575773506 575306740 574846687 574532967
886.3 574532967 574538155 573917351 573450661 572659569 572859154 573009224 573230553 574558563 574757233 574671555
895.9 574671555 574852448 575117874 574585800 574658165 574970131 574373627 575188713 576283989 576601372 576673431
$$ packed form
831.3E39015160J063156K002907K349166K156830J623078R08737J064377Q77571J959724
840E53020706J418572J057739J210136J342240K137756J156044K122650J718483J096153
848.7E66280479J538392J424140J433030N41191J448517R50660J387024J836472J161499
857.4E78001404J448364J284065K009507N98831M93850M69094O32896P55577q14895
866E84878693K63481m36898m83932p51915j396942j545868k286186m02031r4719j80016
875.7E77563667m76227o21719M9591K39220L8223r36851O179q8577m66766m60053l13720
886.3E74532967N188o20804m66690p91092J99585J50070K21329J328010J98670q5678
895.9E74671555J80893K65426n32074P2365L11966n96504Q15086J095276L17383P2059
$$ plain form
905.6 576673431 577545929 578406525 579021263 579645653 580398445 581954308 581754723 581241379 580787849 579577827
915.2 579577827 578437195 577025566 575873222 574036636 572036285 569983521 568034439 565901489
922.9 565901489 563223763 560737572 558797951 557345428 554618683 552420845 550719681 548245773
930.7 548245773 546555634 545330658 544106407 543304214 543242798 542287598 541485214 541739235 541194420
939.3 541194420 540355530 540074196 540043907 538767052 537741394 537192841 535996857 535941010 536417809 535901375
949 535901375 534738083 534318085 533596840 532481537 531266518 529429321 528367920 526981735 525495071
957.7 525495071 524061470 521767197 519617882 517926025 516040535 514072113 512914391 511264496
965.4 511264496 509432449 508150711 506479492 505033646 503970909 502402573 500278053 498657227
$$ packed form
905.6E76673431Q72498Q60596O14738O24390P52792J555863j99585n13344m53530j210022
915.2E79577827j140632j411629j152344j836586k000351k052764j949082k132950
922.9E65901489k677726k486191j939621j452523k726745k197838j701164k473908
930.7E48245773j690139j224976j224251q02193o1416r55200q02384K54021n44815
939.3E41194420q38890k81334l0289j276855j025658n48553j195984n5847M76799n16434
949E35901375j163292m19998p21245j115303j215019j837197j061401j386185j486664
957.7E25495071j433601k294273k149315j691857j885490j968422j157722j649895
965.4E11264496j832047j281738j671219j445846j062737j568336k124520j620826
$$ plain form
973.1 498657227 496840248 494349403 492341805 491142311 488832588 484730797 481716423 479609756
980.8 479609756 476625824 472682915 468663597 465510254 463171043 460104752 455606308 451829491
988.5 451829491 448850746 445641785 441968117 438153877 434678879 431733093 429249916 426526337
996.2 426526337 423470573 420143242 417290382 414444122 411577568 409326286 407719574 406444855
1004 406444855 404417801 402540932 401414566 401161537 400203056 398072357 396479378 395042534 393846436
1012.6 393846436 392735710 391364021 389454689 387747192 385956497 383718109 381829910 379745903
1020.3 379745903 378312187 376872597 375404243 373484955 371395493 370588226 369556961 368048706
1028.1 368048706 365834427 364521065 363752518 362777328 362181435 361567078 361555595 361376839 362350807
$$ packed form
973.1D98657227j816979k490845k007598j199494k309723m101791l014374k106667
980.8D79609756k983932l942909m019318l153343k339211l066291m498444l776817
988.5D51829491k978745l208961l673668l814240l474998k945786k483177k723579
996.2D26526337l055764l327331k852860k846260k866554k251282j606712j274719
1004D06444855k027054j876869j126366k53029r58481k130699j592979j436844j196098
1012.6C93846436j110726j371689j909332j707497j790695k238388j888199k084007
1020.3C79745903j433716j439590j468354j919288k089462q07267j031265j508255
1028.1C68048706k214279j313362p68547r75190n95893o14357j1483j78756R73968
$$ plain form
1036.7 362350807 362847748 362247963 362240219 362980843 364595070 364917908 364522209 364417381 365183601 365012741
1046.4 365012741 364422760 364696922 363417282 362596817 362107048 361900597 361854668 361524620 361155815 360219231
1056 360219231 360223122 360363197 361180420 361648178 362308960 363778419 365247002 367140694 367814407 369551353
1065.7 369551353 372008781 373819580 374632225 375054016 375786285 375903587 376666946 377032127 378321838
1074.4 378321838 379328232 379212532 379388123 379287910 380751419 381900024 382651024 382856331 382989273
1083 382989273 384360657 385892830 387299194 388319893 391346169 393405342 393897057 394790459 395403442
1091.7 395403442 396839142 397952843 399972878 402166443 403532677 404434090 405261841 407226562 408903084
1100.4 408903084 410114937 410965729 412802811 413810005 413868065 415846825 417289467 418723488 419670830
$$ packed form
1036.7C62350807M96941n99785p744P40624J614227L22838l95699j04828P66220j70860
1046.4C65012741n89981K74162j279640q20465m89769k06451m5929l30048l68805r36584
1056C60219231L891J40075Q17223M67758O60782J469459J468583J893692O73713J736946
1065.7C69551353K457428J810799Q12645M21791P32269J17302P63359L65181J289711
1074.4C78321838J006394j15700J75591j00213J463509J148605P51000K05307J32942
1083C82989273J371384J532173J406364J020699L026276K059173M91715Q93402O12983
1091.7C95403442J435700J113701K020035K193565J366234R01413Q27751J964721J676522
1100.4D08903084J211853Q50792J837082J007194N8060J978760J442642J434021R47342
$$ plain form
1109.1 419670830 419363518 419370995 419602547 420486946 421151276 421979561 423286705 424638901 424885254 423806877
1118.7 423806877 423954582 424278870 423930283 424344940 424713364 424676895 425365028 426183891 426808128 427864151
1128.4 427864151 428675079 429254265 430352631 432017670 433463287 434868011 436692581 438526459 440412712
1137 440412712 442136497 443638496 444826698 445304947 446156807 447205086 447321243 447607651 448454514
1145.7 448454514 449416351 450119705 450453262 450986671 451206894 451174774 451079292 450602570 450556107 450546265
1155.4 450546265 450250664 450520897 450709267 450294266 449505615 448757477 448349953 448178902 448300781 448667068
1165 448667068 449633446 450894051 452188606 453684006 454910583 456416168 458047943 459009743 460112495
1173.7 460112495 461598969 463954315 466669769 468777542 470605125 471961136 473185196 474507523
$$ packed form
1109.1D19670830l07312P477K31552Q84399O64330Q28285J307144J352196K46353j078377
1118.7D23806877J47705L24288l48587M14657L68424l6469O88133Q18863O24237J056023
1128.4D27864151Q10928N79186J098366J665039J445617J404724J824570J833878J886253
1137D40412712J723785J501999J188202M78249Q51860J048279J16157K86408Q46863
1145.7D48454514R61837P03354L33557N33409K20223l2120r5482m76722m6463r842
1155.4D50546265k95601K70233J88370m15001p88651p48138m07524j71051J21879L66287
1165D48667068R66378J260605J294555J495400J226577J505585J631775R61800J102752
1173.7D60112495J486474K355346K715454K107773J827583J356011J224060J322327
$$ plain form
1181.4 474507523 475872650 476558151 477003174 477779465 478708916 480216980 481215439 481543083 481078606
1190.1 481078606 480069084 479678650 479404869 478732185 478246193 477967491 476931000 476008720 475742493
1198.8 475742493 474624367 472972870 471794052 470594635 469869080 469602547 468894348 468364830 467909775
1207.4 467909775 467144356 466468468 465942650 465174370 464163361 463457146 463242645 463414497 463161774
1216.1 463161774 462920074 463195381 462974205 462775803 462784042 462271347 461623039 461157303 460944328 461008873
1225.8 461008873 461001205 460831566 460471611 459568253 458561096 457939720 457506447 457254410 457103500 456956253
1235.4 456956253 456691360 456216660 455972404 455771790 455371857 455025024 454500771 454163246 453911018 453599052
1245 453599052 453820763 454106064 453782272 453040009 452642899 452240639 451906891 451941795 451691093 451722527
$$ packed form
1181.4D74507523J365127O85501M45023P76291R29451J508064R98459L27644m64477
1190.1D81078606j009522l90434k73781o72684m85992k78702j036491r22280k66227
1198.8D75742493j118126j651497j178818j199417p25555k66533p08199n29518m55055
1207.4D67909775p65419o75888n25818p68280j011009p06215k14501J71852k52723
1216.1D63161774k41700K75307k21176j98402Q239n12695o48308m65736k12975O4545
1225.8D61008873p668j69639l59955r03358j007157o21376m33273k52037j50910j47247
1235.4D56956253k64893m74700k44256k00614l99933l46833n24253l37525k52228l11966
1245D53599052K21711K85301l23792p42263l97110m02260l33748L4904k50702L1434
$$ plain form
1254.7 451722527 452040901 452265091 452112656 451806984 451718178 451634026 451902390 452233887 452683830 453110123
1264.3 453110123 453801765 454701462 455233078 456195221 457082062 457668037 458210297 458641052 459356079 460291481
1274 460291481 461512680 462548180 463413925 464617195 465943298 467162743 467868271 468455162 469553490
1282.7 469553490 470860519 472328682 473559227 474758797 476634903 478495331 479490395 479852409 480595093
1291.3 480595093 481442757 482214241 483260574 484412270 485693130 486812248 487265930 486995201 487081528
1300 487081528 487543068 488085785 488261299 488153458 488628159 488950539 489540405 489848328 489383850 489195557
1309.7 489195557 489289398 489128227 488366318 488591156 489120483 488901863 488932877 489283638 489657326 489903412
1319.3 489903412 490490532 490923996 491049194 491473503 492272949 492961006 493560219 494364357 494728088 494755402
$$ packed form
1254.7D51722527L18374K24190j52435l05672q8806q4152K68364L31497M49943M26293
1264.3D53110123O91642Q99697N31616R62143Q86841N85975N42260M30755P15027R35402
1274D60291481J221199J035500Q65745J203270J326103J219445P05528N86891J098328
1282.7D69553490J307029J468163J230545J199570J876106J860428R95064L62014P42684
1291.3D80595093Q47664P71484J046333J151696J280860J119118M53682k70729Q6327
1300D87081528M61540N42717J75514j07841M74701L22380N89866L07923m64478j88293
1309.7D89195557R3841j61171p61909K24838N29327k18620L1014L50761L73688K46086
1319.3D89903412N87120M33464J25198M24309P99446O88057N99213Q04138L63731K7314
$$ plain form
1328.9 494755402 494382553 493957024 493259964 492787094 492969322 492753983 492890129 492920341 492555809 492153053
1338.6 492153053 492135925 492276001 491903114 492195663 492372284 493038597 493851204 494204674 494688797 494606209
1348.2 494606209 494716492 494555054 494522820 494548149 494250908 494194984 493984680 493763885 493474655 493593941
1357.9 493593941 493152199 492921715 492611275 491532822 491277084 490065079 490408058 490864029 490086327
1366.6 490086327 489608040 488964005 488255081 487526855 486919022 486489716 486745071 486794777 486480713 486642456
1376.2 486642456 486229591 486146774 485833168 485366211 484641838 483611259 482573242 481686592 481296005
1384.9 481296005 480676651 480703926 479127846 477755852 477860451 477079468 475979347 475060997 475163002
1393.6 475163002 474346352 471972008 470479012 468920479 468113670 465866051 464237556 463516464 462030449
$$ packed form
1328.9D94755402l72849m25529o97060m72870J82228k15339J36146L0212l64532m02756
1338.6D92153053j7128J40076l72887K92549J76621O66313Q12607L53470M84123q2588
1348.2D94606209J10283j61438l2234K5329k97241n5924k10304k20795k89230J19286
1357.9D93593941m41742k30484l10440j078453k55738j212005L42979M55971p77702
1366.6D90086327m78287o44035p08924p28226o07833m29306K55355M9706l14064J61743
1376.2D86642456m12865q2817l13606m66957p24373j030579j038017q86650l90587
1384.9D81296005o19354K7275j576080j371994J04599p80983j100121r18350J02005
1393.6D75163002q16650k374344j492996j558533q06809k247619j628495p21092j486015
$$ plain form
1402.2 462030449 460768204 459867783 458271561 456700058 455965004 454809227 453901176 453201294 451941528
1410.9 451941528 450675354 449733238 449446373 449218140 449055519 448648987 448481255 449128685 447669907
1419.6 447669907 447948265 448814964 449342880 450149612 449824867 450560799 451513634 451974678 452718887 453050346
1429.2 453050346 453232727 453418121 454625816 455851250 456552238 458131523 459826279 459255981 458908730
1437.9 458908730 460337486 461008377 461592598 462549057 462967453 463752594 464246521 464756546 465228691
1446.6 465228691 465213966 464825592 465139503 465836716 466117821 466806450 467402916 468790703 471081543
1455.3 471081543 472790070 472084351 470690575 471763420 472263603 473996048 475228539 475864601 477328491
1464 477328491 477644501 478772736 480357742 482047768 483632050 485752525 488740311 491383324 493338280
$$ packed form
1402.2D62030449j262245r00421j596222j571503p35054j155777r08051o99882j259766
1410.9D51941528j266174r42116k86865k28233j62621m06532j67732O47430j458778
1419.6D47669907K78358Q66699N27916Q06732l24745P35932R52835M61044P44209L31459
1429.2D53050346J82381J85394J207695J225434P00988J579285J694756n70298l47251
1437.9D58908730J428756O70891N84221R56459M18396P85141M93927N10025M72145
1446.6D65228691j4725l88374L13911O97213K81105O88629N96466J387787K290840
1455.3D71081543J708527p05719j393776J072845N00183J732445J232491O36062J463890
1464D77328491L16010J128235J585006J690026J584282K120475K987786K643013J954956
$$ plain form
1472.6 493338280 494573402 496879883 499769020 501800995 502847939 504935684 506848106 508379707
1480.3 508379707 509893112 511222649 512809563 514231796 515367088 516502419 517202034 517410049 519150734
1489 519150734 519018021 516421509 516617737 516900101 516496162 515958176 515990067 510944176 509771500 508758049
1498.7 508758049 505048752 504315224 502976875 501442299 500164108 500250664 499785194 493010979 490367050
1507.3 490367050 492845268 494757080 493549690 493741989 493284912 491975288 492264404 491961555 491611404
1516 491611404 489903831 487317238 487963943 489463654 488803444 486234436 486850662 488229942 490768623
1524.7 490768623 490830612 490136528 490217018 490169144 490786362 491457443 492549934 493662643 494977493 494051552
1534.3 494051552 494998932 495749435 496557541 499664955 500153618 496503601 497904549 499595184 499685936
$$ packed form
1472.6D93338280J235122K306481K889137K031975J046944K087745J912422J531601
1480.3E08379707J513405J329537J586914J422233J135292J135331O99615K08015J740685
1489E19150734j32713k596512J96228K82364m03939n37986L1891n045891j172676j013451
1498.7E08758049l709297p33528j338349j534576j278191Q6556m65470o774215k643929
1507.3D90367050K478218J911812j207390J92299m57077j309624K89116l02849l50151
1516D91611404j707573k586593O46705J499711o60210k569008O16226J379280K538681
1524.7D90768623O1989o94084Q0490m7874O17218O71081J092491J112709J314850r25941
1534.3D94051552R47380P50503Q08106L107414M88663l650017J400948J690635R0752
$$ plain form
1543 499685936 500456009 501920891 500196533 501156921 501849709 502606392 503454628 502996407 504256439
1551.7 504256439 505211601 506612244 505930672 506247597 508836555 511895370 511761742 500804443 502580566
1560.4 502580566 504229927 505685310 506135979 505844154 503939476 502518387 502125969 501251869 501531448
1569.1 501531448 495223656 493595047 493117104 491276016 489685555 488058472 487297020 477547646 476651573
1577.7 476651573 474774666 471992874 469627457 466165276 464230118 460660248 458193626 454459305
1585.5 454459305 451150208 448003807 444213562 441754761 437389679 435080261 430866928 428039474
1593.2 428039474 425086327 421013260 418624496 414549217 412375221 408326187 406106758 403263588
1600.9 403263588 400650978 399149704 395370598 393697701 390396500 388897438 385953865 384183922
$$ packed form
1543D99685936P70073J464882j724358R60388O92788P56683Q48236m58221J260032
1551.7E04256439R55162J400643o81572L16925K588958L058815j33628j0957299J776123
1560.4E02580566J649361J455383M50669k91825j904678j421089l92418q74100K79579
1569.1E01531448o307792j628609m77943j841088j590461j627083p61452r749374q96073
1577.7D76651573j876907k781792k365417l462181j935158l569870k466622l734321
1585.5D54459305l309097l146401l790245k458801m365082k309418m213333k827454
1593.2D28039474k953147m073067k388764m075279k173996m049034k219429k843170
1600.9D03263588k612610j501274l779106j672897l301201j499062k943573j769943
$$ plain form
1608.6 384183922 382532120 379741745 379692268 377383270 377076988 374887009 374739799 374328003 367975311
1617.3 367975311 369533157 368423920 369119835 367674370 368567200 368645439 365897179 366842995 366282959
1626 366282959 368306236 367093239 367348289 367548485 367807541 369243202 369660225 371732521 372117386
1634.6 372117386 372867928 371361122 373601379 374304733 374838104 376679802 376749992 378998528 379513435
1643.3 379513435 381698303 383609581 383469086 386292305 384506950 386419716 386930771 389503975 392688866
1652 392688866 398192368 392403030 390506363 393957138 394740601 396632996 397526665 398997993 400847511
1660.7 400847511 402525139 405148849 404575577 407465172 409290085 411693192 414546509 417398720
1668.4 417398720 419747658 419968643 424555588 426662598 429894829 433424072 436609039 438052559
$$ packed form
1608.6C84183922j651802k790375m9477k308998l06282k189979j47210m11796o352692
1617.3C67975311J557846j109237O95915j445465Q92830P8239k748260R45816n60036
1626C66282959K023277j212997K55050K00196K59056J435661M17023K072296L84865
1634.6C72117386P50542j506806K240257P03354N33371J841698P0190K248536N14907
1643.3C79513435K184868J911278j40495K823219j785355J912766N11055K573204L184891
1652C92688866N503502n789338j896667L450775P83463J892395Q93669J471328J849518
1660.7D00847511J677628K623710n73272K889595J824913K403107K853317K852211
1668.4D17398720K348938K20985M586945K107010L232231L529243L184967J443520
$$ plain form
1676.1 438052559 440043488 444039993 447134476 451301842 453133507 456902237 462705727 466626701
1683.8 466626701 469705658 469668274 474619751 478474770 481576424 485271759 488919373 493300858 497177124
1692.5 497177124 501460419 505819016 510892982 512527885 516819191 522223854 527415352 531174088
1700.2 531174088 529643784 536137276 540843315 544627647 547371178 550020943 552452850 554673882
1707.9 554673882 558178024 560601273 562367058 565117950 568266411 571614914 573448296 574287529
1715.6 574287529 577611504 580010185 575776443 578067818 580963020 583357658 585711174 587191582
1723.4 587191582 587959671 589195671 590430832 590835876 591896095 594343643 595211220 595465546 598939209
1732 598939209 603246803 602551994 598034859 601879387 605633354 607363968 609900208 611006279 610123711
$$ packed form
1676.1D38052559J990929L996505L094483M167366J831665L768730N803490L920974
1683.8D66626701L078957l7384M951477L855019L101654L695335L647614M381485L876266
1692.5D97177124M283295M358597N073966J634903M291306N404663N191498L758736
1700.2E31174088j530304O493492M706039L784332K743531K649765K431907K221032
1707.9E54673882L504142K423249J765785K750892L148461L348503J833382Q39233
1715.6E74287529L323975K398681m233742K291375K895202K394638K353516J480408
1723.4E87191582P68089J236000J235161M05044J060219K447548Q67577K54326L473663
1732E98939209M307594o94809m517135L844528L753967J730614K536240J106071q82568
$$ plain form
1740.7 610123711 613899269 617373009 618886909 620121536 623212967 626018066 627808342 630523529
1748.4 630523529 632207146 636355553 638745308 639451904 643476868 646173706 648756027 651798401
1756.2 651798401 652355957 653601761 656169968 658465958 661609116 661665726 662017746 665621490 667540436
1764.8 667540436 669119034 671339111 673304214 671176071 672604980 677236938 678469620 677322311
1772.5 677322311 676074371 679509735 681565323 680464706 682212906 683191681 684635086 685317001 684561386
1781.2 684561386 685586014 687800293 690166550 689953079 689703140 690541992 691228561 692144318 694253998
1789.9 694253998 695607376 696357727 696002579 695020142 697796860 698550720 697596207 698654709 700537109
1798.6 700537109 701220932 700201950 702209091 702720413 703217850 704706192 705015030 705531998 705802765
$$ packed form
1740.7F10123711L775558L473740J513900J234627L091431K805099J790276K715187
1748.4F30523529J683617M148407K389755P06596M024964K696838K582321L042374
1756.2F51798401N57556J245804K568207K295990L143158N6610L52020L603744J918946
1764.8F67540436J578598K220077J965103k128143J428909M631958J232682j147309
1772.5F77322311j247940L435364K055588j100617J748200R78775J443405O81915p55615
1781.2F84561386J024628K214279K366257k13471k49939Q38852O86569R15757K109680
1789.9F94253998J353378P50351l55148r82437K776718P53860r54513J058502J882400
1798.6G00537109O83823j018982K007141N11322M97437J488342L08838N16968K70767
$$ plain form
1807.3 705802765 705771637 706317368 708118973 708070679 708585434 709806900 710004959 711046219 711071320 711257935
1816.9 711257935 710928268 711441269 712656326 713015823 714113464 714137268 715474701 716997299 715033264
1825.6 715033264 714610596 716140823 718149643 718717499 715558319 715675735 718199005 718855133 719084167
1834.3 719084167 719637527 719861221 719888840 719330597 720405350 720767441 720960922 721712418 723596497
1842.9 723596497 724916000 720527649 721718674 723318863 723453369 723069000 723344879 724229584 724276276
1851.6 724276276 725114746 725238266 725693970 725897522 725699081 726065216 726019669 726482925 726460419 727163696
1861.3 727163696 727359314 727689667 728452530 728575516 729280167 729309311 730426178 729570007 727633438
1869.9 727633438 728232422 729171371 729852371 729726944 730271301 729921799 730021057 730304565 730232162 730613480
$$ packed form
1807.3G05802765l1128N45731J801605m8294N14755J221466J98059J041260K5101J86615
1816.9G11257935l29667N13001J215057L59497J097641K3804J337433J522598j964035
1825.6G15033264m22668J530227K008820N67856l159180J17416K523270O56128K29034
1834.3G19084167N53360K23694K7619n58243J074753L62091J93481P51496J884079
1842.9G23596497J319503m388351J191025J600189J34506l84369K75879Q84705M6692
1851.6G24276276Q38470J23520M55704K03552j98441L66135m5547M63256k2506P03277
1861.3G27163696J95618L30353P62863J22986P04651K9144J116867q56171j936569
1869.9G27633438N98984R38949O81000j25427N44357l49502R9258K83508p2403L81318
$$ plain form
1879.6 730613480 730186234 730636749 730715256 731351242 731691971 731173782 731384506 731139221 732071686 732331543
1889.2 732331543 730982742 731084366 732084885 732451782 732648392 732918777 732037277 732192917 732108459
1897.9 732108459 732191544 732615280 732924576 733619156 733668213 733923645 733547592 733437653 733520584 733379059
1907.6 733379059 733458328 733381119 733364868 733248596 734296494 734204254 733967056 734121323 734020767 735255203
1917.2 735255203 734272156 733625107 734012451 734250336 735056686 734586258 734134750 734349670 734626465 734131393
1926.8 734131393 734019623 734363937 734427567 734546280 734611969 734802704 734332275 734524689 734410553 733916016
1936.5 733916016 733581467 733408813 734352188 734107971 734360962 734756775 733429642 733525543 733905945 733482361
1946.1 733482361 733019257 733478394 733647079 733480225 733165512 733064117 733456116 733486633 733493652 733142242
$$ packed form
1879.6G30613480m27246M50515P8507O35986L40729n18189K10724k45285R32465K59857
1889.2G32331543j348801J01624J000519L66897J96610K70385q81500J55640q4458
1897.9G32108459Q3085M23736L09296O94580M9057K55432l76053j09939Q2931j41525
1907.6G33379059P9269p7209j6251j16272J047898r2240k37198J54267j00556J234436
1917.2G35255203r83047o47049L87344K37885Q06350m70428m51508K14920K76795m95072
1926.8G34131393j11770L44314O3630J18713O5689J90735m70429J92414j14136m94537
1936.5G33916016l34549j72654R43375k44217K52991L95813j327133R5901L80402m23584
1946.1G33482361m63104M59137J68685j66854l14713j01395L91999L0517P019l51410
$$ plain form
1955.8 733142242 733245163 733240509 733125381 733304901 733178558 732990265 732505569 732607346 732460556 732812119
1965.4 732812119 733650665 733192978 732565079 732513657 733011475 732983398 733043442 732721939 732181244 732413025
1975.1 732413025 732495728 732705002 732490234 732773972 733007202 733028412 733348770 732978058 732701035 732429047
1984.7 732429047 732447891 732378845 732623749 732636642 732185974 732845535 732955551 732027969 731502457 732042847
1994.3 732042847 732104645 731597137 731410751 731304779 731972733 732115555 732155914 731812363 731300049 731329498
2004 731329498 731077194 731048279 730617371 730786438 731028137 730813370 730645218 730374985 730649567 730405884
2013.6 730405884 730069733 729904633 729741745 729450531 729453201 729938736 730118561 730339890 729935379 729459686
2023.3 729459686 728955917 728670349 728602524 728444901 728556595 728243484 728654404 728790359 728820267 728740692
$$ packed form
1955.8G33142242J02921m654j15128J79520j26343j88293m84696J01777j46790L51563
1965.4G32812119Q38546m57687o27899n1422M97818k8077O0044l21503n40695K31781
1975.1G32413025Q2703K09274k14768K83738K33230K1210L20358l70712k77023k71988
1984.7G32429047J8844o9046K44904J2893m50668O59561J10016r27582n25512N40390
1994.3G32042847O1798n07508j86386j05972O67954J42822M0359l43551n12314K9449
2004G31329498k52304k8915m30908J69067K41699k14767j68152k70233K74582k43683
2013.6G30405884l36151j65100j62888k91214K670M85535J79825K21329m04511m75693
2023.3G29459686n03769k85568o7825j57623J11694l13111M10920J35955K9908p9575
$$ plain form
2032.9 728740692 727925720 728037643 727894135 727584839 727373657 727409515 727377167 727281113 727412415 727178040
2042.6 727178040 727575836 727633514 727637558 727156906 726805115 727272034 726826096 726558914 726237640 726427078
2052.2 726427078 726548233 726529160 726864700 726343307 726279831 726257401 726189499 726131592 726225128 725957794 725278091
2062.8 725278091 725494156 725456467 725574188 725594711 725592346 725414352 725176086 725628052 725374603 725171661
2072.5 725171661 724903564 724540100 724291458 724348984 724849014 725065994 725287018 724888153 724711380 724514389
2082.1 724514389 724000778 723543777 723246918 723544617 723546524 723932495 724358902 724681702 724374237 723457336
2091.7 723457336 723197632 722959442 722902374 722722931 722965469 723110657 723014679 723176498 722999268 722842026
2101.4 722842026 722183609 722122879 722142715 721788406 721526337 721530228 722199402 722251053 722332153 721908951 721564331
$$ packed form
2032.9G28740692q14972J11923j43508l09296k11182L5858l2348r6054J31302k34375
2042.6G27178040L97796N7678M044m80652l51791M66919m45938k67182l21274J89438
2052.2G26427078J21155j9073L35540n21393o3476k2430o7902n7907R3536k67334o79703
2062.8G25278091K16065l7689J17721K0523k365j77994k38266M51966k53449k02942
2072.5G25171661k68097l63464k48642N7526N00030K16980K21024l98865j76773j96991
2082.1G24514389n13611m57001k96859K97699J907L85971M26407L22800l07465r16901
2091.7G23457336k59704k38190n7068j79443K42538J45188r5978J61819j77230j57242
2101.4G22842026o58417o0730J9836l54309k62069L891O69174N1651Q1100m23202l44620
$$ plain form
2112 721564331 721523895 721088257 720889587 720322952 720588226 720842590 721197968 721936417 722144852 722167969
2121.6 722167969 721554413 721127853 720621796 720534821 720527039 720367279 720590515 720654755 721126633 721151123
2131.3 721151123 721203308 720981445 720616379 720844193 720654907 720390396 720237045 720518112 720562973 720897217
2140.9 720897217 721315613 721118774 720968628 720549011 720500946 720428314 720549316 720535736 720420609 720537033
2150.6 720537033 720410156 720638199 720558243 720857010 720591965 719995499 720519180 720966339 720909500 720423660
2160.2 720423660 720641022 720629120 720590057 720988464 720809555 720439835 720336609 720777206 720458832 720530548
2169.9 720530548 720718765 720506744 720826721 720744095 720798950 720484085 720509033 720780563 721131821 721429520
2179.5 721429520 720988541 721134644 720972061 721037521 720959625 720881653 721110382 720782166 721062775 720999985
$$ packed form
2112G21564331m0436m35638j98670n66635K65274K54364L55378P38449K08435K3117
2121.6G22167969o13556m26560n06057q6975p782j59760K23236O4240M71878K4490
2131.3G21151123N2185k21863l65066K27814j89286k64511j53351K81067M4861L34244
2140.9G20897217M18396j96839j50146m19617m8065p2632J21002j3580j15127J16424
2150.6G20537033j26877K28043p9956K98767k65045n96466N23681M47159n6839m85840
2160.2G20423660K17362j1902l9063L98407j78909l69720j03226M40597l18374P1716
2169.9G20530548J88217k12021L19977q2626N4855l14865K4948K71530L51258K97699
2179.5G21429520m40979J46103j62583O5460p7896p7972K28729l28216K80609o2790
$$ plain form
2189.1 720999985 721003571 720961227 721025543 721014481 720401688 720726624 720993195 721281509 721460495 721545410 721463470
2199.8 721463470 721211853 721352081 721124573 721268463 721062469 720936813 721186066 721311951 721541519 721383514
2209.4 721383514 721594849 721561966 721268616 721070023 721222153 721339951 721087952 721235352 721313400 721431808
2219 721431808 721390152 721921768 722066803 721512299 721530457 721325073 721513290 721605759 721694794 721604309 721368790
2229.7 721368790 721533890 721514282 721553650 720930481 720766907 720891418 721138077 721523972 721132812 721070251
2239.3 721070251 720925903 720876999 720681915 720912247 721360168 721129303 721146088 720897827 720883865 720980835
2248.9 720980835 721373901 721241684 720704651 720839310 720590897 720750198 720696411 720918884 721101303 720683594
2258.6 720683594 720753784 720518799 720494308 720565796 720872421 720889664 720790939 720941238 720713959 720775452 720449829
$$ packed form
2189.1G20999985L586m2344O4316j1062o12793L24936K66571K88314J78986Q4915q1940
2199.8G21463470k51617J40228k27508J43890k05994j25656K49253J25885K29568j58005
2209.4G21383514K11335l2883k93350j98593J52130J17798k51999J47400P8048J18408
2219G21431808m1656N31616J45035n54504J8158k05384J88217R2469Q9035r0485k35519
2229.7G21368790J65100j9608L9368o23169j63574J24511K46659L85895l91160o2561
2239.3G21070251j44348m8904j95084K30332M47921k30865J6785k48261j3962R6970
2248.9G20980835L93066j32217n37033J34659k48413J59301n3787K22473J82419m17709
2258.6G20683594P0190k34985k4491P1488L06625J7243r8725J50299k27279O1493l25623
$$ plain form
2269.2 720449829 720496292 720620651 720499725 720403061 720060577 720149231 720278931 720576248 720455780 720383148
2278.8 720383148 720194550 719640808 719136124 718548737 718843155 719102859 719844513 720450592 720226288 719881744
2288.5 719881744 719339676 719481583 719132462 719027634 719018097 718839798 719080505 719135666 719869766 720230103
2298.1 720230103 720524216 720296860 719480286 719366760 719202805 719166794 719080429 719539642 719773407 719645462
2307.8 719645462 719519424 719402542 720012741 720163193 720110931 719012299 718038025 718707581 719617538 720303574
2317.4 720303574 720371704 720857468 720902634 720455170 720635452 720477219 720377197 721051254 721205521 720922928
2327.1 720922928 722304153 723138199 722164917 721345215 721686172 721502228 720414963 719642563 719394226
2335.7 719394226 721018219 720777512 720495605 721684341 720619736 720552750 721773148 722061157 720479202
$$ packed form
2269.2G20449829M6463J24359j20926r6664l42484Q8654J29700K97317j20468p2632
2278.8G20383148j88598n53742n04684n87387K94418K59704P41654O06079k24304l44544
2288.5G19881744n42068J41907l49121j04828r537j78299K40707N5161P34100L60337
2298.1G20230103K94113k27356q16574j13526j63955l6011q6365M59213K33765j27945
2307.8G19645462j26038j16882O10199J50452n2262j098632r74274O69556R09957O86036
2317.4G20303574O8130M85764M5166m47464J80282j58233j00022O74057J54267k82593
2327.1G20922928J381225Q34046r73282q19702L40957j83944j087265p72400k48337
2335.7G19394226J623993k40707k81907J188736j064605o6986J220398K88009j581955
$$ plain form
2344.4 720479202 719795609 719812851 717701950 715968170 716673126 718842392 719600067 719744263 719293213
2353.1 719293213 719241714 720374298 720143967 721598587 722115936 723027191 723001175 721705704 722228317
2361.8 722228317 721199188 719771957 718701477 719591370 718899918 718363571 718452988 716377640 715825424
2370.4 715825424 715248413 714430313 713328552 712869034 713039780 712648926 712320251 711250687 710522842
2379.1 710522842 709716721 708772507 708368607 708124542 707997971 707653122 707382507 707222824 707205734 706830215
2388.8 706830215 706464233 706454391 706315613 705997238 705544510 705587387 705434036 705500031 705414352 704587708
2398.4 704587708 704210205 703902588 703693848 703448792 703426895 703347702 703256760 703447266 703144302 702934952
2408.1 702934952 702565994 702319183 702084656 701563187 701181793 701101456 701309509 700938034 700626450 700516434
$$ packed form
2344.4G20479202o83593J7242k110901j733780P04956K169266P57675J44196m51050
2353.1G19293213n1499J132584k30331J454620N17349R11255k6016j295471N22613
2361.8G22228317j029129j427231j070480Q89893o91452n36347Q9417k075348n52216
2370.4G15825424n77011q18100j101761m59518J70746l90854l28675j069564p27845
2379.1G10522842q06121r44214m03900k44065j26571l44849k70615j59683j7090l75519
2388.8G06830215l65982r842j38778l18375m52728M2877j53351O5995q5679q26644
2398.4G04587708l77503l07617k08740k45056k1897p9193r0942J90506l02964k09350
2408.1G02934952l68958k46811k34527n21469l81394q0337K08053l71475l11584j10016
$$ plain form
2417.7 700516434 700379486 700002747 699934998 699971542 699132919 699024887 698803406 698422546 698509827 698284454
2427.3 698284454 697892303 697307968 696841507 696108398 696042633 696388855 696436234 696317902 696067047 695906525
2437 695906525 694914703 694586182 694802475 694753723 694599991 694212036 694052658 693647766 693791885 693554001
2446.6 693554001 692850113 692214279 691690063 691681519 691335068 691678543 691788025 691591797 691345444 690672989
2456.3 690672989 690483170 689822388 689033966 688270721 688098145 688193970 687888184 687752380 687813950 688188095
2465.9 688188095 687635040 687015839 686600800 686277695 685997696 685235367 685042572 684740601 684866180 684826202
2475.6 684826202 684431458 684093628 683108215 682626114 682140732 681863098 681522446 681131439 681339188 681427155
2485.2 681427155 681199417 680492249 680322342 679904480 679175415 678907394 678542709 678331985 677922821 677394409
$$ packed form
2417.7G00516434j36948l76739o7749L6544q38623j08032k21481l80860Q7281k25373
2427.3F98284454l92151n84335m66461p33109o5765L46222M7379j18332k50855j60522
2437F95906525r91822l28521K16293m8752j53732l87955j59378m04892J44119k37884
2446.6F93554001p03888o35834n24216q544l46451L43475J09482j96228k46353o72455
2456.3F90672989j89819o60782p88422p63245j72576R5825l05786j35804O1570L74145
2465.9F88188095n53055o19201m15039l23105k79999p62329j92795l01971J25579l9978
2475.6F84826202l94744l37830r85413m82101m85382k77634l40652l91007K07749Q7967
2485.2F81427155k27738p07168j69907m17862p29065k68021l64685k10724m09164n28412
$$ plain form
2494.8 677394409 677163010 677362289 677049103 676409683 675762634 675021286 674866028 674355316 674090424 674024506
2504.5 674024506 673693237 673479385 673126068 672842026 672410202 672010193 671178970 670601501 670526199 670322723
2514.1 670322723 670159302 669686356 669533310 669272232 669073029 668980713 668473892 667880402 667161713 667078247
2523.8 667078247 667077408 666762924 666508484 666366272 666060638 665448532 664868851 664372711 664320908 664018402
2533.4 664018402 664008942 664148636 663525467 663189163 662868881 662251282 661712341 661882935 662111206 661889267
2543.1 661889267 661520844 660609131 660107269 660071945 659754944 659190292 658937836 658759613 658442917 658330154
2552.7 658330154 658111191 657979813 657392120 656971130 657013626 656574173 655830765 655172272 655010910 654868622
2562.4 654868622 654965820 654779434 654159317 653933792 653738785 653476486 652872162 652420425 652024536 651729660
$$ packed form
2494.8F77394409k31399J99279l13186o39420o47049p41348j55258n10712k64892o5918
2504.5F74024506l31269k13852l53317k84042m31824m00009q31223n77469p5302k03476
2514.1F70322723j63421m72946j53046k61078j99203r2316n06821n93490p18689q3466
2523.8F67078247q39l14484k54440j42212l05634o12106n79681m96140n1803l02506
2533.4F64018402r460J39694o23169l36304l20282o17599n38941J70594K28271k21939
2543.1F61889267l68423r11713n01862l5324l17001n64652k52456j78223l16696j12763
2552.7F58330154k18963j31378n87693m20990M2496m39453p43408o58493j61362j42288
2562.4F54868622R7198j86386o20117k25525j95007k62299o04324m51737l95889k94876
$$ plain form
2572 651729660 651495285 651388168 651627960 651088638 650684662 650163498 649453659 649144974 648892136 648926468
2581.6 648926468 648572311 648542786 648705750 648598251 648249893 647708359 646970520 645809174 645718384 645486298
2591.3 645486298 644756012 644809036 644930344 644817581 644377060 643905487 643359680 643143005 643033524 642754669
2600.9 642754669 642606735 642203903 641791840 641617203 641584625 640852966 639983559 639549217 639200401 638950424
2610.6 638950424 638622894 638575439 638290443 638034515 637716179 637356377 637144775 636412468 635779800 634962997
2620.2 634962997 634656410 634748001 634612617 634466057 633884277 633693542 633369789 632877579 632314644 631366501
2629.9 631366501 630898743 630953178 630761566 630115814 630021019 629810829 629280663 628889618 628460732 627902107
2639.5 627902107 627183990 627266464 627110443 626735687 626655464 626061821 625419350 625000191 624888878 624451485
$$ packed form
2572F51729660k34375j07117K39792n39322m03976n21164p09839l08685k52838L4332
2581.6F48926468l54157k9525J62964j07499l48358n41534p37839j161346r0790k32086
2591.3F45486298p30286N3024J21308j12763m40521m71573n45807k16675j09481k78855
2600.9F42754669j47934m02832m12063j74637l2578p31659q69407m34342l48816k49977
2610.6F38950424l27530m7455k84996k55928l18336l59802k11602p32307o32668q16803
2620.2F34962997l06587R1591j35384j46560n81780j90735l23753m92210n62935r48143
2629.9F31366501m67758N4435j91612o45752r4795k10190n30166l91045m28886n58625
2639.5F27902107p18117Q2474j56021l74756q0223n93643o42471m19159j11313m37393
$$ plain form
2649.1 624451485 623932648 623696022 623614845 623558502 623459167 623424797 622700996 622127380 621643486 621081200
2658.8 621081200 620869980 620568848 620556183 620457916 620322762 620178642 620103302 619802399 619079895 618450203
2668.4 618450203 617851753 617811623 617473488 617271614 617570763 617496681 617740517 617587051 616993713 616527939
2678.1 616527939 616088562 615819702 615477982 614789619 614297829 614471588 614646759 614573631 614124985 613587379
2687.7 613587379 612953262 612368851 612048035 611702271 611848335 611924858 612164268 612277641 611632996 611280251
2697.4 611280251 610880318 610050278 609272308 609219818 609360657 609358749 609457283 609392128 609197426 608799324
2707 608799324 608609009 608007164 607308273 606878090 606367912 606355209 606428719 606797523 606765518 606271553
2716.6 606271553 606047401 605732117 605423241 604984550 604907188 604591522 604218903 604551201 604498062 603696556
$$ packed form
2649.1F24451485n18837k36626q1177n6343r9335l4370p23801n73616m83894n62286
2658.8F21081200k11220l01132j2665r8267j35154j44120p5340l00903p22504o29692
2668.4F18450203n98450m0130l38135k01874K99149p4082K43836j53466n93338m65774
2678.1F16527939m39377k68860l41720o88363m91790J73759J75171p3128m48646n37606
2687.7F13587379o34117n84411l20816l45764J46064P6523K39410J13373o44645l52745
2697.4F11280251l99933q30040p77970n2490J40839j908R8534o5155j94702l98102
2707F08799324j90315o01845o98891m30183n10178j2703P3510L68804l2005m93965
2716.6F06271553k24152l15284l08876m38691p7362l15666l72619L32298n3139q01506
$$ plain form
2726.3 603696556 602875900 602813454 602662926 602277107 602092819 601860161 601790161 601694603 601602287 601454010
2735.9 601454010 601217575 601070938 601119156 600999794 600578423 600368233 600411148 600213203 599617119 599751625
2745.6 599751625 600234528 600033455 599304390 598646431 598599663 598506889 598239441 597900314 597822685 597732735
2755.2 597732735 597478447 597470245 597280960 597227097 596643486 596086273 596087532 595936775 596062279 595846367
2764.9 595846367 595145035 594460716 594453430 594380074 594041557 594131088 593867149 593807983 593652306 593483162
2774.5 593483162 593289299 592756577 592574425 591888618 591081924 590651016 590757790 590998993 590501862 589872093
2784.2 589872093 589311562 588933029 588770180 588576508 587988586 587486000 587338638 586927452 586232719 585750008
2793.8 585750008 585776939 585529861 585263672 584677696 583843155 583748283 583144760 582103157 581596603 581414719
$$ packed form
2726.3F03696556q20656o2446j50528l85819j84288k32658p0000r5558r2316j48277
2735.9F01454010k36435j46637M8218j19362m21371k10190M2915j97945n96084J34506
2745.6E99751625M82903k01073p29065o57959m6768r2774k67448l39127p7629q9950
2755.2E97732735k54288q202j89285n3863n83611n57213J259j50757J25504k15912
2764.9E95846367p01332o84319p286p3356l38517Q9531k63939n9166j55677j69144
2774.5E93483162j93863n32722j82152o85807q06694m30908J06774K41203m97131o29769
2784.2E89872093n60531l78533j62849j93672n87922n02586j47362m11186o94733m82711
2793.8E85750008K6931k47078k66189n85976q34541r4872o03523j041603n06554j81884
$$ plain form
2803.4 581414719 580853920 580172310 579531403 578954391 579038925 578561974 577761993 577327461 576758766 576065865
2813.1 576065865 575599556 575327034 574595261 574260864 573759651 572868690 572478256 571783218 571142998 570891190
2822.7 570891190 570421791 569433556 568546906 567834015 567266350 566828270 566004753 565500526 564845123 564109039
2832.4 564109039 563500214 562425270 561490860 560680237 559929619 558830605 557470207 556198616 554819412
2841.1 554819412 553658791 552451172 550736198 549035149 547791100 545967522 543793297 541912537
2848.8 541912537 540012932 538486443 537198677 536332817 535705147 535035172 534922638 535220795 535366440
2857.4 535366440 535349541 535475922 535302238 534721069 534435463 534588394 534274139 533564987 532947807 532227821
2867.1 532227821 531853485 531386757 530621452 529672966 529115639 529263573 528761024 527917099 527200012 526583405
$$ packed form
2803.4E81414719n60799o81610o40907n77012Q4534m76951p99981m34532n68695o92901
2813.1E76065865m66309k72522p31773l34397n01213q90961l90434o95038o40220k51808
2822.7E70891190m69399r88235q86650p12891n67665m38080q23517n04227o55403p36084
2832.4E64109039o08825j074944r34410q10623p50618j099014j360398j271591j379204
2841.1E54819412j160621j207619j714974j701049j244049j823578k174225j880760
2848.8E41912537j899605j526489j287766q65860o27670o69975j12534K98157J45645
2857.4E35366440j6899J26381j73684n81169k85606J52931l14255p09152o17180p19986
2867.1E32227821l74336m66728p65305r48486n57327J47934n02549q43925p17087o16607
$$ plain form
2876.7 526583405 526031876 525524292 525106201 524366493 523829498 523324738 522832146 522470589 521934052 521268387
2886.4 521268387 520430298 519688988 518671532 517744865 517173233 516499405 515774460 515132370 514851875
2895.1 514851875 514556465 513939247 512895088 511823807 510826988 509831390 509198418 508660202 508505096
2903.7 508505096 508029747 506433945 504795456 504312706 504169464 503109093 502148819 501205101 499844170
2912.4 499844170 498657074 497451401 496019287 494563522 493046341 490990372 489331665 488456268
2920.1 488456268 487718315 487226067 486505508 485604515 485127373 485103226 485291176 485574875 485824242 486040154
2929.8 486040154 485999031 485592117 485830956 486752434 487278824 487461510 488199043 488962822 489178810 489575348
2939.4 489575348 490383186 491307297 491895218 492375946 492797356 493399849 494280052 494859314 495344315 495446434
$$ packed form
2876.7E26583405n51529n07584m18091p39708n36995n04760m92592l61557n36537o65665
2886.4E21268387q38089p41310j017456r26667n71632o73828p24945o42090k80495
2895.1E14851875k95410o17218j044159j071281r96819r95598o32972n38216j55106
2903.7E08505096m75349j595802j638489m82750j43242j060371r60274r43718j360931
2912.4D99844170j187096j205673j432114j455765j517181k055969j658707q75397
2920.1D88456268p37953m92248p20559r00993m77142k4147J87950K83699K49367K15912
2929.8D86040154m1123m06914K38839R21478N26390J82686P37533P63779K15988L96538
2939.4D89575348Q07838R24111N87921M80728M21410O02493Q80203N79262M85001J02119
$$ plain form
2949.1 495446434 495716896 496103020 495987854 496150856 496838150 497412567 497199326 497161942 497054672 497026100
2958.7 497026100 497842216 498451958 499187508 499678230 499781494 500109253 500654984 501029167 501359863 502475166
2968.3 502475166 503238831 503748474 504365311 504863091 505470161 505880165 506621208 507366257 508021851 508286705
2978 508286705 508287506 508897171 509397774 509682465 509862556 510252533 510781517 510988350 511252632 511820831
2987.6 511820831 512541084 512860184 512922859 512760124 512414169 512442398 512634659 512691956 512721748 512535477
2997.3 512535477 512196617 511959991 511453629 511228867 511443291 511614189 511557350 510852356 510225029 509820976
3006.9 509820976 509317245 508899727 508620567 508354721 508012238 507667542 507061119 506654320 506162148 505359268
3016.6 505359268 504871025 504637527 504437256 503640327 502694511 502118301 501783752 501651573 501186752 500528069
$$ packed form
2949.1D95446434K70462L86124j15166J63002O87294N74417k13241l7384j07270k8572
2958.7D97026100Q16116O09742P35550M90722J03264L27759N45731L74183L30696J115303
2968.3E02475166P63665N09643O16837M97780O07070M10004P41043P45049O55594K64854
2978E08286705Q01O09665N00603K84691J80091L89977N28984K06833K64282N68199
2987.6E11820831P20253L19100O2675j62735l45955K8229J92261N7297K9792j86271
2997.3E12535477l38860k36626n06362k24762K14424J70898n6839p04994o27327m04053
3006.9E09820976n03731m17518k79160k65846l42483l44696o06423m06799m92172q02880
3016.6E05359268m88243k33498k00271p96929r45816n76210l34549j32179m64821o58683
$$ plain form
3026.2 500528069 500095634 499731331 499226990 498630219 497971725 497541466 496885567 495871811 495099182
3034.9 495099182 494575081 494442596 493832893 493255043 492906685 491765366 491070862 490900230 490584145
3043.6 490584145 489548225 488138733 487358780 486723442 486093178 485472603 484840851 483957253 483080711
3052.2 483080711 482283478 481415977 480845833 480357819 480029755 479349747 478694000 478466072 477905464 477078438
3061.9 477078438 476548386 476444702 475736275 474770164 473976326 473120804 472543297 472409554 472311745 471326447
3071.5 471326447 470798798 470555344 469528656 468598595 468070259 468116608 467914925 467295380 466316910 465787010
3081.2 465787010 465876923 465014801 464416542 464182587 463746338 463260155 462458649 462304420 462280884 461372261
3090.8 461372261 460075111 459438744 459376221 459208946 458925323 458189011 457297249 456961098 456719398 455938454
$$ packed form
3026.2E00528069m32435l64303n04341n96771o58494m30259o55899j013756p72629
3034.9D95099182n24101j32485o09703n77850l48358j141319o94504j70632l16085
3043.6D90584145j035920j409492p79953o35338o30264o20575o31752q83598q76542
3052.2D83080711p97233q67501n70144m88014l28064o80008o55747k27928n60608q27026
3061.9D77078438n30052j03684p08427r66111p93838q55522n77507j33743r7809r85298
3071.5D71326447n27649k43454j026688r30061n28336M6349k01683o19545r78470n29900
3081.2D65787010Q9913q62122n98259k33955m36249m86183q01506j54229k3536r08623
3090.8D61372261j297150o36367o2523j67275k83623p36312q91762l36151k41700p80944
$$ plain form
3100.5 455938454 455248070 454661903 453798714 453267212 453126106 452877960 452399788 451982040 451354904 450502014
3110.1 450502014 450015450 449649200 448767395 447851677 447570457 447170753 446368179 445861816 445968781 445656471
3119.8 445656471 444683990 443970757 443002052 442264786 441983070 441440086 440598679 439783630 439436607 438677483
3129.4 438677483 437653656 437203522 436920929 436164627 435397949 435172501 434663048 433852463 432950249
3138.1 432950249 432523003 432123718 430879288 430174904 429748840 428894730 428121948 427640228 427442780
3146.8 427442780 427117043 426326599 425484543 425181541 424747162 424016113 423321533 422635651 421722603 420589752
3156.4 420589752 419963188 419426994 418821907 418313637 417639351 416766281 416068268 415651283 414686050 413918877
3166 413918877 413828354 413649368 413032570 412033234 411070557 410280113 409656219 408817177 408206673 407522469
$$ packed form
3100.5D55938454o90384n86167q63189n31502j41106k48146m78172m17748o27136q52890
3110.1D50502014m86564l66250q81805r15718k81220l99704q02574n06363J06965l12310
3119.8D45656471r72481p13233r68705p37266k81716n42984q41407q15049l47023p59124
3129.4D38677483j023827m50134k82593p56302p66678k25448n09453q10585r02214
3138.1D32950249m27246l99285j244430p04384m26064q54110p72782m81720j97448
3146.8D27442780l25737p90444q42056l03002m34379p31049o94580o85882r13048j132851
3156.4D20589752o26564n36194o05087n08270o74286q73070o98013m16985r65233p67173
3166D13918877r0523j78986o16798r99336r62677p90444o23894q39042o10504o84204
$$ plain form
3175.7 407522469 406807594 406777267 406060829 405325928 405147972 404446182 403136330 401968231 401592903
3184.4 401592903 401257629 400908928 400327606 399592056 399056549 398143997 397670555 397595024 396895943 395961418
3194 395961418 395383072 394769402 393949623 393275719 392584343 391884422 391547470 391044502 389958305 389714546
3203.6 389714546 389777298 389172211 388380051 387234573 387017479 386642647 385423508 385375023 385369110 384694443
3213.3 384694443 383673782 382987480 383036880 382557335 381587677 380832863 380501251 380367851 379691658 378643074
3222.9 378643074 378318024 378598251 378400383 377518997 376377182 375658836 375680351 375743942 375284576 374515915
3232.6 374515915 373670731 373424301 373510475 372932243 372073936 371252785 370531883 369967690 369560966 369087219
3242.2 369087219 368664703 368802147 368668251 368039856 367196007 366616554 366524162 365885696 365156784 364872131
$$ packed form
3175.7D07522469p14875l0327p16438p34901j77956p01790j309852j168099l75328
3184.4D01592903l35274l48701n81322p35550n35507r12552m73442p5531o99081r34525
3194C95961418n78346o13670q19779o73904o91376o99921l36952n02968j086197k43759
3203.6C89714546O2752o05087p92160j145478k17094l74832j219139m8485n913o74667
3213.3C84694443j020661o86302M9400m79545r69658p54814l31612j33400o76193j048584
3222.9C78643074l25050K80227j97868q81386j141815p18346K1515O3591m59366p68661
3232.6C74515915q45184k46430Q6174n78232q58307q21151p20902n64193m06724m73747
3242.2C69087219m22516J37444j33896o28395q43849n79453r2392o38466p28912k84653
$$ plain form
3251.9 364872131 364715118 364269180 363554573 363163033 362924385 362608376 362150230 361761131 361359711 360705643
3261.5 360705643 360130196 360009766 359625053 358739243 358481369 358208809 357733994 357697678 357862854 357428398
3271.2 357428398 356343689 356204796 356093597 355673256 355547600 355068512 354874191 354287529 353432732
3279.8 353432732 352976341 352563438 352276993 351974564 351964340 351805038 351559143 351635590 351211662 350373306
3289.5 350373306 350279922 350680618 350396347 349885368 349282608 348462029 347897301 347430191 347102203 346822395
3299.1 346822395 346489029 346349831 346523895 346585121 346307983 345707741 344906616 344568901 344518852 344378815
3308.8 344378815 343918343 343288155 342914848 342735519 342587585 341810989 341145287 341089325 340672340 340079079
3318.4 340079079 339584541 339310799 339108238 338856201 338661079 338111496 337625885 337132874 336208763 335534363
$$ packed form
3251.9C64872131j57013m45938p14607l91540k38648l16009m58146l89099m01420o54068
3261.5C60705643n75447j20430l84713q85810k57874k72560m74815l6316J65176m34456
3271.2C57428398j084709j38893j11199m20341j25656m79088j94321n86662q54797
3279.8C53432732m56391m12903k86445l02429j0224j59302k45895P6447m23928q38356
3289.5C50373306r3384M00696k84271n10979o02760q20579n64728m67110l27988k79808
3299.1C46822395l33366j39198J74064O1226k77138o00242q01125l37715n0049j40037
3308.8C44378815m60472o30188l73307j79329j47934p76596o65702n5962m16985n93261
3318.4C40079079m94538k73742k02561k52037j95122n49583m85611m93011r24111o74400
$$ plain form
3328.1 335534363 335073433 334710083 334513245 333829193 333054733 332744331 332347832 331851692 331503487 331163292
3337.7 331163292 330814781 330381889 329729271 329226913 328833542 328032303 327196312 326775208 326734734 326658287
3347.3 326658287 326247368 325669670 324969673 324506416 324366150 324121971 323582191 322759819 322156143 322210159
3357 322210159 322276764 321934128 321483612 320596848 319778843 319911213 320294800 320220833 319708042 319381485
3366.6 319381485 319191875 318477077 317496166 316830273 316469212 315938511 315671368 315879383 315657101 315218906
3376.3 315218906 315107307 314879684 314555492 314526482 314377079 314025154 313836975 313583374 313288956 312908001
3385.9 312908001 312415428 312317410 312325153 312314262 312560520 312616329 312405128 312153702 312018490 311955261 311896763
3396.5 311896763 311616478 310826645 310285053 310099297 310204678 310551052 310605392 310630951 310039921 309287853
$$ packed form
3328.1C35534363m60930l63350j96838o84052p74460l10402l96499m96140l48205l40195
3337.7C31163292l48511m32892o52618n02358l93371q01239q35991m21104m0474p6447
3347.3C26658287m10919n77698o99997m63257j40266k44179n39780q22372o03676N4016
3357C22210159O6605l42636m50516q86764q18005J32370L83587p3967n12791l26557
3366.6C19381485j89610p14798r80911o65893l61061n30701k67143K08015k22282m38195
3376.3C15218906j11599k27623l24192k9010j49403l51925j88179k53601k94418l80955
3385.9C12908001m92573r8018P743j0891K46258N5809k11201k51426j35212o3229n8498
3396.5C11896763k80285p89833n41592j85756J05381L46374N4340K5559n91030p52068
$$ plain form
3406.2 309287853 309571133 309959412 310060024 310122299 310093956 309995289 309890671 309969254 309959259 309727783 309679794
3416.8 309679794 309773998 310035210 310663967 310874481 310757446 310943012 310984898 310901566 310712357 310754280
3426.4 310754280 311071949 310574608 310147839 310977821 311516685 311780014 312351055 312161713 312304668 313213768
3436.1 313213768 313829346 313977470 313702698 313447704 313965626 315022316 315213528 315317898 315821152
3444.7 315821152 316610947 317580261 317132797 317136631 317571716 317761898 318749409 319681835 320103645 320416222
3454.4 320416222 321397972 321666374 321574783 322445526 323049507 323650475 323838043 324305763 324917564 325138130
3464 325138130 326050224 326784744 327854614 328772087 328762360 328987885 329908218 330859947 331301308 331928444
3473.7 331928444 332483177 333090630 333791771 334453659 335250092 335997581 336909866 337733154 338461494 338553352
$$ packed form
3406.2C09287853K83280L88279J00612O2275k8343r8667j04618P8583r995k31476m7989
3416.8C09679794R4204K61212O28757K10514j17035J85566M1886q3332j89209M1923
3426.4C10754280L17669m97341m26769Q29982N38864K63329N71041j89342J42955R09100
3436.1C13213768O15578J48124k74772k54994N17922J056690J91212J04370N03254
3444.7C15821152P89795R69314m47464L834M35085J90182R87511R32426M21810L12577
3454.4C20416222R81750K68402r1591Q70743O03981O00968J87568M67720O11801K20566
3464C25138130R12094P34520J069870R17473r727K25525R20333R51729M41361O27136
3473.7C31928444N54733O07453P01141O61888P96433P47489R12285Q23288P28340R1858
$$ plain form
3483.3 338553352 339013824 339987755 340585937 341581154 342294083 343244171 344549599 345334816 346063690
3492 346063690 346960487 347813034 348264122 348852005 349161530 349463806 350487976 351722450 352837830
3500.7 352837830 353714676 354802818 355414848 355802269 356542854 357463608 358916931 360623627 361833725
3509.4 361833725 362140923 362788200 363364067 364218292 365366745 365801849 366875877 368040123 368890266
3518 368890266 369855309 370503960 371554947 373084259 374135437 374147301 374382553 375787888 377810707
3526.7 377810707 378950920 379342537 379660683 380569649 382005348 383046074 384443474 385964279 387920074
3535.4 387920074 388954353 388600159 389637070 390930443 392252541 393108940 394297752 396095924 397268486
3544.1 397268486 398060112 398896065 400905685 401150742 401959305 403433037 404736671 407651749 408305244
$$ packed form
3483.3C38553352M60472R73931N98182R95217P12929R50088J305428P85217P28874
3492C46063690Q96797Q52547M51088N87883L09525L02276J024170J234474J115380
3500.7C52837830Q76846J088142O12030L87421P40585R20754J453323J706696J210098
3509.4C61833725L07198O47277N75867Q54225J148453M35104J074028J164246Q50143
3518C68890266R65043O48651J050987J529312J051178J1864K35252J405335K022819
3526.7C77810707J140213L91617L18146R08966J435699J040726J397400J520805J955795
3535.4C87920074J034279l54194J036911J293373J322098Q56399J188812J798172J172562
3544.1C97268486P91626Q35953K009620K45057Q08563J473732J303634K915078O53495
$$ plain form
3552.7 408305244 409318962 410237846 410955353 413197746 414204597 415796509 417508850 418914948 419651108
3561.4 419651108 421557465 423938103 424919319 428902168 430974922 430877838 430214462 429072990 432029190
3570.1 432029190 433762856 435566292 437531891 439109230 440299416 441685066 444103661 445160866
3577.8 445160866 447822609 449941902 450796051 452461357 454371223 456544762 457513695 461382828 463740921
3586.5 463740921 462476120 464110870 463245926 466305733 469936104 472628098 474023819 474969368 478874283
3595.2 478874283 478682861 480538788 484372406 485314331 487786980 488790474 489622955 492002678 494125938
3603.9 494125938 496206665 499271698 502669029 502452431 505230789 505003128 504521637 512369270 515124130
3612.5 515124130 512929611 516706123 516627846 519882202 524531784 525385017 527394981 528209953 529642029
$$ packed form
3552.7D08305244J013718R18884P17507K242393J006851J591912J712341J406098P36160
3561.4D19651108J906357K380638R81216L982849K072754r7084o63376j141472K956200
3570.1D32029190J733666J803436J965599J577339J190186J385650K418595J057205
3577.8D45160866K661743K119293Q54149J665306J909866K173539R68933L869133K358093
3586.5D63740921j264801J634750q64944L059807L630371K691994J395721R45549L904915
3595.2D78874283j91422J855927L833618R41925K472649J003494Q32481K379723K123260
3603.9D94125938K080727L065033L397331k16598K778358k27661m81491P847633K754860
3612.5E15124130k194519L776512p8277L254356M649582Q53233K009964Q14972J432076
$$ plain form
3621.2 529642029 532584877 534846153 536740646 539548912 542040443 544759407 552442169 554481697
3628.9 554481697 543381691 548092995 553689766 558934517 561466484 560268555 562019730 565609322
3636.6 565609322 568804398 570197716 571951866 574754639 578022041 580165901 580831375 582861824
3644.4 582861824 586775665 593105698 593957787 591962852 597183189 596563110 594862900 595855408 601006317
3653 601006317 605243530 609430656 615548897 609363708 610552216 616151657 617733612 619054718 619743004
3661.7 619743004 622280045 624162445 625634842 627631073 629098244 633928337 636697731 635755692
3669.4 635755692 636029053 630468483 632707825 641088791 652199554 655895233 636551971 637086639
3677.1 637086639 644412766 649903946 647918015 647194290 649800491 652195892 653939209 653882446 654347534
$$ packed form
3621.2E29642029K942848K261276J894493K808266K491531K718964P682762K039528
3628.9E54481697j1100006M711304N596771N244751K531967j197929J751175L589592
3636.6E65609322L195076J393318J754150K802773L267402K143860O65474K030449
3644.4E82861824L913841O330033Q52089j994935N220337o20079j700210R92508N150909
3653F01006317M237213M187126O118241o185189J188508N599441J581955J321106O88286
3661.7F19743004K537041J882400J472397J996231J467171M830093K769394r42039
3669.4F35755692K73361n560570K239342Q380966J1110763L695679j9343262N34668
3677.1F37086639P326127N491180j985931p23725K606201K395401J743317n6763M65088
$$ plain form
3685.8 654347534 659039841 666878967 658677902 654069977 664355240 658958206 656703644 661907578
3693.5 661907578 662117462 663328323 664407349 664551239 665956497 666568375 668944626 671604233 666670609
3702.2 666670609 664531403 669263000 671329422 671417770 671480637 674019623 678461304 672120667 676181870
3710.9 676181870 681481018 666886063 670239944 674609299 675231323 676006470 677828217 679233932
3718.6 679233932 675772934 676368027 682312164 680085754 675353622 679963074 682160187 682231064 679762421
3727.3 679762421 679006195 681922760 683073654 689449921 689016037 680517502 688498077 689965668 679711838
3736 679711838 679746933 682580948 683086472 684230423 686544113 683068237 686468048 699184341 691003036
3744.7 691003036 672992630 681332550 686876602 694040909 693696594 683486938 693022919 687757874
$$ packed form
3685.8F54347534M692307P839126q201065m607925J0285263n397034k254562N203934
3693.5F61907578K09884J210861J079026J43890J405258O11878K376251K659607m933624
3702.2F66670609k139206M731597K066422Q8348O2867K538986M441681o340637M061203
3710.9F76181870N299148j4594955L353881M369355O22024P75147J821747J405715
3718.6F79233932l460998N95093N944137k226410m732132M609452K197113P0877k468643
3727.3F79762421p56226K916565J150894O376267m33884q498535P980575J467591j0253830
3736F79711838L5095K834015N05524J143951K313690l475876L399811J2716293q181305
3744.7F91003036j8010406Q339920N544052P164307l44315j0209656R535981n265045
$$ plain form
3752.4 687757874 678513260 683290634 687878723 691349030 686235580 687872009 694393692 687964859
3760.1 687964859 685201645 688716812 690077896 690391388 694212646 692927856 686645508 688923264
3767.8 688923264 694879150 696234055 687141495 687544861 690544662 691329346 692490616 692184067 692575073
3776.5 692575073 692796555 695582809 696947784 689518738 690604324 692416229 693685608 696545715
3784.2 696545715 693148499 691102676 692299652 692786255 692621078 692749481 694178162 693962631 693971329
3792.9 693971329 693845978 695069809 699590607 696874924 691374588 692122269 696215897 703596344 698425522
3801.5 698425522 686645355 689657745 692801285 697820663 703835449 694665070 689347992 693753357
3809.3 693753357 695538559 695487747 695897675 695926895 696851730 703068848 704141312 689815063 693485718
$$ packed form
3752.4F87757874r244614M777374M588089L470307n113450J636429O521683o428833
3760.1F87964859k763214L515167J361084L13492L821258j284790o282348K277756
3767.8F88923264N955886J354905r092560M03366K999801P84684J161270l06549L91006
3776.5F92575073K21482K786254J364975p429046J085586J811905J269379K860107
3784.2F96545715l397216k045823J196976M86603j65177J28403J428681k15531Q698
3792.9F93971329j25351J223831M520798k715683n500336P47681M093628P380447n170822
3801.5F98425522j1780167L012390L143540N019378O014786r170379n317078M405365
3809.3F93753357J785202n0812M09928K9220R24835O217118J072464j4326249L670655
$$ plain form
3817.9 693485718 698489075 703665466 707580872 688909988 689542999 694211655 696569290 699812164
3825.7 699812164 699347992 694630737 694156952 695784683 699168701 701735001 693017120 694744568 703509750
3834.3 703509750 698617401 697125168 705806351 698302078 693483505 700820694 695323639 694466858
3842.1 694466858 701174240 699035950 694006882 695617828 697015686 697507553 699902649 699888763 701945343
3850.7 701945343 707615051 701119080 702684860 689778748 689094391 699620743 698204575 694992447
3858.4 694992447 697269745 699877853 702535782 696259308 695335464 703343582 698716507 691857452
3866.2 691857452 695610962 700917358 707677231 701475372 690528564 693118896 699180298 703219833
3873.9 703219833 693187103 693193512 697216492 697153778 699033432 703692551 699955063 692459946 698037872
$$ packed form
3817.9F93485718N003357N176391L915406j8670884O33011M668656K357635L242874
3825.7F99812164m64172m717255m73785J627731L384018K566300q717881J727448Q765182
3834.3G03509750m892349j492233Q681183p504273m818573P337189n497055q56781
3842.1F94466858O707382k138290n029068J610946J397858M91867K395096j3886K056580
3850.7G01945343N669708o495971J565780j2906112o84357J0526352j416168l212128
3858.4F94992447K277298K608108K657929o276474r23844Q008118m627075o859055
3866.2F91857452L753510N306396O759873o201859j0946808K590332O061402M039535
3873.9G03219833j0032730O409M022980o2714J879654M659119l737488p495117N577926
$$ plain form
3882.6 698037872 699414139 699859543 704860916 692838058 693175659 697095566 697696609 701884308 701341553
3891.2 701341553 693438873 694929199 698106918 696095505 696985092 698497162 700656357 702908401
3898.9 702908401 694278259 699178925 701306381 695118179 699774246 697000732 694678192 694682999 695489883
3907.6 695489883 697426682 697138519 697739258 697111435 696811447 697191010 697040405 698402100 700419388
3916.3 700419388 697449188 693552094 697875137 698832855 694931870 696560822 698052673 699494247
3924 699494247 697969818 694878082 696158295 697473145 698439178 697286377 696793060 699114227 696704788
3932.7 696704788 694566650 696136780 696187668 696066666 696394730 695729752 695533676 695664673 697485123
3941.4 697485123 699243927 694928131 693434525 694893265 696150055 698298492 696980591 696863708
$$ packed form
3882.6F98037872J376267M45404N001373j2022858L37601L919907O01043M187699n42755
3891.2G01341553p902680J490326L177719k011413Q89587J512070K159195K252044
3898.9G02908401q630142M900666K127456o188202M656067k773514k322540M807Q06884
3907.6F95489883J936799k88163O00739o27823k99988L79563j50605J361695K017288
3916.3G00419388k970200l897094M323043R57718l900985J628952J491851J441574
3924F99494247j524429l091736J280213J314850R66033j152801m93317K321167k409439
3932.7F96704788k138138J570130N0888j21002L28064o64978j96076J30997J820450
3941.4F97485123J758804m315796j493606J458740J256790K148437j317901j16883
$$ plain form
3949.1 696863708 696779633 694704819 695902328 696021271 695868301 696225891 696291122 696342010 695644073 696115799
3958.7 696115799 696055679 696639328 696591187 694644928 694936829 695477829 695650711 695593719 695396500 695903473
3968.4 695903473 695812225 695611725 696251144 696644821 695940552 695825424 696741562 696696167 695789032 695685806
3978 695685806 695753403 695705795 696248779 696659393 696735382 696771774 696368637 694947815 694494629 695032272
3987.7 695032272 695092850 695880737 696328888 696433105 696368027 696158600 696312332 695647888 695488510 696009064
3997.3 696009064 696377411 696343765 696242294
4000.2 696242294
$$ packed form
3949.1F96863708q4075k074814J197509J18943j52970L57590O5231N0888o97937M71726
3958.7F96115799o0120N83649m8141j946259K91901N41000J72882n6992j97219N06973
3968.4F95903473r1248k00500O39419L93677p04269j15128R16138m5395r07135j03226
3978F95685806O7597m7608N42984M10614P5989L6392m03137j420822m53186N37643
3987.7F95032272O0578P87887M48151J04217o5078k09427J53732o64444j59378N20554
3997.3F96009064L68347l3646j01471
4000.2F96242294
##END=$$ End of the data block
