##TITLE=$$ Begin of the data block
##JCAMP-DX=5.00 $$ ACD/SpecManager v 10.08
##SPECTROMETER/DATA SYSTEM=Varian
##DATE=08 Jan 2013 15:41:10
##DATA TYPE=INFRARED SPECTRUM
##DATA CLASS=XYDATA
##ORIGIN=
##OWNER=
##NPOINTS=3735
##FIRSTX=399.26403809
##LASTX=4000.35498047
##MAXX=4000.35498047
##MINX=399.26403809
##MAXY=73.86753082
##MINY=31.04137039
##XFACTOR=1.0000000000
##YFACTOR=0.000000100000000
##FIRSTY=48.19800568
##DELTAX=0.96440572
##XUNITS=1/CM
##YUNITS=TRANSMITTANCE
##XYDATA=(X++(Y..Y))
399.3D81980057J961403K691459K255936l924828M740410P097092P907371m417991
$$ 481980057 483941460 486632919 488888855 484964027 489704437 496801529 504708900 500290909
407E00290909r541130O310959n45731j3865089l712998J3407936N802651m655533k096100
$$ 500290909 490749779 497060738 496515007 482649918 478936920 492344856 498147507 493491974 491395874
415.7D91395874K309532J548271j5708923q636513M591370L619308p33604k430801
$$ 491395874 493705406 495253677 479544754 470908241 475499611 479118919 478385315 475954514
423.4D75954514Q049888O072693k270775p46498j060791l785324J811066l043023o460609
$$ 475954514 484004402 490077095 487806320 487059822 485999031 482213707 484024773 480981750 474521141
432.1D74521141K790909K478981J630669J538658M742164J541367n216904N2529L375358
$$ 474521141 477312050 479791031 481421700 482960358 487702522 489243889 484026985 484079514 487454872
440.7D87454872j145172l47290M769936l98217N31884K28805p221641J29432L629112
$$ 487454872 486309700 485962410 490732346 490334129 490866013 491094818 483873177 484002609 487631721
449.4D87631721j42517k294044K175445K547303j486550O34117j008148L69873k397041
$$ 487631721 487489204 485195160 487370605 489917908 488431358 489065475 488057327 488427200 486030159
458.1D86030159n20020K1286l977623m36782k86675L193970L636894j661186n000763
$$ 486030159 485510139 485531425 481553802 481117020 480830345 484024315 487661209 486000023 480999260
466.8D80999260m559784K7847k929420p27005L051948K648049j93558o23169O01349
$$ 480999260 476439476 476467323 473537903 472810898 475862846 478510895 478317337 477694168 478295517
475.5D78295517m97665j283837m766121l981094J114921L606873L533402p94144m384804
$$ 478295517 477797852 476514015 471747894 467766800 468881721 472488594 476021996 475227852 470843048
484.1D70843048j523399n48363O78101L147239l076095l670845J708221J485367K375183
$$ 470843048 469319649 468771286 469449387 472596626 469520531 465849686 467557907 469043274 471418457
492.8D71418457J319046q57010j179695J6861j200027k735787l64609J347008L320923
$$ 471418457 472737503 471880493 470700798 470717659 469517632 466781845 466417236 467764244 471085167
501.5D71085167J772537j693916p23839O06155q59947l549652j380195L28369K253723
$$ 471085167 472857704 471163788 470439949 471046104 470186157 466636505 465256310 465584679 467838402
510.2D67838402P37686J21040J366844J40610k202415n091439j101226J258316r70383
$$ 467838402 468576088 468697128 470063972 470204582 468002167 462910728 461809502 463067818 462097435
518.9D62097435k028084R5635M001617Q80394K17781P46079k893258n179977j216164
$$ 462097435 460069351 460164986 464166603 465046997 465264778 466010857 463117599 457937622 456721458
527.5D56721458J685257P36504L146706J866836p66907p05223j892280j740608k495881
$$ 456721458 458406715 459143219 462289925 464156761 463389854 462684631 460792351 459051743 456555862
536.2D56555862Q2055O69403K11982O98281l9978J540947j84517j099663q82454j437683
$$ 456555862 456637917 457307320 457519302 458217583 458177605 459718552 459534035 458434372 457551918 456114235
545.9D56114235k96440j103859p01828J065445J803551L93486l17002R98383n79148
$$ 456114235 455817795 454713936 454012108 455077553 456881104 457274590 456957588 457955971 457376823
554.5D57376823k649307k085647j734124Q58269K290001j494217q44078K415733L076554
$$ 457376823 454727516 452641869 450907745 451766014 454056015 452561798 451717720 454133453 457210007
563.2D57210007P55157k568054j095200k00271L02009K54021o14204J150093j9837
$$ 457210007 457965164 455397110 454301910 454101639 454403648 454657669 454043465 455193558 455173721
571.9D55173721j024627l22724j86310l39622n86395k52457k66151Q19892J17836j294136
$$ 455173721 454149094 453826370 453640060 453300438 452714043 452461586 452195435 453015327 453133163 451839027
581.5D51839027m76722P35435J203346p65419j005287K94533R20944J216431R08737
$$ 451839027 451362305 452097740 453301086 452535667 451530380 451824913 452745857 453962288 454871025
590.2D54871025J746712J179504j88446j031723k095146P42149J645165q6975O14471
$$ 454871025 456617737 457797241 457608795 456577072 454481926 455224075 456869240 456782265 457396736
598.9D57396736N66597M04663K49329j199341j982956o27747O89545M6044N91125P44286
$$ 457396736 457963333 458367996 458617325 457417984 455435028 454807281 455496826 455542870 456133995 456878281
608.5D56878281M58336J62048j640549j543922k65427K39983p84569j50910R64966
$$ 456878281 457336617 457498665 455858116 454314194 454048767 454288750 453504181 453353271 454318237
617.2D54318237o75621N44129J445617O75278q4228l58544Q1711j207314o6108K145004
$$ 454318237 453642616 454186745 455632362 456307640 456223412 455864868 455946579 454739265 454673157 456818161
626.9D56818161J580276P46117J800995K745476J066971P34748J371041k94380j209183
$$ 456818161 458398437 459144554 460945549 463691025 464757996 465492744 466863785 466569405 465360222
635.5D65360222R07326K152748J408272J582565K296028J924019M79431j00441l19519
$$ 465360222 466267548 468420296 469828568 471411133 473707161 475631180 476110611 476010170 475690651
644.2D75690651n57709R74541J479492P79915N21393J478233J981888j92032j034355
$$ 475690651 475132942 476107483 477586975 478366890 478888283 480366516 482348404 482156372 481122017
652.9D81122017L4218k17781p48673M56009J463623J622734P47071j35384P60651p44248
$$ 481122017 481156235 480938454 480189781 480645790 482109413 483732147 484479218 484343834 485104485 484360237
662.5D84360237j031418j983p67899R61151J465607j73645O03104N76858N47028k99836
$$ 484360237 483328819 483326836 482558937 483520088 484985695 484812050 485415154 485992012 486539040 486239204
672.2D86239204P55730J373825L71552O80961P48291K81868J403275J445770k28729
$$ 486239204 486994934 488368759 488740311 489421272 490169563 490451431 491854706 493300476 493071747
680.9D93071747O54526R17053k1858j99089R77363K478142J066704J21307M5357r6207
$$ 493071747 493726273 494643326 494621468 494422379 495399742 497877884 498944588 499065895 499111252 499015045
690.5D99015045n89447o1722J568070N79033O6261K13318Q08678J303863P28836M44336
$$ 499015045 498425598 498363876 499931946 500510979 500577240 500790558 501599236 502903099 503631935 504076271
700.2E04076271p28607m76151L10860P87544J029167O15426J038589J468811J115646
$$ 504076271 503347664 502871513 503182373 503969917 504999084 505614510 506653099 508121910 509237556
708.8E09237556j97792n36193n48630j04447P93572R29069J088715R48868J417694
$$ 509237556 509039764 508503571 507954941 507850494 508644066 509573135 510661850 511610718 513028412
717.5E13028412Q75053J207505R81712j580620j186142L57628J444664Q14476J384888
$$ 513028412 513903465 515110970 516092682 514512062 513325920 513683548 515128212 515942688 517327576
726.2E17327576J867942Q09670J325760m0779l33100R7123M60319J273079O05202O06956
$$ 517327576 519195518 520005188 521330948 521290169 520957069 521054192 521514511 522787590 523392792 523999748
735.8E23999748J58043N99938J223373Q59642L35693O86341J343689L53355j29700
$$ 523999748 524157791 524757729 525981102 526840744 527176437 527862778 529206467 529559822 529430122
744.5E29430122l128J591683J156463l74221M29077R36622J441498L56140j8043L37868
$$ 529430122 529426994 531018677 532175140 531800919 532229996 533166618 534608116 534964256 534946213 535284081
754.2E35284081Q16841J030044L37105J175156N73997J76163P04765J713181J553192
$$ 535284081 536100922 537130966 537468071 538643227 539217224 539393387 540098152 541811333 543364525
762.8E43364525K23923N17425k49824K30674Q91724P05147k59705q32634K67410J97602
$$ 543364525 543588448 544105873 543856049 544086723 544978447 545683594 545423889 544591255 544858665 545056267
772.5E45056267O22253J37863K55852j9493m74129O38848j21498K68363P90520O78902
$$ 545056267 545678520 545816383 546072235 546052742 545578613 546217461 546095963 546364326 547154846 547833748
782.1E47833748P7553M31175J042480j52359J83678k39181j80245m84123l61977J153412
$$ 547833748 547911301 548342476 549384956 549232597 549416275 549177094 548996849 548512726 548150749 549304161
791.8E49304161O7825l59077L81927L84789m79164m07448o90956o95763m29229j423989
$$ 549304161 549371986 549012909 549394836 549779625 549300461 548893013 548202057 547506294 547077065 545653076
801.4E45653076m69322l15285j54876n88341j035805q8539j656380k807197k429543
$$ 545653076 545183754 544868469 544713593 544125252 543089447 543000908 541344528 538537331 536107788
810.1E36107788o64215o42967k374459j208915L72162N3367l92265m43039j142654
$$ 536107788 535443573 534800606 532426147 531217232 531589394 531642761 531250496 530807457 529664803
818.8E29664803j207047p06215J021195O59599q14629J423722J373748N09301J129341
$$ 529664803 528457756 527751541 528772736 529432335 528617706 530041428 531415176 531924477 533053818
827.5E33053818J886444K189598J108093J188469J357422K254486K054596J992722
$$ 533053818 534940262 537129860 538237953 539426422 540783844 543038330 545092926 547085648
835.2E47085648K342071J494904J921463P56721Q70819J654206J421470J155548J018830
$$ 547085648 549427719 550922623 552844086 553600807 554471626 556125832 557547302 558702850 559721680
843.9E59721680J322097J063157K407989J586380J066780J792031J251029P75528O73523
$$ 559721680 561043777 562106934 564514923 566101303 567168083 568960114 570211143 570986671 571660194
852.5E71660194K473221J715622J062432J163482J753617K199974N53588R89838Q58307
$$ 571660194 574133415 575849037 576911469 578074951 579828568 582028542 582582130 583571968 584430275
861.2E84430275J414185O98204M29954L99780j337928n5314o57005o71387p95288j490860
$$ 584430275 585844460 586542664 586972618 587372398 586034470 585979156 585322151 584650764 583855476 582364616
870.9E82364616j364059j588516n34821m27208j13678j467056p36923J272049P38487
$$ 582364616 581000557 579412041 578877220 578450012 578336334 576869278 576132355 577404404 578142891
879.5E78142891J73187r83963k84195l65028j85127m7341p91740k91748l61328j61362
$$ 578142891 578316078 577332115 577047920 576682892 576497765 576450424 575658684 575366936 575005608 574844246
889.2E74844246o46820k87132J09367N54771L96729n03693L70522N57174O97861m44832
$$ 574844246 574197426 573910294 574019661 574574432 574971161 574467468 574837990 575395164 576093025 575648193
898.8E75648193o5155N71061r98154k8801J207695J357155N78041O34231P51305O01768
$$ 575648193 575583038 576154099 575155945 575127144 576334839 577691994 578270035 578904266 579655571 580257339
908.5E80257339J108170N21240j38168l84522O81534n23910j856728j147232r81064
$$ 580257339 581365509 581886749 581748581 581364059 582045593 581521683 579664955 578517723 577536659
917.2E77536659q82835k140885k400550k292748j987572j410026j855087k273369k170182
$$ 577536659 576653824 574512939 572112389 569819641 567832069 566422043 564566956 562293587 560123405
925.8E60123405k048759k597580k096825k745781k790145j387139j027908p20940r49440
$$ 560123405 558074646 555477066 553380241 550634460 547844315 546457176 545429268 544708328 543758888
934.5E43758888l49846n01670q55561o5384k02446j342659j453857J97906j11618l81279
$$ 543758888 543409042 542907372 542051811 541986427 541783981 540441322 538987465 539185371 539073753 538692474
944.2E38692474k69050q43468m22058l44887q17718j274681m57802n75485q83484j088639
$$ 538692474 538423424 537579956 537157898 536813011 535995293 534720612 534262810 533687325 532803841 531715202
953.8E31715202j710357j082154j500473j552810k029572k496681j987801j759376
$$ 531715202 530004845 528922691 527422218 525869408 523839836 521343155 519355354 517595978
961.5E17595978j497421j839562j652527j916466j398277j196060k061195j176339
$$ 517595978 516098557 514258995 512606468 510690002 509291725 508095665 506034470 504858131
969.2E04858131p62901j298408j993752k363548k402878k029114j986618k101250j902771
$$ 504858131 504095230 502796822 500803070 498439522 496036644 494007530 492020912 489919662 488016891
977.9D88016891k642211k607155l042107l805542l471451l328399l321724l016701
$$ 488016891 485374680 482767525 479725418 475919876 472448425 469120026 465798302 462781601
985.6D62781601l158760m191971l863831k990608l111114l602638l698578l673516
$$ 462781601 459622841 455430870 451567039 448576431 445465317 441862679 438164101 434490585
993.3D34490585l586387k613869k243233l052635l520393k635117k331772k380485
$$ 434490585 430904198 428290329 426047096 422994461 419474068 416838951 414507179 412126694
1001.1D12126694k076035k276573j957779j505814j206016j137695j282807j578750
$$ 412126694 410050659 407774086 405816307 404310493 403104477 401966782 400683975 399105225
1008.8C99105225j391945j235810j501350j123772q07647j410065k103844j618995
$$ 399105225 397713280 396477470 394976120 393852348 393044701 391634636 389530792 387911797
1016.5C87911797k148171k149582j514664j783142j418953k133636j666756j748237
$$ 387911797 385763626 383614044 382099380 380316238 378897285 376763649 375096893 373348656
1024.2C73348656j647835n80444j369210j340027j949386j225395p17965j192092j112748
$$ 373348656 371700821 371120377 369751167 368411140 366461754 365236359 364518394 363326302 362213554
1032.9C62213554j212158k26517k07214N43747K65770J77917J079445J162377M61807
$$ 362213554 361001396 360774879 360567665 361111412 361377182 361555099 362634544 363796921 364258728
1041.6C64258728l43437J031494L53508L55911j77574p75986K61116j556816q67500
$$ 364258728 363915291 364946785 365300293 365656204 365478630 364702644 364963760 363406944 362539444
1050.2C62539444j39961l07961m17022m13819j23863q67043M47846M46358M69245L45421
$$ 362539444 362399483 362091522 361674500 361260681 361136818 360269775 360717621 361163979 361633224 361978645
1059.9C61978645Q30269J596832N10025J539727J804886J717109J986656J655427Q53042
$$ 361978645 362808914 364405746 364915771 366455498 368260384 369977493 371964149 373619576 374472618
1068.6C74472618Q88214M84772l43857J096039R46503J218528O69518k1362O72187
$$ 374472618 375360832 375845604 375501747 376597786 377544289 378762817 379432335 379410973 380083160
1077.2C80083160J83564J096840J078796J572418J395874j13067J11274J271591J882401
$$ 380083160 380266724 381363564 382442360 384014778 385410652 385297585 385408859 386680450 388562851
1085.9C88562851R91936J276588J476021K111626J939697J114349J120453O51970J918716
$$ 388562851 389554787 390831375 392307396 394419022 396358719 397473068 398593521 399245491 401164207
1094.6D01164207J662407J016922J400948J032944J232414J416130R70001R45626K283706
$$ 401164207 402826614 403843536 405244484 406277428 407509842 408925972 409895973 410841599 413125305
1103.3D13125305J707840P92198P60880J258774J947174N31883M33922M03290J88713
$$ 413125305 414833145 415625343 416386223 417644997 419592171 420124054 420557976 420961266 421149979
1112D21149979P97157Q42552M12216p17392Q00476J503067L2463k81257m90074K13470
$$ 421149979 421947136 422789688 423201904 422484512 423284988 424788055 424820518 424539261 424049187 424262657
1121.6D24262657O47888J07422j98860L13225Q11615Q09440Q81920J088257J397553
$$ 424262657 424910545 425017967 424819107 425132332 425943947 426753387 427635307 428723564 430121117
1130.3D30121117J245498J542435J526337R82360J225358J671218K146683K424126
$$ 430121117 431366615 432909050 434435387 435417747 436643105 438314323 440461006 442885132
1138D42885132J330490M25835P92503N18417L76473O28662O87599J075401R14421N64080
$$ 442885132 444215622 444641457 445433960 445952377 446328850 446957512 447645111 448720512 449634933 450199013
1147.6D50199013P34443K50664l16505L38974r5520r48677J06735Q35915L98483M5280
$$ 450199013 450933456 451184120 450867615 451206589 451111069 450162392 450269127 451105042 451503525 451548805
1157.3D51548805k04315r08050q30651m89464j006965l77999M23890Q01048J091842
$$ 451548805 451344490 450436440 449605789 449116325 448109360 447731361 448155251 448956299 450048141
1166D50048141R87931J110039J102752J480293J296349J404381J698379J368904K006836
$$ 450048141 451036072 452146111 453248863 454729156 456025505 457429886 459128265 460497169 462504005
1174.6D62504005K288666J987229J778373J582756J543160J158447J091461J483879
$$ 462504005 464792671 466779900 468558273 470141029 471684189 472842636 473934097 475417976
1182.4D75417976R87511N98030R20487J301422J230011M47540O5269Q7243l8300p56760
$$ 475417976 476405487 477003517 477924004 479225426 480455437 480902977 480968246 481055489 481017189 480260429
1192D80260429q75282n38483m40292k17323n29137n75981p21779j156464j242828q45756
$$ 480260429 479385147 478846664 478406372 478189049 477659912 477083931 476362152 475205688 473962860 473117104
1201.6D73117104r61190j770439j300163n45998j50299k70424p41958n02281p16172
$$ 473117104 472155914 470385475 469085312 468539314 468389015 468118591 467376633 466874352 466158180
1210.3D66158180r24377q90503p28264j00441R9564K56157j7662k41280j40762m63257
$$ 466158180 465233803 464343300 463615036 463514595 463614159 463870316 463852654 463611374 463470612 463007355
1220D63007355k60697j93748l34168l28903l66402k98767j63498m1770n11208n55878
$$ 463007355 462746658 462552910 462218742 461889839 461523437 461224670 461061172 461019402 460508194 459952316
1229.6D59952316o40907n83839j25885n24254k83280l60641o44417k81334L1090J26343
$$ 459952316 459311409 458727570 458601685 458077431 457794151 457433510 456789093 456507759 456538849 456665192
1239.3D56665192n81780m94003n58472o16226m6120k12288k22282k2202J31646m79508
$$ 456665192 456083412 455589409 455030937 454414711 454368591 454156303 453934021 453911819 454043465 453563957
1248.9D53563957o08024l45269k84423J53389j42861J50452K98118j9340r3956o8588
$$ 453563957 452955933 452610664 452326241 452479630 452336769 452487221 452785339 452765999 452672043 452603455
1258.5D52603455J87149j73607j85471K76032P06634N88036Q11233R52835L64190O94770
$$ 452603455 452790604 452616997 452431526 452707558 453414192 454002228 454813461 455766296 456130486 456825256
1268.2D56825256P18956L66478J12419N06669J196174J206055J435585R52644Q32482
$$ 456825256 457544212 457910690 458023109 458529778 459725952 460932007 462367592 463320236 464152718
1276.9D64152718J372718J190606Q21304O26068Q37898J074028J312752J497726J454239
$$ 464152718 465525436 466716042 467537346 468163414 469001312 470075340 471388092 472885818 474340057
1285.5D74340057J351853J246719J544609J249275P63932Q51059O93283J053924Q80089
$$ 474340057 475691910 476938629 478483238 479732513 480496445 481347504 482040787 483094711 483974800
1294.2D83974800O67305J144028J170387J068382Q0109l12767K12326N26123N81436
$$ 483974800 484642105 485786133 486956520 488024902 488105011 487792244 488004570 488530693 489112129
1302.9D89112129N01480L44010m3335M93011M91448j28250m54445k97242P1564l94249
$$ 489112129 489613609 489957619 489914284 490407295 490898743 490770493 490316048 490018806 490090370 489696121
1312.5D89696121k41775q736J71471J93023L11432O47927J26304K48795L52630M50898
$$ 489696121 489454346 489445610 489617081 489810104 490121536 490769463 490895767 491144562 491497192 491948090
1322.2D91948090O48689O55174O31485O49147Q16727K58140J27564k47612n69039p10678
$$ 491948090 492596779 493251953 493883438 494532585 495349312 495607452 495735016 495487404 494918365 494207687
1331.8D94207687n70488p9307k78206K12822R5253l0289j05514n58014j4572L395L29818
$$ 494207687 493637199 493557892 493279686 493492508 493587761 493557472 493451958 492893944 492879372 492882767 493212585
1342.4D93212585L59002N70564L07541K74811P66906J41526K11715j5793O5308l50571
$$ 493212585 493571587 494142151 494449692 494724503 495491409 495632935 495844650 495828857 495894165 495543594
1352.1D95543594o22978M3030k37236k4567j20697m0664m56200n69687l69530k46811
$$ 495543594 494920616 494963646 494726410 494701843 494581146 494540482 494084282 493514595 493145065 492898254
1361.7D92898254L97683j274109m37355P4691n53741o51588j031914o19431m95147
$$ 492898254 493295937 492021828 491584473 491659164 491105423 490453835 489421921 488802490 488307343
1370.4D88307343l93868l59802M35676L48664q52242k38457j44691K2736q29735p07703
$$ 488307343 487913475 487553673 487989349 488338013 487485771 487247314 487102623 487125359 486295624 485587921
1380.1D85587921l44696r15871j027908o16417k3689l09219k74163j897049j242447
$$ 485587921 485243225 484327354 483299446 482683029 482659340 482350121 482075958 480178909 478936462
1388.7D78936462j74293j031036j071015j049919k07176j029892k167893n32798o43731
$$ 478936462 478762169 477731133 476660118 475610199 475403023 474373131 472205238 471672440 471028709
1397.4D71028709q92295k728959k054901j100502j446800j147041o34384j147919j836052
$$ 471028709 470136414 467407455 465352554 464252052 462805252 461658211 461023827 459875908 458039856
1406.1D58039856r41544j241874j368637j134835r96856o12831q27370m58145N836
$$ 458039856 457098312 455856438 454487801 453352966 452356110 451743279 450915909 450457764 450463600
1414.8D50463600K47917j99814m38232O00815j942673l39355J315155Q93364J082496
$$ 450463600 450711517 450511703 450073471 450674286 448731613 448392258 449707413 450600777 451683273
1423.4D51683273j82151n9510O40259P66716J123428O56624P7934L8224Q45680P34596
$$ 451683273 451501122 451441612 452081871 452848587 453972015 454628639 454706573 454744797 455590477 456325073
1433.1D56325073Q92563J908608J805992k09236k24495J128273L82080L32527O55441
$$ 456325073 457217636 459126244 460932236 460723000 460498505 461626778 462008858 462341385 462996826
1441.8D62996826O13785R61571L07235M21257O21987N72738k44865R1133O88706N5389
$$ 462996826 463610611 464572182 464879417 465300674 465922661 466495399 466250534 466341667 467030373 467085762
1451.4D67085762M03442N98336J352081J587563P46269L96309P21626R48448j89972
$$ 467085762 467489204 468087540 469439621 471027184 471773453 472169762 472891388 473839836 473649864
1460.1D73649864J450119R10225P51267J944618O61506R63135J305580J823807J333008
$$ 473649864 475099983 476010208 476761475 478706093 479367599 480330734 481636314 483460121 484793129
1468.8D84793129J578941K710877K681618M062767J074295J452026K604866J738701
$$ 484793129 486372070 489082947 491764565 495827332 496901627 498353653 500958519 502697220
1476.5E02697220J652107J830444J530953J798324J768074J387826J376075J311226
$$ 502697220 504349327 506179771 507710724 509509048 511277122 512664948 514041023 515352249
1484.2E15352249J082382J077652O93856N6991J932640Q50563k300529q12073j67999
$$ 515352249 516434631 517512283 518206139 518263130 520195770 521046333 518745804 517933731 517765732
1492.9E17765732m09928q59489j09863m579201j042442n93872l420449j009369j789665
$$ 517765732 517355804 516496315 516386452 511807251 510764809 510170937 506750488 505741119 503951454
1501.6E03951454j896019j404953L85170J80206p712249j967545K818489J154022j375961
$$ 503951454 502055435 500650482 501035652 501215858 493503609 491536064 494354553 495508575 494132614
1510.2D94132614L04833j18447j191368j48086o18630J39313p95174k859878L03421
$$ 494132614 494437447 494319000 493127632 492979546 492360916 492500229 491705055 488845177 489148598
1518.9D89148598J581154M41589j165810K4147R2965J280059m68750L11432R22127
$$ 489148598 490729752 491171341 490005531 490029678 490122643 491402702 490933952 491245384 492167511
1527.6D92167511k24876L25965J005555J871528J623993R13468j642418M50592P65381
$$ 492167511 491942635 492268600 493274155 495145683 496769676 497683144 496040726 496491318 497256699
1536.3D97256699R72557K521515K26516k581787J296196K170983M90341M73480J512985
$$ 497256699 498229256 500750771 500977287 498395500 499691696 501862679 502353020 502826500 504339485
1545E04339485j145668L68996L81164R43833J104774j30844J011047J065636J417046
$$ 504339485 503193817 503562813 503943977 504887810 505992584 505861740 506872787 507938423 509355469
1553.6E09355469j117821N47409K141304K070770L107300m328956m253426p8087P44858
$$ 509355469 508237648 508785057 510926361 512997131 516104431 511775475 507522049 507443962 508188820
1562.3E08188820j12801J74523j500321k053985r45320j251870N67246n230522j925469
$$ 508188820 508076019 508250542 506750221 504696236 503750916 502499046 503066292 497835770 495910301
1571D95910301r82475j924667j584778j584626K34147r390374j433563k009811l137398
$$ 495910301 494927826 493003159 491418381 489833755 490067902 480677528 479243965 477234154 474096756
1579.7D74096756k795563l526230j693191l857117k875633l532562k797280l242378
$$ 474096756 471301193 467774963 466081772 462224655 459349022 455816460 453019180 449776802
1587.4D49776802m185371k321244m599418k605973l904113k752304k949982l623962
$$ 449776802 445591431 443270187 438670769 436064796 432160683 429408379 426458397 422834435
1595.1D22834435k159768m433365k596130m280472k353096k943458k606392j588974
$$ 422834435 420674667 416241302 413645172 409364700 407011604 404068146 401461754 399872780
1602.8C99872780m002037j517868l154526j525726k949677j701622j577301l124390
$$ 399872780 395870743 394352875 391198349 389672623 386722946 385021324 383444023 380319633
1610.5C80319633l89442k367897j01738k134819j17455M57421o051254J008758j575661
$$ 380319633 379930191 377562294 377460556 375325737 375208282 375665703 369614449 370623207 369047546
1619.2C69047546K58789q68263J612091J64337l105812Q34732o56166J893730r61837
$$ 369047546 369306335 368438072 370050163 370214500 367108688 367943420 367287254 369180984 368219147
1627.9C68219147Q9111L66669N97381P13311J4648K536278P11365N01976j497574K630081
$$ 368219147 368308258 368674927 369272308 369985619 370000267 372536545 373247910 373749886 372252312 374882393
1637.5C74882393L29399K20947K021904L48931K540855J91422J926002K446175k64778
$$ 374882393 375211792 375432739 377454643 377803574 380344429 380535851 382461853 384908028 384643250
1646.2C84643250K840042j440583J321602P19643K979431K934532K179985k317314
$$ 384643250 387483292 386042709 387364311 388083954 391063385 393997917 396177902 393860588
1653.9C93860588j189461K843018O81877J553764M64096J536866K237549K156562L261643
$$ 393860588 392671127 395514145 396196022 397749786 398213882 399750748 401988297 404144859 407406502
1662.6D07406502l96004K016144J308365K551117K846679K952614K625694O19240M984970
$$ 407406502 407010498 409026642 410335007 412886124 415732803 418685417 421311111 421930351 426915321
1671.3D26915321J472779K509536L231697L507958K182732K049560L830338K555732
$$ 426915321 428388100 430897636 434129333 437637291 439820023 441869583 445699921 448255653
1679D48255653L965607K582970L899765N346298K983093L202210R41658M900589L963966
$$ 448255653 452221260 454804230 458703995 464050293 467033386 470235596 471177254 476077843 480041809
1687.7D80041809L740196L759995L502579M312324L771057M248810M522934N427818
$$ 480041809 483782005 487542000 491044579 495356903 499127960 503376770 507899704 513327522
1695.4E13327522J374932M041786N156822N455322O846504k709999M955864M248391
$$ 513327522 514702454 518744240 523901062 529356384 536202888 533492889 538448753 542697144
1703.1E42697144L756713K932473L467445K471314J220779L180504K682991K342796
$$ 542697144 546453857 549386330 552853775 555325089 556545868 559726372 562409363 564752159
1710.8E64752159K751389L146896L600082J545105N12734L026848L218269l649826
$$ 564752159 567503548 570650444 574250526 575795631 576308365 579335213 582553482 578903656
1718.5E78903656R32312L009453K568779J977119J461563R69162J043740J244812Q63800
$$ 578903656 579835968 582845421 585414200 587391319 588852882 589822044 590865784 592110596 592974396
1727.2E92974396J302566K289887Q71620P74116L633271M233207R02749m308815J878166
$$ 592974396 594276962 596566849 597438469 598212585 601845856 606079063 606981812 602672997 604551163
1735.9F04551163K806396J502762K823448K029152r06219L357658L881645J891518
$$ 604551163 607357559 608860321 611683769 613712921 612806702 616164360 620046005 621937523
1743.6F21937523P18613K792434K924729J965255K467385J391945L956337K487258
$$ 621937523 622656136 625448570 628373299 630338554 632805939 634197884 638154221 640641479
1751.3F40641479R98383L926697K672653K614212L046036O18896J413880K711715K426148
$$ 640641479 641639862 645566559 648239212 650853424 653899460 654518356 655932236 658643951 661070099
1760F61070099L659363M55627j51977L539276K171936J564178J474228J434631j545257
$$ 661070099 664729462 665185089 665033112 668572388 670744324 672308502 673782730 675217361 673672104
1768.7F73672104J489944M506150J418304q30994j264267L104554K275009n99823J581955
$$ 673672104 675162048 679668198 681086502 680255508 678991241 682095795 684370804 683770981 685352936
1777.4F85352936Q01163J410751P92999m28619P74383J648255K010955m00009q2626
$$ 685352936 686154099 687564850 688357849 687929230 688703613 690351868 692362823 691962814 691880188
1786F91880188J187286O31028P15484K333908J477433J81198p15638m54483L278733
$$ 691880188 693067474 693698502 694413986 696747894 698225327 698406525 697690887 697236404 700515137
1794.7G00515137J457290p69882M25720J690216R96781r11560K150726K52457m5319
$$ 700515137 701972427 701202545 701628265 703318481 704315262 703403702 705554428 705806885 705761566
1803.4G05761566J421814M86374P40662M38232J26495O10047J879730J4496j7471R72671
$$ 705761566 707183380 707669754 708410416 708848648 708975143 709585190 711464920 711479416 711461945 712434616
1813G12434616N05219J017456k5788M69895k40403L28675J117554L21960J092987M501
$$ 712434616 712939835 713957291 713931503 714401398 714160995 714489670 715607224 715929184 717022171 717026672
1822.7G17026672J260224J773071j971207p64465J817932K221222L34320l009186N31235
$$ 717026672 718286896 720059967 718088760 717324295 719142227 721363449 721697769 718688583 719219818
1831.4G19219818K599335M19464M7531L86658M15649L53852p53556P96509J71509M49142
$$ 719219818 721819153 722238617 722286148 722672806 723088455 723442307 722688751 723485260 723656769 724105911
1841G24105911Q65402J563950J753311l891144Q18406J613235M06265p26776l10821
$$ 724105911 724971313 726535263 728288574 724397430 725215836 726829071 727235336 726508560 726197739
1849.7G26197739Q88900J89362Q11768K42843O58493J62430j75781N91888j94397K78473
$$ 726197739 727086639 727276001 728087769 728330612 728989105 729151535 728975754 729567642 729373245 729651718
1859.3G29651718O8970Q24051K19116J59073N28869r9258N84335r6283J184006l79104
$$ 729651718 729720688 730544739 730763855 730922928 731451797 731352539 731936874 731840591 733024597 732645493
1869G32645493j491700P76139O85653O44608P4692Q7127p78198J85471N45959n4092
$$ 732645493 731153793 731929932 732615585 733260193 733334885 733422012 732643814 732829285 733375244 733321152
1878.6G33321152J49307j44959Q54187j10321K19803L14942l07007R3689j40991J452560
$$ 733321152 733470459 733325500 734179687 734069366 734289169 734604111 734297104 734390793 734249802 735702362
1888.3G35702362N31693j666794k99149J041718P29522J52436j47019r93194L10669
$$ 735702362 736234055 734567261 734268112 735309830 736039352 736191788 736044769 735051575 735362244
1896.9G35362244n0660P3700M92402J74789M26178R689L07694k93198J1139R3460J36566
$$ 735362244 735311584 735385284 735877686 736052475 736478653 736488342 736796036 736502838 736513977 736607437 736744003
1907.6G36744003M57688l70636l85666j12610R70383J15051J8997j18103k27661J583862
$$ 736744003 737201691 736831055 736445389 736332779 737303162 737418213 737437210 737319107 737091446 738675308
1917.2G38675308q85772r89228L01590P8430P63169p096n93719k13089M14505O0043
$$ 738675308 737789536 736800308 737101898 737180328 737943497 737936401 737342682 737129593 737544098 737604141
1926.8G37604141K33307m8370k36054K59781J09101M85763k64206O8665k11792o53305
$$ 737604141 737837448 737789078 737553024 737812805 737921906 738407669 738143463 738212128 738000336 737347031
1936.5G37347031j40229k94265R5062k93045R88235Q56171j616974k40631N48935j31531
$$ 737347031 737206802 736912537 737007599 736714554 737702789 738558960 736941986 736701355 737250290 737118759
1946.1G37118759m88510J77002M8523o3324k18353n2567K55280P2708O6376m87290
$$ 737118759 736630249 736807251 736855774 736792450 736574097 736521530 736776810 736849518 736915894 736428604
1955.8G36428604J63803l967k33765j44272l34854J38626l35159J38703J35269L80401
$$ 736428604 736592407 736588440 736354675 736210403 735875549 736014175 735679016 735817719 735952988 736333389
1965.4G36333389N58167l65219k07444j20620P6446l05786Q0109o714j72882K86178
$$ 736333389 736891556 736526337 736318893 736198273 736274719 735968933 736049042 736042328 735869446 736155624
1975.1G36155624j95694J78070J29700L34702l4256m21295k0752N9661J29319m74167
$$ 736155624 735959930 736138000 736267700 736602402 736568146 736146851 736126099 736185760 736315079 735840912
1984.7G35840912M4784K15836K50931q6441m48227N09033L71857m60053r76867O9427
$$ 735840912 735885696 736101532 736352463 736266022 735817795 736326828 736698685 736238632 735261765 735331192
1994.3G35331192p7591m96597j93558j50604P84912J62506J09329k43988m11300J41754
$$ 735331192 735253601 734757004 734563446 734412842 735197754 735360260 735469589 735225601 734814301 734956055
2004G34956055n41458k47879j71509L88107J95694k35291j5869J03455L32260o63757
$$ 734956055 734414597 734166718 733995209 734383316 734579010 734343719 734327850 734431305 734763565 734099808
2013.6G34099808m37012j90430m22516l99704J92719O24695J83945K93655o31867l06854
$$ 734099808 733662796 733472366 733049850 732650146 732842865 733467560 733651505 733945160 733313293 733006439
2023.3G33006439j12457m83017J4954n1117n2948o27137L08381N90896l4561l16772
$$ 733006439 732893982 732410965 732425919 732374802 732321854 731694717 732003098 732593994 732559433 732242661
2032.9G32242661p07627j4343j69907k670k39563l11966K91901L40957M4098n33447
$$ 732242661 731535034 731520691 731350784 731348114 731108551 730796585 731088486 731429443 731473541 730940094
2042.6G30940094j07880j59073P5531k64434l00980J93863l21884r5825p1259N29327
$$ 730940094 730832214 730673141 730748672 730484238 730183258 730377121 730055237 729959412 729888153 730417480
2052.2G30417480J0758j68991J34277o41327n6762l3646J87225k63138l98635J5792
$$ 730417480 730428238 730259247 730393524 729752197 729695435 729661789 729849014 729585876 729187241 729203033
2061.9G29203033r6359N26962j91497l34092m5013J81961Q5983o4163Q4992p18613
$$ 729203033 729106674 729633636 729442139 729108047 729063034 729244995 729330978 729266815 729351807 728633194
2071.5G28633194j67084P0496j04065j35193j07269J89819J55182K16064k82058j13526
$$ 728633194 728466110 728536606 728432541 728297348 728190079 728379898 728535080 728751144 728469086 728355560
2081.1G28355560n36499m57535K41623J62812K29797j0910L36609j33972j25046l25623
$$ 728355560 727819061 727361526 727603149 727765961 727995758 727984848 728321457 728187485 728062439 727736816
2090.8G27736816r61151j03149M9744l77427p29370K47650O83670L76587J80512j70365
$$ 727736816 726775665 726672516 726722260 726344833 725615463 725863113 726546783 726923370 727103882 726933517
2100.4G26933517o3095p19680l75977j23367J87378K11792k50855J83182J17798K65960
$$ 726933517 726870422 726150742 725774765 725651398 725838776 726050568 725799713 725982895 726100693 726366653
2110.1G26366653n96847n79681l15476k46429J95388l97949K42081Q5754L21274L74680
$$ 726366653 725769806 725190125 724874649 724628220 724823608 724425659 724667740 724753494 725074768 725449448
2119.7G25449448Q3694K18506o81152l01743m22440R1401K29797k36359k441j42288
$$ 725449448 725533142 725751648 725070496 724768753 724346313 724437714 724667511 724431152 724428711 724286423
2129.4G24286423L94211j8540K6779l07617m9744N70908m07410k66723L6468N06211
$$ 724286423 724680634 724662094 724688873 724381256 724331512 724902420 724495010 724228287 724264755 724770966
2139G24770966K36435j1368l33252m30527K42996j95389K33307P0343j90429l27225
$$ 724770966 725007401 724996033 724662781 724232254 724475250 724279861 724513168 724583511 724393082 724065857
2148.6G24065857k19193M80500L34625L15704l14941p4310m23432m11072O54221K40402
$$ 724065857 723846664 724327164 724661789 724977493 724662552 724588242 724164810 723753738 724407959 724648361
2158.3G24648361m9820o5002L60565k62756k10038J59760k34375L3264m7073J79901
$$ 724648361 724598541 724533539 724894104 724631348 724421310 724581070 724346695 724379959 724332886 724512787
2167.9G24512787m14505K71301M93240l17459l9062l13034L85666K88925J81427p2556
$$ 724512787 724098282 724369583 724862823 724545364 724506302 724193268 724578934 724867859 725049286 724976730
2177.6G24976730k56881K03704k09274K21176Q1101J9760k84729m9057L79028j38473
$$ 724976730 724719849 724923553 724714279 724935455 725016556 725036316 724751587 724702530 725081558 724943085
2187.2G24943085J13067o3705K10495k89459k42005R92l60565L16391K90298N48859
$$ 724943085 725056152 724992447 725202942 724913483 724671478 724672470 724311905 724628296 724918594 725467453
2196.9G25467453N6152q7280k26059m18472J07803l4256L86582k54288l8910K20566
$$ 725467453 725523605 725436325 725210266 724791794 724899597 724865341 725251923 724997635 724958725 725179291
2206.5G25179291J01928M49219k42004K289r7809j86386l96576P4310M27857o0349
$$ 725179291 725281219 725730438 725488434 725490723 725392914 725206528 724809952 724884262 725312119 725251770
2216.1G25251770O12030K75192R5291k62298k15607O5079l40042k43836l86276K11487
$$ 725251770 725863800 726138992 726234283 725971985 725756378 725821457 725481415 725237579 724851303 725062790
2225.8G25062790J57471K09579M6234k52609q3160r6055O77948j21765l83224j30921
$$ 725062790 725220261 725429840 725476074 725223465 725140305 725044250 725722198 725600433 725217209 725086288
2235.4G25086288l0746K76566n6305K81524j63498k58026l16314M653L61405P5302
$$ 725086288 725055542 725332108 725275803 725557327 725393829 725135803 724819489 724824142 725185547 725260849
2245.1G25260849L08075k18048m03595n03845L45764L85361k70462P6065j59073L55529
$$ 725260849 725568924 725350876 724947281 724443436 724789200 725174561 724904099 724980164 724821091 725176620
2254.7G25176620q2550k31018J9684n4397j36032n12009K86712J10779J06812J09863
$$ 725176620 725094070 724863052 724882736 724828339 724692307 724180298 724467010 724577789 724684601 724794464
2264.4G24794464K01340L03726k71225k9602l53470k6703j40457l86734k37427k1362
$$ 724794464 724995804 725299530 725028305 724998703 724645233 724618530 724478073 724091339 723853912 723832550
2274G23832550J21765l17306L89557J03149J53656j54800l14942K39868n74569j10627
$$ 723832550 723954315 723637009 724026566 724129715 724283371 724128571 723813629 724053497 723478928 723368301
2283.7G23368301k01034L88565L69873o02036l32260k73513N27343l4027J0529k21634
$$ 723368301 723167267 723555832 723925705 723323669 722991409 722717896 723245239 723211212 723221741 723000107
2293.3G23000107n28565L47214J44882P10221J54419J25656J3733n60456j09405l94592
$$ 723000107 722471542 722818756 722963638 723673859 723828278 723953934 723967667 723407211 723297806 722903214
2302.9G22903214J95617M41132O86798K36053L7003L55530k57798j02462o58570l93676
$$ 722903214 723098831 723539963 724226761 724462814 724499817 724855347 724597549 724495087 723836517 723442841
2312.6G23442841j89438j3962K48642M04587R76410m70353l43628M08783L61481L55454
$$ 723442841 723253403 723239441 723488083 723892670 724869080 724398727 724055099 724463882 724825363 725180817
2322.2G25180817k18888j83334Q5068N42526K5024M73404P48062k65350p79495l81394
$$ 725180817 724961929 724778595 724863663 725406189 725431213 725904617 726652679 726387329 725607834 725226440
2331.9G25226440j44119o20117O21185P99027M4021o99157K39944Q62274j587906p32421
$$ 725226440 725082321 724462204 725083389 725882416 725926437 725227280 725467224 726329498 724741592 724009171
2341.5G24009171J150436M66461o91986l38974p14493k115173j599884P90710K502747
$$ 724009171 725159607 725626068 724934082 724595108 723880615 721765442 720165558 720956268 723459015
2350.2G23459015L72009j58462J105499L58658M19082J11161Q07800j02921L44849
$$ 723459015 723831024 723672562 724778061 725136719 725555801 725666962 726474762 726371841 726716690
2358.9G26716690o70776j831436l46909k08588N875l21503J143799o86645q76542k85873
$$ 726716690 726045914 724214478 723867569 723658981 723664856 723343353 724487152 723800507 722923965 722638092
2368.5G22638092j976623q01087q36258o26068p19452m70886q4152k85340j66549q93708
$$ 722638092 720661469 719860382 719024124 718398056 717678604 717207718 717123566 716838226 716671677 715777969
2378.2G15777969r07516j190415q50601k16827k39639k47117m80804l21503k95410
$$ 715777969 714870453 713680038 712829437 712612610 712372971 712125854 711645050 711323547 711028137
2386.8G11028137l48282n66482j90277j07422l77960k9526j16577O0501k31018J48163
$$ 711028137 710679855 710113373 709923096 709815674 709437714 709408188 709291611 709352112 709121094 709269257
2396.5G09269257P1411o64597n8517j48468l43781m59823m5548j29318m45023M5777
$$ 709269257 709340668 708676071 708617554 708469086 708125305 707665482 707619934 707490616 707045593 707091370
2406.1G07091370k03247j51749k62070j9378k59095n91507k81448n29480J2207j28174
$$ 707091370 706888123 706736374 706474304 706454926 706195831 705604324 705322876 704793396 704805603 704677429
2415.8G04677429l99704j06659K9221j84174m72412j75934k38571k06604n89676l53927
$$ 704677429 704277725 704171066 704200287 704016113 703543701 703367767 703129196 702922592 702332916 701978989
2425.4G01978989K92205j8920m83246m11988k28881q88596l30353J9989J30158L06015
$$ 701978989 702271194 702252274 701769028 701357040 701128159 700239563 699909210 699929199 700059357 700365372
2435.1G00365372o30112o46515o22558r6055K26212J80283j32676n29480J4344l84827
$$ 700365372 699735260 699088745 698466187 698370132 698596344 698776627 698643951 698114471 698128815 697743988
2444.7F97743988p6981j23443p96127p74994m70276j95847o00662L6621N5466J14517
$$ 697743988 697667007 697543564 696747437 695972443 695502167 695306320 694705658 694742279 694797745 694912262
2454.3F94912262K6169n19486j07422p93151q32215n62820l63693j9837j2588o4164
$$ 694912262 694938431 694418945 694311523 693518372 692686157 692123337 691759644 691739807 691727219 691663055
2464F91663055J9837O60248l84064r08432n04456l60412l75443j045608n06516R2087
$$ 691663055 691682892 692343140 691959076 691050644 690546188 690185776 689810333 688764725 688258209 688350296
2473.6F88350296K15302l24860l00446k3422o31485n65491r98382n02930J09940k33155
$$ 688350296 688565598 688240738 687940292 687916870 687285385 686719894 685721512 685218582 685328522 685095367
2483.3F85095367j46789j48392j43814m22516m05350n14907o91605n04532j58996p8659
$$ 685095367 684948578 684800186 684656372 684233856 683828506 683313599 682621994 682117462 681958466 681879807
2492.9F81879807j58082j41754p59353m62494j63574l91541n44052m97360j42517o78482
$$ 681879807 681721725 681579971 680820618 680358124 680194550 679803009 679258957 678761597 678619080 677940598
2502.6F77940598l68271j35346l00064p1030m61807m68139j68000M3717m95224q30078
$$ 677940598 677572327 677436981 677136917 677065887 676604080 676135941 675967941 676011658 675516434 674686356
2512.2F74686356m23584j62964k70386o06537l51868j02233j79749o10428n68313m29383
$$ 674686356 674262772 674099808 673829422 673222885 672871017 672768784 672589035 671978607 671410294 670980911
2521.9F70980911l51028j8997k00348L22952J23596n89218n59540q12835r27430l47595
$$ 670980911 670629883 670610886 670410538 670733490 670857086 670267868 669708328 668895493 667968063 667620468
2531.5F67620468L63770p5913l43551m90876n50537j30844j60828l01132o44150o5078
$$ 667620468 667984238 667908325 667564774 667073898 666523361 666392517 666231689 665930557 665286407 665221329
2541.1F65221329K88467j32599n93643r10339m39606j99814o7291o22406o46134r8419
$$ 665221329 665509796 665377197 664783554 663873215 663433609 663233795 663166504 662544098 661897964 661799545
2550.8F61799545j33209R8267j72043k98310j89743r0942m74396p27691n87311p30209
$$ 661799545 661666336 661764603 661592560 661294250 661104507 661013565 660539169 659811478 659224167 658493958
2560.4F58493958j81199R92J9608k18430k45132j93177p39135m80957m83170m03595
$$ 658493958 658312759 658313751 658333359 658114929 657869797 657676620 656937485 656456528 655973358 655569763
2570.1F55569763k24457K137j11618l03574O0120n09491m51126l68958k82516k54441
$$ 655569763 655345306 655347443 655235825 654932251 654992371 654482880 654031754 653662796 653380280 653125839
2579.7F53125839q00018m07257k08435J35116n9967o08444l66363j31379m24881q05740
$$ 653125839 652325821 651918564 651710129 651845245 651785278 651176834 650810471 650679092 650254211 649448471
2589.4F49448471m21143k82669j4419k2659j82572k66571n38483j78680k39258k24457
$$ 649448471 649027328 648744659 648730240 648707581 648525009 648258438 647719955 647541275 647302017 647077560
2599F47077560n73043o05774n7221l04870k08741k8534j17950n53894r33991j077575
$$ 647077560 646504517 645898743 645841522 645536652 645327911 645299377 645181427 644627533 643693542 642615967
2608.6F42615967m51355m4785m08096P7362M5548N0430k14462o08979o51626j193467
$$ 642615967 642164612 642119827 641711731 641789093 641834641 641885071 641670609 641061630 640410004 639216537
2618.3F39216537n48057j37177k71835k94037m77485m57154l2692J56098n51262m27475
$$ 639216537 638668480 638531303 638259468 637965431 637487946 637030792 636998100 637154198 636602936 636175461
2627.9F36175461n38635q86918m82826M4518k6779n43404r4643k06527l82309o50216
$$ 636175461 635636826 634749908 634267082 634311600 634284821 633741417 633646774 633440247 633057938 632407722
2637.6F32407722q88175k08130k04621l08342l72352k6856k7427m26789o85768p25937
$$ 632407722 631519547 631311417 631106796 630798454 630426102 630399246 630371819 629945030 629259262 628533325
2647.2F28533325k98195o93092l57819k23426l71476J11924q7738j22757l47710n41191
$$ 628533325 628235130 627542038 627184219 626960793 626589317 626701241 626613503 626490746 626143036 625601845
2656.9F25601845o49262k54097P0610l87725n80330m51241J53465p9498n35660m24766
$$ 625601845 624952583 624698486 624769096 624381371 623801041 623349800 623503265 623423767 622888107 622463341
2666.5F22463341j36681l29323o91490l61709l84751J90468r3689l22037M76761j55716
$$ 622463341 622326660 621997337 621305847 620944138 620559387 620749855 620656166 620334129 620810890 620655174
2676.1F20655174o43615o97480l13720j41411k47116j55564l66516k04773j86958j35689
$$ 620655174 620011559 619314079 619000359 618858948 618611832 618456268 618089752 617884979 617698021 617562332
2685.8F17562332n16472r51271o29730J55640K4948o40640j9761j08299j80702M9858
$$ 617562332 617045860 616094589 615464859 615620499 615645447 615004807 614985046 614876747 614696045 614745903
2695.4F14745903Q7929Q2969p03544q92830p03392k7504J28365N4245J11083l65791
$$ 614745903 614833832 614916801 614213257 613320427 612617035 612589531 612717896 612772141 612883224 612517433
2705.1F12517433j20849m71993o16569l36762l66173k13928m8103J03492j49192j26381
$$ 612517433 612396584 611924591 611308022 610971260 610605087 610391159 610343056 610446548 610297356 610170975
2714.7F10170975n28565o08978j32294j17645j71394l40729l17612l78570J37291L00216
$$ 610170975 609642410 609033432 608901138 608783493 608612099 608271370 607953758 607575188 607712479 608012695
2724.4F08012695m6386l09678p25212m32090l76740k12211j03455n0774l05k86293
$$ 608012695 607966309 607656631 606931419 606499329 606122589 605910378 605806923 605756149 605755844 605469551
2734F05469551l69110l27911K16026k96898m94423j32446m91219k73742k00577K14004
$$ 605469551 605100441 604772530 604988556 604691658 604197235 604064789 603573570 603299828 603099251 603313255
2743.7F03313255K69699j33400j96113j35803q3542l75595k55051l09982j41297m1389
$$ 603313255 603582954 603449554 603253441 603117638 603034096 602658501 602403450 602093468 601952171 601910782
2753.3F01910782j45607k19269o19240l41186l25432l68500j72119m5395L2959L5896
$$ 601910782 601765175 601545906 600926666 600585480 600260048 599891548 599719429 599674034 599706993 599742889
2762.9E99742889l15780p46193r2583j87950k16064n4055m44069Q583p3928k88849
$$ 599742889 599427109 598680916 598588333 598400383 598184319 598130264 597686195 597694778 597620850 597332001
2772.6E97332001k70691j25008l14445q43125n74493m37508k98233k70805l46451n0735
$$ 597332001 597061310 596936302 596621857 595778732 595204239 594766731 594468498 594197693 593851242 593800507
2782.2E93800507N2147m51851p06864l09486j24283l49388p82204l17802k64740p97730
$$ 593800507 593852654 593400803 592693939 592384453 592260170 591910782 591128578 590810776 590546036 589748306
2791.9E89748306n24826j70593o10n56412m62113k58331p19757m34723m17251p46956
$$ 589748306 589223480 589052887 589052277 588495865 588033752 587775421 587055664 586620941 586203690 585456734
2801.5E85456734m97513k07672n42603n55687p09953m01840J15242n48058m69703o44684
$$ 585456734 584959221 584751549 584208946 583653259 582943306 582541466 582656708 582108650 581638947 580994263
2811.2E80994263p78961p37038q84552n17960o54754k15302k49100l80439n27573j172295
$$ 580994263 580215302 579478264 578593712 578075752 577420998 577205696 576956596 576576157 576048584 574876289
2820.8E74876289p20062m15726n40771r06792m90417l39203j009827n79223l47863
$$ 574876289 574156227 573740501 573199730 572292938 571802521 571463318 570453491 569874268 569526405
2829.5E69526405p70187j037750o07605m84543p55386r19915j009178r08966j237602
$$ 569526405 568756218 567718468 567110863 566626320 565870934 564951019 563941841 563032875 561795273
2838.2E61795273q50296j043778j941642j773415j093025j080017j657067j453972
$$ 561795273 560944977 559901199 557959557 556186142 555093117 554013100 552356033 550902061
2845.9E50902061j953010k278061j849365j696625j122704j051483j274261j258202
$$ 550902061 548949051 546670990 544821625 543125000 542002296 540950813 539676552 538418350
2853.6E38418350m53224J24626J42288P8545k53868n0659k83737j84136O1340R461
$$ 538418350 537965126 538089752 538232040 538310585 538056717 538006058 537722321 537538185 537599525 537608986
2863.2E37608986m10462j030883l44773l70826p69005q88672p66029k34642l99132
$$ 537608986 537198524 536167641 535822868 535452042 534683037 533794365 533028336 532793694 532394562
2871.9E32394562k37656m24995o94428o30493q52585o99310o73828n57709K251j07537
$$ 532394562 532156906 531731911 531037483 530406990 529554405 528855095 528181267 527623558 527625809 527518272
2881.6E27518272q43315r41162n74264l35274q08869j001472n73311q91762j028747
$$ 527518272 526674957 525733795 525159531 524824257 524015388 523013916 522440605 521548843 520520096
2890.2E20520096r20143m09317k72522n51529l19481r22241j042176q12416p86056
$$ 520520096 519599953 519190636 518918114 518366585 518047104 517124863 516082687 515270271 514484215
2898.9E14484215o90460r46465q65059o46477n0697l12767j320763j350593p41348
$$ 514484215 513793755 512847290 511982231 511335754 511285057 510972290 509651527 508300934 507559586
2907.6E07559586o07186j128120j081619j267205j568336j197396q00247p85942j294136
$$ 507559586 506952400 505824280 504742661 503475456 501907120 500709724 499909477 499123535 497829399
2916.3D97829399j715317j908912j413079r75723j361046j149482l20702k022k20375
$$ 497829399 496114082 494205170 492792091 491816368 490455322 489305840 488985138 488983116 488762741
2925D88762741n14145j63421L68957L548J44424J4992k70500O71654P95555N11245
$$ 488762741 488248596 488085175 488454132 488457680 488602104 488617096 488346596 489018250 489813805 490325050
2934.6D90325050L51639M27590L79867L63579J048393O46515M59328P06672N84794
$$ 490325050 490676689 491104279 491484146 491847725 492896118 493542633 494001961 494708633 495293427
2943.3D95293427N16014M20150N92194M58565K87780k0675M02183R89876O23703K13242
$$ 495293427 495809441 496229591 496821785 497280350 497568130 497547455 497949638 498939514 499563217 499776459
2952.9D99776459j05896K92015N24063M07295l46565n42336O58799O35261N55458N72586
$$ 499776459 499670563 499962578 500486641 500893936 500547371 500005035 500663834 501299095 501854553 502427139
2962.6E02427139M32015M60510M1733M84695Q37937N09109P30629R97086P57866P78389
$$ 502427139 502859154 503319664 503361397 503846092 504684029 505193138 505923767 506920853 507678719 508457108
2972.2E08457108O46781N23110P03926M86450N76172L99666K86331L91617K30675N92613
$$ 508457108 509103889 509626999 510330925 510817375 511393547 511793213 512079544 512471161 512701836 513294449
2981.8E13294449N63316K31781K49748K02370j07803J47171P19185N96161L45993N9852
$$ 513294449 513857765 514089546 514339294 514541664 514433861 514581032 515300217 515896378 516242371 516302223
2991.5E16302223q9569l10364k51655J96914M0093j55716j49765k75192j52397N2185
$$ 516302223 516212654 515902290 515650635 515847549 515887642 515731926 515582161 515306969 515154572 515206757
3001.1E15206757l77961m44831j86882l85705n07392n48706k49215k03552k95105k28042
$$ 515206757 514828796 514383965 514197083 513811378 513303986 512755280 512506065 512302513 512007408 511779366
3010.8E11779366k69967l82385n33180n25856q00171m99687l99513l46108N5122o23283
$$ 511779366 511509399 511127014 510593834 510067978 509267807 508768120 508368607 508022499 508077621 507454338
3020.4E07454338r02023n38941k09884l41606n12925o99081q76122j69181k71378o33392
$$ 507454338 506552315 506013374 505803490 505461884 504948959 504249878 503373756 503204575 502933197 502299805
3030.1E02299805q25234r27658o01883m51774m97094q03299m16603o98356p77626k50740
$$ 502299805 501474571 500546913 499945030 499493256 498996162 498192863 497776260 497077904 496300278 496049538
3039.7D96049538p43142p83920p13234p31926q47168p64084p29904p23533k79732n73387
$$ 496049538 495306396 494522476 493809242 493077316 492230148 491466064 490736160 490012627 489732895 489159508
3049.4D89159508o73905o82106p34443q93784q46863m57725o24733o01998p58514l64189
$$ 489159508 488485603 487803497 487069054 486175270 485328407 484870682 484245949 483643951 482885437 482521248
3059D82521248l48702j056404j214218p21474R8000n68352n49164l08876r21211p29713
$$ 482521248 482172546 481116142 479901924 479180450 479278450 478710098 478160934 477852058 476930847 476201134
3068.6D76201134o44875o00548o73523k24342j87836m58412m88777p83043m39186n23758
$$ 476201134 475556259 474955711 474282188 474057846 473870010 473411598 472922821 472139778 471700592 471176834
3078.3D71176834k67677j58806o31714r85145j171990l75938j06278k06337n68123
$$ 471176834 470909157 470750351 470118637 469133492 467961502 467585564 467479286 467272949 466704826
3087D66704826p38144k92396j90163n75371j168174p29294m02565n9967K4223p45735
$$ 466704826 465966682 465674286 465484123 464908752 463740578 463011284 462608719 462548752 462572975 461827240
3096.6D61827240o55594n66330p87544r19914l62587k81639q34885l09982j14289p44590
$$ 461827240 461171646 460605316 459817772 458897858 458535271 458253632 457418747 457108765 456994476 456249886
3106.2D56249886j150666n94864l65944o10351l67699k60544l19900p46994p46002
$$ 456249886 455099220 454504356 454138412 453528061 453160362 452899818 452579918 451832924 451086922
3114.9D51086922m40102m47807n10025n94139r41277r87244j94473n06744p50542k90794
$$ 451086922 450646820 450199013 449688988 449094849 448153572 447166328 446971855 446465111 445714569 445423775
3124.6D45423775o01578p56645q58994m13093j35422p75910q49380m58145r18503j238098
$$ 445423775 444822197 444065552 443206558 442793465 442658043 441882133 441032753 440574608 439656105 438418007
3134.2D38418007l07732j45683p63855r26781n40199l79448p63550l80821k34566r40628
$$ 438418007 438110275 437964592 437200737 436273956 435733757 435354309 434590759 434209938 433975372 433034744
3143.9D33034744j094742o83708o63490o61888l48396n87883q23288o87294l05558
$$ 433034744 431940002 431256294 430592804 429930916 429582520 428994637 428171349 427484055 427178497
3152.5D27178497k45628j009789j229133q75130p53288n47791m45594l93982m92058
$$ 427178497 426932869 425923080 424693947 423818817 423065529 422517738 422072144 421678162 421186104
3161.2D21186104r35593n14946j49650p54471j050186q60329m68597o21033p61719
$$ 421186104 420250511 419735565 419585915 418831444 417781258 416920929 416452332 415831299 415069580
3169.9D15069580n98221n84373m75121n83839n20668p54471r10034p07703p49283o93512
$$ 415069580 414471359 413886986 413411865 412828026 412307358 411552887 410642853 409935150 409185867 408492355
3179.5D08492355p07092o56662p09915k60696l12195j047821q25272p01179m75312
$$ 408492355 407785263 407128601 406418686 406157990 405845795 404797974 403972702 403271523 402796211
3188.2D02796211n95283q75168l90244k18925l79830q93135j012306p51762r17359
$$ 402796211 402200928 401325760 400935516 400716591 400336761 399443626 398431320 397679558 396762199
3196.9C96762199q49685o48804n19562M6501O9580n90171o35796n07355m73709r42192
$$ 396762199 395912514 395263710 394744148 394790649 394860229 394270058 393634262 393126907 392653198 391711006
3206.5C91711006j066665n24064p95822n79147k49786n44396l73230j28364l80898
$$ 391711006 390644341 390120277 389324455 388745308 388495522 387951126 387577896 387449532 387068634
3215.2C87068634m04930k89764p43294o42929m02603m40712r78852j211395j94511
$$ 387068634 386663704 386373940 385630646 384987717 384585114 384144402 383165550 381954155 381759644
3223.9C81759644m23089q85276q19130q74558k44980J69373l2806l37716o59599j195488
$$ 381759644 381336555 380451279 379632149 378757591 378512611 378681984 378649178 378311462 377651863 376456375
3233.5C76456375m58069J4115n16777o96564j038399l39813m11072o87713j68038k81372
$$ 376456375 375998306 376012421 375495644 374799080 373760681 373420868 373009796 372322083 372154045 371872673
3243.2C71872673r1209n63889l15437j34087j076393r45511k41356o3095n78270k67792
$$ 371872673 371781464 371217575 370902138 370768051 369691658 368746147 368504791 368441696 367863426 367595634
3252.8C67595634k63404p61986m62074n98412n77393k95486k00806n64918p65686m11797
$$ 367595634 367332230 366570244 366108170 365509758 364932365 364636879 364436073 363871155 363105469 362693672
3262.5C62693672l35617j90468j94816o73294p70226j70936j8616p019l14141n31501
$$ 362693672 362358055 362167587 361972771 361299477 360529251 360358315 360339699 360332680 360018539 359487038
3272.1C59487038K45781k60926p57255k97051n68390p57255n46303o50635p86934j00631
$$ 359487038 359732819 359471893 358714638 358417587 357849197 357091942 356545639 355895004 355108070 355007439
3281.8C55007439p325l03230m5471k08130l69148l90473l68194k65999j35880l51600
$$ 355007439 355000114 354696884 354651413 354443283 354074135 353683662 353315468 353049469 352913589 352561989
3291.4C52561989k99568J23214m04548n72548l24478o18325n34744k14729M3831M42085
$$ 352561989 352262421 352385635 351981087 351408539 351084061 350465736 349930992 349716263 349760094 350202179
3301C50202179k27051j016044l01743n0011k91214n05027n62096l44467r74121q46100
$$ 350202179 349975128 348959084 348657341 348607330 348316116 347811089 347248993 346904526 345930405 345084305
3310.7C45084305k53525l84674l28941k52571k34528j80016m02755n05524m04968p83387
$$ 345084305 344830780 344446106 344117165 343864594 343630066 343450050 343047295 342541771 342136803 341353416
3320.3C41353416o67343k77710j75132l205l91693o32019k98500J31607p87964j302109
$$ 341353416 340686073 340408363 340233231 340230026 339838333 339206314 338907814 339039421 338251457 336949348
3330C36949348m73480r67750n33867J30615m68864l42408k95524m66271o57806r27696
$$ 336949348 336475868 335508118 334974251 335104866 334636002 334293594 333998070 333531799 332873993 331946297
3339.6C31946297n64270N9089m94995q32062n54275p10106j10626j96228n25551m74129
$$ 331946297 331382027 331441116 330946121 330114059 329559784 328849678 328739052 328542824 328017273 327543144
3349.3C27543144n60722k18315k82669j61743p51725j198044l80554r4642k54021l22685
$$ 327543144 326982422 326764107 326481438 326319695 325567970 324369926 323989372 323894730 323640709 323318024
3358.9C23318024k92015q39386o80352j39732l89938k86599k71835j00326l66173q38051
$$ 323318024 323026009 322186623 321506271 321366539 320976601 320690002 320418167 320317841 319951668 319113617
3368.6C19113617n37758j12171q8749m32282j47323l30525o11038j75094k58694l25832
$$ 319113617 318575859 318463688 318374939 317942657 317795334 317464809 316853771 316678677 316419983 316094151
3378.2C16094151k51904k24915l40271k25505m5739m68177m66214l42273j86634L85513
$$ 316094151 315842247 315617332 315277061 315051556 315005817 314537640 314071426 313729153 313542519 313928032
3387.8C13928032K52991j08490r7294k23599m06799m94099N3692K17381o63433o31848
$$ 313928032 314181023 314072533 313975239 313751640 313344841 312850742 312904434 313121815 312458382 311826534
3397.5C11826534K62375P1373q52871m57115P88097M86412n30395k74811K14539m26426
$$ 311826534 312088909 312160282 311307411 310850296 311638393 312124805 311594410 311319599 311534138 311107712
3407.1C11107712m08306L29475J22070j05743l2101m32338j67065O04362k4681j8787
$$ 311107712 310699406 311028881 311150951 311045208 311013107 310580769 310413704 311018066 310993385 310974598
3416.8C10974598K89516J6137J024169O84376o27308p51362k07347K16732l9883L04737
$$ 310974598 311264114 311280251 312304420 312988796 312361488 311610126 311402779 311619511 311579628 311884365
3426.4C11884365R1572j26171K75173N37052N31330k37026j46675P14397R57680j16920
$$ 311884365 311975937 311849766 312124939 312661991 313193321 312956295 312809620 313524017 314481697 314364777
3436.1C14364777j31569P59010n6400l65696M13990R27639R6588J07727R07555O82106
$$ 314364777 314233208 314992218 314935818 314570122 314984112 315911751 316008339 316116066 317023621 317705727
3445.7C17705727N05714j23863P27444O83212k9412N03445N45502R46579N56564K00768
$$ 317705727 318211441 318087578 318815022 319498234 319468822 319972267 320517769 321464348 322020912 322221680
3455.3C22221680K17933P18422J219902M78058N34706J41716M18587P36733M39262
$$ 322221680 322439613 323158035 324377937 324855995 325390701 325532417 325951004 326687737 327126999
3464C27126999Q21724P19833J058159O58875N29632J57547n2872R17321M37317R04274
$$ 327126999 327948723 328668556 329726715 330385590 330915222 331072769 331019897 331937218 332374535 333278809
3473.7C33278809J218261N17159O29654L92875K80724Q03223J197548P87353P57675
$$ 333278809 334497070 335014229 335643883 336036758 336317482 337120705 338318253 339105606 339863281
3482.3C39863281J007424J047172O24123J60522O71387Q09402P30858P14073Q77457
$$ 339863281 340870705 341917877 342542000 342702522 343373909 344183311 344914169 345628242 346505699
3491C46505699J069870R38111N69648Q11615J187363r5100K59132J442070J168480
$$ 346505699 347575569 348513680 349083328 349894943 351082306 350987206 351246338 352688408 353856888
3499.7C53856888P77130R46846J503677N22919L44734J049309P71141Q01773J431542
$$ 353856888 354634018 355580864 357084541 357607460 357952194 359001503 359772644 360574417 362005959
3508.4C62005959J449203M63142P45392P76635Q20426R83620Q64830J310196Q97751
$$ 362005959 363455162 363918304 364663696 365440331 366260757 367244377 368109207 369419403 370317154
3517.1C70317154Q90045R88503O55860J266175J996689J128959l36952Q13179J924858
$$ 370317154 371207199 372195702 372851562 374117737 376114426 377243385 376906433 377719612 379644470
3525.7C79644470J292458K53372R38148J217652J177711J182061N92002J325684J059494
$$ 379644470 380936928 381190300 382128448 383346100 384523811 385705872 386297874 387623558 388683052
3534.4C88683052J777916J442490k30713J484298J513634J217880O36025O92215J589813
$$ 388683052 390460968 391903458 391672745 393157043 394670677 395888557 396524582 397216797 398806610
3543.1C98806610J839638J889000L73192J139335M92897J287003K234001J790962K049141
$$ 398806610 400646248 402535248 402908440 404047775 404540672 405827675 408061676 409852638 411901779
3551.8D11901779o72493J430245J786193O51474J875763J136513J946182J537819J429901
$$ 411901779 411229286 412659531 414445724 415097198 416972961 418109474 420055656 421593475 423023376
3560.5D23023376P61605J303711J827850Q67653N004578K744102p94144O93245r89074
$$ 423023376 423784981 425088692 426916542 427784195 432788773 435532875 434738731 435431976 434442902
3569.1D34442902K444191J889343J614456K076836K031860J292152Q45643J886787
$$ 434442902 436887093 438776436 440390892 442467728 444499588 445791740 446637383 448524170
3576.9D48524170J174660K856598K441635R14993J280937J763077K613029J555787
$$ 448524170 449698830 452555428 454997063 455912056 457192993 458956070 461569099 463124886
3584.6D63124886L583641J833114j109581K070198m51240K636757L023338K598877
$$ 463124886 466708527 468541641 467432060 469502258 469051018 471687775 474711113 477309990
3592.3D77309990K421265J894683L346215n17159J714211L368263J341400K661095
$$ 477309990 479731255 481625938 484972153 484454994 486169205 489537468 490878868 493539963
3600D93539963R89914J394462J902046J145211K243118L865318L867264l35502K971076
$$ 493539963 494529877 495924339 497826385 498971596 501214714 505080032 508947296 508611794 511582870
3608.7E11582870N10293j080094O890984L188972j275101L545762L28216L747368M628906
$$ 511582870 512093163 511013069 517904053 521093025 519817924 523363686 523691902 527439270 532068176
3617.4E32068176P37419J639100k97394J132927L275489K761116K527352L082237K757530
$$ 532068176 532805595 534444695 534147301 535280228 538555717 541316833 543844185 546926422 549683952
3626E49683952K523117N998841K161674o948051L163605M276161N614128K417984j484490
$$ 549683952 552207069 558205910 560367584 553419533 556583138 560859299 566473427 568891411 567406921
3634.7E67406921J940155L400078L101425J407242K150078L058167L289947K177048
$$ 567406921 569347076 572747154 575848579 577255821 579405899 582464066 585754013 587931061
3642.4E87931061J04484J520501M011955P476692J778526k433510O137238l14140k740631
$$ 587931061 588035545 589556046 593568001 601044693 602823219 600389709 606526947 606212807 603472176
3651.1F03472176l81928M717445M185906M261475O538276n769119J170044M942131
$$ 603472176 603090248 607807693 611993599 616255074 622793350 617024231 618194275 623136406
3658.8F23136406J216125J789322J175881K421074J567154J917381K063522J616974
$$ 623136406 624352531 626141853 627317734 629738808 631305962 633223343 635286865 636903839
3666.5F36903839N579605L411865l14941n69611o129188K501869P687988R623642L184433
$$ 636903839 642483444 645895309 645580368 645010757 638881569 641383438 649071426 658695068 661879501
3675.2F61879501j5530777N79682O270218L973922k785492j97296K931366K369080
$$ 661879501 646348724 646928406 653198624 657172546 654387054 654189758 657121124 659490204
3682.9F59490204J721649J44577P85599M956894P481460o881714m051513P622299n385666
$$ 659490204 661211853 661356430 662142029 667098923 674580383 667698669 663647156 671269455 665883789
3691.6F65883789o50024M871826J79596J240692M56772m53568J228867R05762K738037
$$ 665883789 665233765 670105591 670285187 671525879 671982651 671529083 672757950 673663712 676401749
3700.3F76401749L307647m132843k935257M200669K073059j8845K97394K540359M419632
$$ 676401749 679709396 675576553 672641296 676841965 678915024 678896179 679193573 681733932 686153564
3709F86153564n928726L870697O207962j4181060K480011M375228K74582M48075K763290
$$ 686153564 680224838 684095535 690303497 676122437 678602448 682977676 683252258 683700333 686463623
3717.7F86463623J810989m274520O76345O100998k603149m769058M686126J944046
$$ 686463623 688274612 684000092 684676437 690777435 688174286 683405228 688091354 690035400
3725.4F90035400j77841k678375q47855K825699Q94089O469955k48413q353500Q136139
$$ 690035400 689857559 687179184 686331329 689157028 690051117 696521072 696272659 687919159 696055298
3734F96055298K709350q671341j104278J646957l28827J989212L474579m061508L083267
$$ 696055298 698764648 690093307 688989029 690635986 690307159 692296371 695770950 691709442 694792709
3742.7F94792709J3273011m738541k0390320O946030N968933O901321n82657j0809249
$$ 694792709 708065720 703327179 682936859 689882889 695851822 702753143 702170486 691361237
3750.4F91361237R262390m630432q423691N098190L838959L352356m766464J606903
$$ 691361237 700623627 695993195 687569504 692667694 696506653 699859009 695092545 696699448
3758.2F96699448P055511p356186l572235L649445R96933J16272L833007j454238n911866
$$ 696699448 703754959 696398773 692826538 696475983 697472916 697589188 701422195 699967957 694056091
3766.8F94056091K301483O496811K632523r296646M6005K443237L0137P76519k12173
$$ 694056091 696357574 702854385 705486908 696190262 696236267 698679504 698709641 699486160 699273987
3775.5F99273987M60281J54648L252792J316758p140046J450196J877517J288529K465973
$$ 699273987 699734268 699888916 703141708 704458466 697318420 698768616 700646133 701934662 704400635
3784.2G04400635l002167k009659P29370O17981N44968J78223N23529j87607j07193
$$ 704400635 701398468 699388809 700118179 700736160 701281128 701459351 701982880 701795273 701688080
3792.9G01688080k89002J118622L520584k136841l941116Q18253L062515O105728m210586
$$ 701688080 701399078 702517700 706038284 703901443 699960327 700778580 703841095 709946823 705736237
3801.5G05736237r398117K620468J921997M499206N888748p673416n019760L366242
$$ 705736237 696338120 698958588 700880585 705379791 711268539 703595123 698575363 701941605
3809.3G01941605J624450O9123O713k80227J355285O186371P64313j4230804L173065
$$ 701941605 703566055 703635178 703641891 703361664 704716949 710903320 711667633 697436829 700609894
3817.9G00609894N630951N222854M358673j6441192j003494M255981J804657K189102
$$ 700609894 706240845 711463699 715822372 699381180 698377686 702633667 704438324 706627426
3825.7G06627426o70700l600693O77796J409378K641754K404633p693024K129059Q055877
$$ 706627426 705956726 702356033 703033829 704443207 707084961 709489594 701796570 703925629 711981506
3834.3G11981506n613632j885986Q098678o458129l622818P825241o201630j918488
$$ 711981506 706367874 704481888 712580566 706122437 702499619 710324860 704123230 702204742
3842.1G02204742O783600k319641n063095J677017J279908M89273K018508k7618K487335
$$ 702204742 708988342 706668701 701605606 703282623 704562531 705051804 707070312 707042694 709530029
3850.7G09530029P338410l659821J505509j3821793l968277R240570n82123k444534
$$ 709530029 716868439 713208618 714714127 700892334 696924057 706164627 705582504 703137970
3858.4G03137970J741714J985856L203506n210342r39026P108612m219132o133041
$$ 703137970 704879684 706865540 710069046 704858704 703919678 711028290 706809158 700676117
3866.2G00676117K684250M894562O672744n498275j0442429J554413O219559M916763
$$ 700676117 703360367 708254929 714927673 709429398 698986969 700541382 706760941 711677704
3873.9G11677704j0504608o58799M041901K48413K199555M613647l593292p232819
$$ 711677704 701173096 700514297 704556198 704804611 707004166 711617813 708024521 700791702
3881.6G00791702M753113J034622K48337M885025j0631256k97012L329696Q86689N013504
$$ 700791702 705544815 706579437 706827774 711712799 701081543 700784531 704114227 705000916 710014420
3890.3G10014420Q16574q374710M68216L145065j590653N61600J709976K920533J424407
$$ 710014420 710830994 702456284 702924500 706069565 704478912 705040512 706750488 709671021 711095428
3898.9G11095428r751052N510254M219894n821915L076020k983780k053223l92456
$$ 711095428 701344376 706854630 711074524 705252609 708328629 705344849 703291626 702899170
3906.7G02899170p782J603241m87900N44357r6664j06735P39898K08283J483841J881027
$$ 702899170 702891388 704494629 704006729 704551086 704454422 704347687 705087585 705295868 706779709 708660736
3916.3G08660736l355942l879242M082795J627044l610992J283188J711120J171265
$$ 708660736 705304794 701425552 705508347 707135391 703524399 704807587 706518707 707689972
3924G07689972j355438l138657N70145R11026R83886p91549k61231K555008k132263
$$ 707689972 706334534 703195877 703766022 704677048 705660934 704869385 704608154 707163162 705030899
3932.7G05030899j894073J028213l53775j62582K17437M04511O256n75333J631699
$$ 705030899 703136826 704165039 703811264 703648682 703866119 704270630 704276886 703701553 705333252
3941.4G05333252K110596l049698j716004N06440O61087K145538j252747M8600M45709
$$ 705333252 707443848 704394150 702678146 703184586 703845673 705991211 704738464 704787064 705232773
3950.1G05232773k900696J084671P13806l60565J14517n646L40043q52280K29187l41034
$$ 705232773 702332077 703416748 704130554 703769989 703884506 703878860 704218903 703366623 703595810 703254776
3959.7G03254776J93405O93283r84802O20346J13754p49588j01547M87442J035919
$$ 703254776 703448181 704141464 703156662 703777008 703890762 703141174 703039627 703527069 704562988
3968.4G04562988M2801n19714K98157K89993p81937k00043R81064M58908r67941n81131
$$ 704562988 704605789 704086075 704384232 704674225 703892288 703692245 704673309 705132217 704164276 703583145
3978G03583145J57929j19400L20358K99682J65787q16116j174851J45874M79737k0218
$$ 703583145 703741074 703621674 703942032 704241714 704407501 703591385 702416534 702562408 703042145 703021927
3987.7G03021927M501J045304R8953l50952K78854j76468L39890n17044m97895M86832
$$ 703021927 703026428 704071732 704170685 703819733 704098587 703922119 704262009 703744965 703247070 703733902
3997.3G03733902Q6975N22995R27124
$$ 703733902 703820877 704343872 705270996
4000.2G05270996
$$ 705270996
##END=$$ End of the data block
