##TITLE=$$ Begin of the data block
##JCAMP-DX=5.00 $$ ACD/SpecManager v 10.08
##SPECTROMETER/DATA SYSTEM=Varian
##DATE=08 Jan 2013 16:09:46
##DATA TYPE=INFRARED SPECTRUM
##DATA CLASS=XYDATA
##ORIGIN=
##OWNER=
##NPOINTS=3735
##FIRSTX=399.26403809
##LASTX=4000.35498047
##MAXX=4000.35498047
##MINX=399.26403809
##MAXY=75.18167114
##MINY=30.60967445
##XFACTOR=1.0000000000
##YFACTOR=0.000000100000000
##FIRSTY=50.48725891
##DELTAX=0.96440572
##XUNITS=1/CM
##YUNITS=TRANSMITTANCE
##XYDATA=(X++(Y..Y))
399.3 504872589 506850319 500886192 499060211 503267174 505515442 509921341 516023636 513684387
407 513684387 509035339 510052185 511075401 509472237 507493324 503707428 498975601 498704300 499686012
415.7 499686012 502283783 502438660 497063370 509956665 508840408 502286186 499946175 502965889
423.4 502965889 503810730 498711586 498354950 500688324 502780800 507491989 508539429 504854507 503131447
432.1 503131447 503349915 502131119 501993332 503754234 502537842 502474518 506954346 505785332 501520538
440.7 501520538 501574669 502078438 502942390 500602379 499474831 500703773 503007698 505958176 501280441
449.4 501280441 499528999 503950081 505401459 503737602 499777718 502326164 507204132 502058334
457.1 502058334 493707428 498707123 498869171 497268639 501944046 500570183 499080048 502073135 500974808
465.8 500974808 497258644 493453560 495050278 495096474 491856499 490288506 487243652 492262955 496835747
474.5 496835747 495755005 497447891 497280655 492787056 490908585 489593315 489078941 489832153 490986443
483.2 490986443 492847633 492477036 490852737 490444603 489970627 486714745 485283241 486028137 487429962
491.8 487429962 489711418 487883530 487366638 489557114 490008736 488531189 485845146 486314087 488024445
500.5 488024445 489934006 490517006 486143494 483147087 484105225 486417542 486645889 486173820 483816338
509.2 483816338 481669426 481727638 480163040 480647469 481521339 480722198 479401283 476544456 477253761
517.9 477253761 478963928 477532997 476910820 477815285 476981506 475915718 476764946 477228203 477239456
526.6 477239456 477367706 476441650 474754906 474716454 475239258 474520149 474854126 475289726 476275063 476729813
536.2 476729813 474614410 474370003 473970184 473536644 473919830 472075882 472269363 472680473 471070023
544.9 471070023 470329857 469148903 468024101 467361107 468374901 469478035 467494469 466374435 467345390
553.6 467345390 468197937 468796997 468008194 466026993 465231934 465172615 465536613 465475044 464759102 465286484
563.2 465286484 464932480 464563484 465394821 465438652 465146408 466159515 468323402 467799339 465402336
571.9 465402336 464449654 463970757 463079147 462947388 464905281 465628586 464330330 464183388 465351067
580.6 465351067 464955711 464180908 464688072 464331474 463258286 463629799 465208092 466072769 466888657
589.3 466888657 467780952 467917824 468303566 467153778 465890884 465988846 466608200 468147507 469311829
597.9 469311829 470104828 470289230 468927269 467531662 467308769 467592926 467086792 466673431 466288528
606.6 466288528 464999466 464238167 464919701 465843697 466379585 465389290 463446655 463342934 463306503 462971535
616.3 462971535 462589607 461600380 463513107 466184616 466022034 465605927 466348572 466803131 466992111
624.9 466992111 466849594 467845306 470121765 470491600 470572395 472777443 475594521 476840515 477493553
633.6 477493553 479347725 480569801 480541687 480021820 479965210 481114922 483132515 485400467 486644897
642.3 486644897 487917557 489750633 490749321 491368408 491781998 491780396 492409706 493250580 494036980 494350166
651.9 494350166 494539795 496144028 496786041 496247444 496185303 494854279 494188614 495777855 495334702
660.6 495334702 493828888 493996773 494170685 494515419 495487099 496504021 494827919 486963043 492809982
669.3 492809982 495912209 496366005 496967583 497526703 498236313 499482117 501274986 503015404 504288712
678 504288712 504391136 503297348 503030663 504476166 506969948 509032402 510839386 512669373 513290558
686.7 513290558 513211136 513365822 513869438 514183769 513780708 514429207 516136398 516890106 517787666 518755341
696.3 518755341 518994370 519409828 519602623 519513359 519807129 520396500 520461655 520934067 522329636 523511848
705.9 523511848 524301491 525182152 526404877 526577072 526783333 527328644 526984558 527381058 528819656
714.6 528819656 530602264 531216545 531981544 533356056 533556900 533809547 533168068 532357597 532605171
723.3 532605171 533632317 534823341 535559921 536616821 537420959 538716507 539807053 540069351 541151390
732 541151390 542245712 542776871 543592300 544744797 544960747 544868736 545461693 546315346 546152267 545664520
741.6 545664520 546875000 547622643 547400970 547946854 549056129 549466553 549822960 551130981 551750870
750.3 551750870 551566696 551166382 551591721 552873459 554224701 555002518 555235634 556404343 557995529
759 557995529 559878464 560253220 560121117 561333351 561411324 561356964 561817131 563117752 564498940 565117683
768.6 565117683 565660286 565284348 564834404 564682846 564681587 564630508 565010452 565322037 565366669 565690269
778.3 565690269 565246010 565445709 566433678 567772903 568065796 566505432 565722809 566067505 566924057
787 566924057 568016701 569506950 570442467 570741920 570664139 569886208 569140358 567997093 567429047 567168274
796.6 567168274 567193298 567842636 568196793 568223267 568173103 567859497 566415329 565417519 563928375 562266121
806.2 562266121 561418152 559452057 558285027 558286133 558303261 557561493 556263199 554389648 551989784
814.9 551989784 550634499 549369507 548533249 548599777 549606285 551005135 551760941 552693291 554079933
823.6 554079933 555917778 557325935 558886528 560482025 562034149 564433441 567601585 571471443
831.3 571471443 573749580 575608978 577776756 580179749 582326698 582874565 583705559 583923073 585308380
840 585308380 587466354 588791618 591182556 594192848 596196938 596364670 597250328 597667999 598105087
848.7 598105087 599075470 599156532 600079727 601041107 603013115 605574341 607498322 608113518 608452339
857.4 608452339 609093437 609089699 610298080 610896072 611574402 612681770 613938904 615188179 615134048 615238914
867 615238914 614584961 613934250 612129211 609903297 608061066 605873718 605128632 605115700 605955048 605522728
876.7 605522728 605120659 605561409 605122757 604887199 603852730 603134575 602505875 601712456 601093063 600776863
886.3 600776863 600595093 600227432 600143585 599718590 599666023 598598824 597821083 597433777 597125053 597886810
895.9 597886810 597600594 598195763 598194313 597285004 596725006 595885963 595340538 594729805 595307655 596116600
905.6 596116600 597811508 599424782 600353851 601748543 602969208 604776993 604958954 604602928 603666039
914.3 603666039 602620926 602265472 600447159 598501396 596681557 595869217 594006996 591867218 590422630
922.9 590422630 587139435 584108505 581680412 579866676 577958183 575241776 571706924 568770332
930.7 568770332 567408104 565591545 564197769 563158302 561823578 560357437 559889641 559950371 558756065
939.3 558756065 557746239 556622238 555634346 555063362 554589996 553771667 552832527 552409592 551581841
948 551581841 551732025 551777115 551735001 552308388 552041893 551442451 550460548 549640160 547748032 545598717
957.7 545598717 544453125 543260956 541913147 539492302 536885796 534901657 533538704 532061005
965.4 532061005 530386543 528751945 526945496 525931625 524621658 522959976 520992088 518394127
973.1 518394127 515803566 513124199 510422668 506949043 503293724 500036278 496944771 493873901
980.8 493873901 490278931 486215248 481691895 477407608 473633995 469953575 465930786 461007118
988.5 461007118 456805267 453913383 451028824 447714996 444008636 441292763 439062233 436856422
996.2 436856422 434804192 432186089 429523773 426792755 424596863 422660027 420845871 418963203
1004 418963203 417174988 415751305 413555756 412018166 410664330 409267464 407410889 404569168 402713928
1012.6 402713928 401710243 400994492 399063683 396613655 394243660 392527618 391356316 388571358
1020.3 388571358 385893555 383851433 382819214 381603432 379766998 378143349 376196709 374610329
1028.1 374610329 373158379 373259583 372472305 370561180 369498749 368952484 369264145 369374809 370557785
1036.7 370557785 371671753 373013535 374608307 375982361 376954613 377584648 379947052 380259209 379463005
1045.4 379463005 379187469 378782349 378330612 377020531 375864792 374100151 373605766 372148018 369866982
1054.1 369866982 368912506 367643394 366716843 365028076 365666122 367644615 368611984 369830742 371933022
1062.8 371933022 374022408 375041313 376919174 378521652 380781212 382637787 384857674 387580719
1070.5 387580719 388591309 389666214 389707527 390370445 390740433 391342583 392023430 391556587 392036400
1079.2 392036400 391597977 392828751 394192886 395320168 397210655 397567825 397507973 397350311 399078255
1087.9 399078255 400855827 402132416 402899437 403653488 405653000 407037086 408427391 409403305 411255760
1096.5 411255760 412318611 412512360 413351974 413754387 414969254 415920258 417416458 418904953 420475998
1105.2 420475998 422202797 423331261 424332771 423914299 423860970 424218178 424906616 425237198 425695381
1113.9 425695381 427567902 428829002 429456100 429516335 430141830 429601173 428774681 429472160 430209465
1122.6 430209465 431069984 430515442 431158295 432554016 433370857 434440079 435494690 437328835 438119469
1131.2 438119469 439390259 441306572 443369637 445770111 447759628 450190697 452658730 455027275
1139 455027275 456867943 459086914 460485458 460655327 461331902 462315750 463327789 463646317 465000763
1147.6 465000763 466039352 465714874 465620766 465003510 464796371 464457588 463739319 463006401 462638283 462645798
1157.3 462645798 461958160 461547852 460907516 460146446 459514809 459314346 459794884 460471878 461894646
1166 461894646 463236504 465099373 467628937 470209694 472896461 475500755 478151665 480706253 483108368
1174.6 483108368 485479507 487663765 490014648 492652016 495120697 498028831 500304680 501851387
1182.4 501851387 503795471 505415154 506669884 507944069 509324303 510144234 510763092 511341362 511706696
1191 511706696 512427788 512907486 512969513 512736435 512500114 511834221 510329094 509664421 509623871 508667908
1200.7 508667908 507772064 507409248 506716805 505567474 504261093 503296700 503130798 503255081 502729645
1209.4 502729645 502202187 502222519 502063751 501508179 500700569 499902496 499370232 499113655 498951836 498593941
1219 498593941 497922287 497197952 496806145 496423073 495828362 495196609 494343910 493278503 492325363 491502876
1228.6 491502876 490637932 490092888 489759293 488748741 487853546 487900810 487564545 487203712 487222404 486679916
1238.3 486679916 486213303 486271324 486268539 485629234 485071716 485001526 484979172 485020981 484613419 484031258 483690643
1248.9 483690643 483362770 483051567 483053513 483176727 482918549 482809067 482931595 483055229 482992783 482732887
1258.5 482732887 482460518 482326202 482649498 482955017 483432388 484103241 484630356 485383301 486137886 486496239
1268.2 486496239 486781578 487394676 488286934 489120178 489831123 490781059 491877289 493030853 494266777
1276.9 494266777 495549088 496472702 497032471 497501564 498000565 499402275 500737534 501811256 503373184
1285.5 503373184 504794159 506153336 507357788 508547859 509386406 510029182 510748863 511382027 511991425
1294.2 511991425 512744293 513590126 513985519 514735718 515305176 515838509 516352272 515991516 515918274 515927811
1303.9 515927811 515947075 515684586 515257072 515229454 515206413 514987297 514574432 514473534 513800812 512586670
1313.5 512586670 511721535 511402283 511422005 511252670 511500702 512026787 512912560 514009781 514965324 515686874
1323.2 515686874 516057587 516359596 516490326 516921387 516963806 516989861 517074242 516756592 517032661 516760674
1332.8 516760674 516221390 516092606 515758743 515444603 515329323 515195236 514825783 515121078 516238861
1341.5 516238861 517495766 518422699 519259949 519869652 520255508 521129303 521566048 521914330 521972313 521945381
1351.1 521945381 522000351 521647034 521443253 521198769 521169052 520804329 520451317 519891930 519117508 518495674
1360.8 518495674 518019409 518259239 517820435 518177795 518372993 517823830 517374458 516242332 515820618
1369.4 515820618 515554161 515354767 515417061 515145378 514162102 514027328 515562592 515899467 515865135 515717659
1379.1 515717659 515355148 515011559 514161491 513204575 511898918 511076431 510690193 510456123 508296356
1387.8 508296356 506754112 506422729 505114632 504048386 502361908 500950851 498936005 495677948
1395.5 495677948 494217033 492420959 490859795 487642937 485673981 484977379 483158760 481522522
1403.2 481522522 479829979 477449112 474903755 473442345 472116737 470161285 468595810 467028770
1410.9 467028770 465757713 464530792 463479462 462672157 461625366 460497437 459137115 459204140 456982040
1419.6 456982040 456098404 457379723 457428818 457145653 456112518 456726341 457780914 458311424 459363670
1428.3 459363670 459850197 460628090 461138725 462482758 463834801 464921684 466861725 468086739 468346138
1437 468346138 469635773 472381859 473873634 474796829 476143570 476968956 478338432 479400444 481256027
1445.6 481256027 482601814 483475952 484016113 485320053 487641068 488602371 489979630 490968781 492419090
1454.3 492419090 493797951 493962631 494407234 494411812 499025269 501067352 503222733 505190239 506940651
1463 506940651 509265823 509514732 511844139 513559723 515505447 517868309 520415268 523664398 525700607
1471.7 525700607 527896233 529806061 532760735 535323982 536797829 539044151 541754761 544328346
1479.4 544328346 545856590 547093582 548729591 550712471 552264481 553274231 554279060 554438591
1487.1 554438591 554545403 555035744 554184227 554469376 555624504 556274109 556002426 555999260 555766678 551368980
1496.7 551368980 551682396 550779686 548538628 548885536 548290634 547573090 546920319 547403908 547297859
1505.4 547297859 538984489 532608986 536643372 539880447 540103073 540759506 539064102 537436981 538152924
1514.1 538152924 537553444 537146606 534851761 533143158 534870682 536215591 533965302 530114784 531907425
1522.8 531907425 534245872 536201057 534915810 535079689 536208687 536196098 537091293 538002815 538599358
1531.5 538599358 538915520 539223480 538127670 539217415 540210342 540740929 541406250 536765251 535953751
1540.1 535953751 539833832 541178246 540309525 541738701 542322998 541001015 542637901 543146133 544074440
1548.8 544074440 544375992 543546600 544385338 544805603 545745697 543217621 543272438 544781075 545380669
1557.5 545380669 543395996 535715523 538304901 539505768 541341667 540933876 539778633 536905327
1565.2 536905327 535051537 535051079 533212166 532034378 525099106 524047852 522811050 519777222 517668762
1573.9 517668762 515041542 513355026 501669464 500438957 497927208 494506645 491449127 486677895
1581.6 486677895 483640327 478527374 475068436 470526123 466730232 462854614 457740593 454057236
1589.3 454057236 448195419 445331993 440676270 437199326 433184395 428668213 426088982 421537094
1597 421537094 419448967 414859657 412215042 408595200 405294075 403269768 399470100 398236084 394562874
1605.7 394562874 393392181 390647163 389263344 387430458 384103661 384144554 381175232 381068993 379384727
1614.4 379384727 379536781 379106522 373370209 375575256 374545746 375595665 374235573 375135193 374429169
1623.1 374429169 371505127 373563118 373950081 376248055 374058495 374708481 375606766 376346664 377447548
1631.7 377447548 377612610 380161514 380473022 380506744 378146629 381405525 383264732 384631004 387138710
1640.4 387138710 387012749 389568138 390372963 392934341 395047798 394157410 396246376 395255432 399282265
1649.1 399282265 400788078 404362946 407517014 406489639 405013428 405358505 409793282 411859970
1656.8 411859970 414735374 416055641 418180199 420361977 422204666 425071602 425394592 429013672
1664.5 429013672 431076965 434090538 437143898 439723206 442126617 443147964 448035889 449893150
1672.3 449893150 453610039 457225952 459145927 461324348 464981270 469672737 472995682 477532501
1680 477532501 479675102 483677444 488710785 489252434 492217026 495880013 502096825 505993004 509313507
1688.6 509313507 513552208 517335205 521857338 526201515 530861626 535101051 538965416 539539642
1696.4 539539642 545087051 550549698 555542908 558832245 557903214 564887238 569680595 573643646
1704.1 573643646 576525726 579076881 581236572 584175873 588093071 589982071 591693954 594475632
1711.8 594475632 597148781 599477463 600014610 601147385 604605331 606304283 601826897 605168419
1719.5 605168419 608575058 610687943 612233009 612840576 613543587 615496750 617525826 618468361 619855919
1728.2 619855919 621572914 620678177 621093140 624643250 627906799 626073494 622150497 626847801 630888214
1736.9 630888214 632947273 635445786 635326271 634547157 638459549 640620651 641688690 644227982 647520828
1745.5 647520828 650408401 652636871 655074005 656717682 660913315 662127609 662871704 667483292
1753.3 667483292 670616684 673639450 675874100 675969620 678474808 681460342 683782883 686591949 685961838
1761.9 685961838 686240692 689197540 690281372 691900864 694421387 696282349 694848328 696629868
1769.7 696629868 700551758 700671539 698635941 698184509 702028885 703644333 702892227 705098572 706001282
1778.3 706001282 707454300 707835999 706878967 708279419 710242386 711876297 711443329 711633835 713026810
1787 713026810 713923187 714282761 715535202 716411591 716679306 714660721 714248276 718170624 719328156
1795.7 719328156 718950958 720376129 722056274 722467270 721390839 722900772 722544785 723305283 725070496
1804.4 725070496 725476608 726304016 726783066 727549210 728092117 728662186 727739792 727710495 728677902 729265518
1814 729265518 730764999 731389542 732220078 731637039 731380692 732470016 732802505 733517151 733113556 734105530
1823.7 734105530 734897003 732460327 733105621 735510025 737408676 736988373 734277344 735094376 737002106
1832.3 737002106 736869965 736750870 737437439 738051605 738145905 737965469 739485016 739823074 739912033 740065765
1842 740065765 741311417 742152481 737044449 739014053 741024704 740945129 741079102 741998520 743210983
1850.7 743210983 743083038 743428802 742948456 742848282 743267365 743285904 743640594 743729706 744216003 744223480
1860.3 744223480 744688950 744669418 744940414 745374451 745170975 745665283 745345154 746000290 744804230 743483505
1869.9 743483505 745042572 746275482 747018585 746960678 747482529 747397232 747204361 746979218 746808548 746940765
1879.6 746940765 746370850 746969528 747461014 748152924 748338547 747970963 748036041 747730560 748607864 748233719
1889.2 748233719 746787491 747361603 748220215 748606796 749299927 749737625 749305267 749876938 749709930
1897.9 749709930 749700165 749632416 749113235 749336929 749327164 749657593 749584427 749980392 750423203 750300369 750199509
1908.5 750199509 750038681 749592514 748949356 749770660 749820328 749929810 750477982 750943451 751816711 749951096
1918.2 749951096 749700928 750575409 750877838 751033554 749900513 749431915 749659195 750207977 750382156
1926.8 750382156 750727844 750988007 751139679 750967026 750224075 750087433 749702148 750030289 750152817 750448608
1936.5 750448608 750700760 750347519 750764465 750616684 751410065 751146622 749645691 749925232 749961166 750163956
1946.1 750163956 750100479 750520020 750790329 750676651 750400085 750385895 750828476 750408325 749933624 749371109
1955.8 749371109 749653778 749640350 749189835 749495010 749446716 749630585 749547424 749898987 750104523 749748383
1965.4 749748383 749498444 748746262 748595505 748970795 749359283 749227142 749330673 749378738 749233704 749211578
1975.1 749211578 749059372 749406662 749146118 749050903 748954315 748792496 748752441 748371582 748670197 748760757
1984.7 748760757 748883591 748677902 748607559 748591309 748071976 748362808 748340149 747769394 747497177 748033676
1994.3 748033676 747875977 747522888 747742004 747233429 747379837 747265930 747157288 747285919 747366486 747621613
2004 747621613 747420807 747256393 746663513 746946335 747025909 746601562 746737366 746306686 746126175 746039658
2013.6 746039658 745973816 745935287 746004791 745611420 745348129 745586777 745262604 745354996 745184631 745157013
2023.3 745157013 745273514 745285263 745043030 744386520 744570084 744261246 744099655 744019012 743831635 743816528
2032.9 743816528 743468018 743533020 743389435 743621445 743621979 743390274 743186035 743057709 743127365 742643661
2042.6 742643661 743024979 743299332 743447571 743207855 742727661 742843781 742424927 742279892 741848755 741767502
2052.2 741767502 741753693 741738663 742162018 742089233 742251816 742002029 742162552 742143555 741670456 741344070
2061.9 741344070 741134186 741491394 741013947 740717010 740754547 741291199 741561127 741325760 741738434 741392746
2071.5 741392746 741335907 741101456 740825272 740805130 740783615 741225891 740998001 741027756 741022415 740944061 740643616
2082.1 740643616 740268936 740054245 739759903 740183716 740051117 740138321 740248871 740223236 740411835 740157928
2091.7 740157928 740109406 739685135 739594498 739280853 739041290 739038849 738700562 738938751 738735580 738772964
2101.4 738772964 738768845 738354492 738293457 738347015 738379440 738197861 738006058 737947845 738362961 738126755 737867126
2112 737867126 737976532 737735748 737747498 737547455 737517929 737265244 737100906 736986618 736904755 737359543
2121.6 737359543 737497864 737455063 737033539 737195663 736961975 736498108 736928711 736741257 736628418 736846542
2131.3 736846542 737338257 737088242 736651764 736730576 736740341 737198715 736905518 736519012 736239777 736314392
2140.9 736314392 736614456 736761703 737351379 737218475 737297745 737273026 736938782 736739578 736616669 736789474
2150.6 736789474 736490860 736397858 736452789 736884384 737148132 737365417 737754135 737571182 737642212 737255630
2160.2 737255630 736927261 736636124 736638031 737130203 737058258 737095490 737164078 737302094 736994019 736874084
2169.9 736874084 737051239 737230606 737492447 737236023 737409210 737324753 737439957 737722778 737989731 738285522
2179.5 738285522 737709808 737577362 737703247 738095703 737954407 737668076 737873764 737708359 737761917 737361450
2189.1 737361450 737517471 737903976 738000488 737958679 737915192 738677521 738584442 738364487 738234711 737979965
2198.8 737979965 737926102 737952118 738213348 738058777 738365860 738460388 738319168 738522568 738765717 738632660
2208.4 738632660 738279724 738708038 738634338 738543777 738563919 738488007 738723602 738864670 739261398 739170151
2218.1 739170151 738858948 738532944 738620224 738872070 738973923 739092941 738696823 738728867 738614426 738610535
2227.7 738610535 738681335 738674164 738966370 738878174 738912964 738688583 738762894 739007034 739387589 739512863 738968658
2238.3 738968658 738853607 738583298 738849106 738866425 738805008 738835983 738306503 738561554 738647995 738724670
2248 738724670 738785782 738708038 738565826 738609009 738805923 738388901 738603439 738780899 738989639 738679047
2257.6 738679047 738163147 738529739 738375397 738448181 738445206 738523865 738586960 738660049 739162064 739184952 738804855
2268.2 738804855 738193359 738544540 738484802 738207092 738447037 738291779 738519821 738344574 738357849 738455353
2277.9 738455353 738623962 738692169 738217392 737901306 737475052 737782059 737685776 737553177 737921982 737907715
2287.5 737907715 737914200 737836990 738056488 737497406 737238998 737699661 737569580 737249603 736941833 737255936
2297.2 737255936 737475357 737527771 737575531 737843170 737790756 736991348 736712799 736905441 737249680 736871567
2306.8 736871567 736938705 737132950 737092590 737637329 737248077 737079239 737003555 737101974 736840668 736208344
2316.4 736208344 736458817 736158676 736173096 735840302 735664139 735761642 735789490 736365433 735626602 735151672
2326.1 735151672 735421982 736131821 736583786 736843719 736809692 735632782 735244675 735592270 736295319 736586990
2335.7 736586990 736554565 736051025 735667801 735630493 735043869 734618683 733883514 733928299 733914185 733905411 734424210
2346.3 734424210 734496460 734037094 733951263 734551010 733815536 734169083 734878540 734313278 735319672 735451889
2356 735451889 736205597 735808868 735299835 735581207 735014648 733805084 732372589 734265900 734057999
2364.7 734057999 731963806 731071243 731343765 731708069 732065735 733027725 731751862 731229324 731291733
2373.3 731291733 731197205 731546021 731257019 731042023 730737000 730748825 730482559 730086594 729549561 729042740
2383 729042740 729247742 729227295 729062424 728820496 728744507 728490829 728205490 728090210 727803802 727724228
2392.6 727724228 727375870 727461700 727415390 726967316 727022018 727454300 727678299 726930084 726519089 726172256
2402.3 726172256 725843658 726144104 726087036 725655212 725340195 725371323 724965439 724478378 724259949 724268799
2411.9 724268799 724169083 723875351 723894958 723287659 722888184 723004761 723387985 723663940 723160019 722350769
2421.6 722350769 721634750 721925125 721872482 721489639 721346207 720998611 720914078 720565109 720363922 719793396
2431.2 719793396 719369354 719184647 718747101 718847427 718878632 719152756 718952408 718402557 718399124 718310471
2440.8 718310471 717764359 717324142 717255325 716571350 716413193 716732101 716644821 716158447 715719299 715862350
2450.5 715862350 715462112 715192947 714892578 714496002 714409561 714093399 713829422 713661346 713950729 713605804
2460.1 713605804 713232651 713410873 713069000 712595749 711943741 711356964 710915070 710878601 710717163 710592880
2469.8 710592880 710842514 710533447 710188904 709563980 708968048 708483505 707872086 707808914 708021393 707961121
2479.4 707961121 707544174 707270050 706826248 706479874 706190186 705643845 705204010 705342178 705833359 705152893
2489.1 705152893 704579315 704413071 703874512 703450775 702982025 702941437 702718353 702136307 701508408 701121674
2498.7 701121674 700895081 700738525 700838242 700431900 700179596 700084076 699868240 699362640 698558731 697877197
2508.3 697877197 697248459 697218552 697051697 696642609 696335297 696398087 696400299 695995255 695916824 695467911
2518 695467911 695201263 694565430 693862610 693888168 693779526 693923874 693439713 693194351 693341904 692876511
2527.6 692876511 692194366 691452026 691123428 690810165 690769119 690841446 690990295 690780945 690098877 689854813
2537.3 689854813 689311981 688927994 688595047 688246765 688271866 688269196 687913589 687241440 687350845 687327271
2546.9 687327271 686800461 686449738 686049957 685566330 685255966 685144348 684593811 684353027 684501724 684473114
2556.6 684473114 684162140 683619080 683060913 682393570 681772766 681192627 681408005 681532669 681216202 681102600
2566.2 681102600 680673904 680517426 680083618 679498062 679080353 678594894 678329315 678212280 678187180 677805176
2575.9 677805176 677724915 677763824 677455902 676942978 676613770 676478577 675853653 675389404 674933243 674850922
2585.5 674850922 674608383 673872299 673780518 673779831 673800812 673562469 673355408 672976303 672340317 671940308
2595.1 671940308 671446915 671128998 670721588 670759125 670831757 670884781 670743256 669918442 669450531 668799667
2604.8 668799667 668551254 668183823 667474594 667334366 667026062 666797714 666579437 666598053 666486816 666145706
2614.4 666145706 665666199 665081100 664769363 663935623 663227005 662950745 662923355 662899475 662969131 662832184
2624.1 662832184 661934433 661445084 660691986 659816284 659511795 659552460 659496689 659113541 659489822 659469833
2633.7 659469833 658671417 658104095 657721786 656998444 656076736 655579758 655284348 655397797 655209427 654949875
2643.4 654949875 654761047 654182053 653840485 653401794 653026428 652624969 652122269 651575851 651486969 651601868
2653 651601868 650969772 650670013 650516815 650239639 649880066 649388046 648783722 647879715 647386246 647032928
2662.6 647032928 646852188 646744461 646639252 646677246 646680069 646335678 645471954 645164032 644907532 644767380
2672.3 644767380 644725647 644134140 643838425 643593521 643609009 643981628 644012222 643254623 642417068 641912384
2681.9 641912384 641222382 641074371 641122513 640877762 640510101 640259705 640210419 640015869 639595299 638931084
2691.6 638931084 638690338 638549042 638034897 637583961 637427864 637141418 636824799 636923523 636875305 636919060
2701.2 636919060 636465034 635809898 635464859 634913635 634854774 634738960 634722710 634460678 633693161 633342361
2710.9 633342361 633204117 633224411 632848282 632421608 632028732 631772270 631903915 631692963 631306305 630936890
2720.5 630936890 631004944 631161156 631021576 630586624 630104942 629812622 629302139 629044266 628844948 629070969
2730.2 629070969 629325371 628661270 628012352 627717323 627621841 627310944 627237434 627326088 627077789 627020111
2739.8 627020111 626890068 626651230 626466751 626283379 626037178 626043205 626169510 625752144 625012856 624717255
2749.4 624717255 625001259 625004234 624808006 624500237 624057846 623757553 623571053 623525352 623247986 623146095
2759.1 623146095 623197823 623014526 622706337 622176323 621592789 621597328 621895638 621526260 621245117 620882530
2768.7 620882530 620575066 620469284 619930344 619786148 619553719 619633102 619455757 618586082 618482361 618194199
2778.4 618194199 617696495 617244759 616903648 616730537 616156120 615685425 615517845 615361061 615154877 615022011
2788 615022011 614634552 614258232 613720551 613006516 612670059 612427177 612354660 611828156 611400414 611041908
2797.7 611041908 610316696 610021172 609484825 608865509 608074684 607461510 607312393 606708565 606021194 605387001
2807.3 605387001 604838715 604530334 604314270 603582878 602778015 602432785 601875038 601182442 600519905 600029488
2816.9 600029488 599416924 598918037 598542023 597933540 597414780 596699677 595850029 594855194 594186783 593507385
2826.6 593507385 592593117 592108688 591343727 590689049 590410461 589976463 589155312 588162727 587068138
2835.3 587068138 585885963 584999008 583738174 582483368 581332245 580117683 579116478 577806396
2843 577806396 576043282 573955307 572238045 570463104 568636932 566958847 565148315 563793030 562581787
2851.7 562581787 561948013 561423378 560653915 560284119 559823380 559355316 559187584 559591675 559728813 559271698
2861.3 559271698 559218826 559561882 559125557 557991905 557243996 556165314 555226326 554708939 553979607
2870 553979607 553249092 552641144 552787971 552859993 552379456 551601982 550629959 550008354 549461899 548806686
2879.6 548806686 548013382 547582359 547265205 546409760 545607224 545160522 544701004 543973999 543323364 542325439
2889.3 542325439 540970268 540236435 539713669 538615494 537633362 537371521 536999207 536267281 535424156
2897.9 535424156 534445572 533467751 532768478 532090492 531335182 531118622 530485458 529433327 528942604
2906.6 528942604 528376083 527649498 526998253 526209068 525282173 524402199 523036003 521406441 520279503
2915.3 520279503 519302177 518372154 517089691 515632515 514452171 513369942 512565269 511738815 511051178
2924 511051178 510752602 510575027 510603333 510608253 510872078 511701622 511961899 511797180 511811295 511757126 512327461
2934.6 512327461 513157120 513647308 513707123 513898544 514901428 515849075 516624336 517028236 517301445 517663231
2944.2 517663231 517869644 518792076 519922218 520491409 520614052 520935020 521571503 522495995 523416252
2952.9 523416252 523170662 522906685 522972679 522830505 523082657 523623810 524147339 524452858 525138474 526166649
2962.6 526166649 526759300 527115059 528063354 529098663 529428101 529601135 529706268 530388222 531350784
2971.2 531350784 531832733 532746735 533816872 534106216 533990936 534310379 535130005 535713348 535590439
2979.9 535590439 535835266 536526260 536703072 536910973 537356186 537515297 536983490 536831818 537252464 537378349
2989.6 537378349 537675667 538067207 538750076 539236717 538922005 538258514 538059654 538201256 537761192 537336845
2999.2 537336845 536681442 536251831 536329460 536218147 536126442 535585175 535122604 534601097 534102936 533797073
3008.8 533797073 533199158 532916451 532470856 531903076 531586800 531367912 530923538 530289192 529596443 528690758
3018.5 528690758 528216209 527730751 527174492 526651802 526257744 526038208 525210838 524558830 524148102 523534737
3028.1 523534737 522777481 521932983 521127281 520234833 519861412 519522552 518459206 517753601 517892494
3036.8 517892494 517522430 516536942 515637016 515054131 514626808 513777733 513254433 512597160 511861572 511673050
3046.5 511673050 510948448 510052452 509428596 508986206 507941856 506768494 506555939 506133194 505188522
3055.1 505188522 504096489 503363304 502946014 502394943 501698685 501106567 500783310 500192070 499445724
3063.8 499445724 498565025 498007011 497523994 496689873 495941772 495200500 495127258 494761772 493907204 493371048
3073.5 493371048 492570686 492092323 491814270 491365776 490842857 490212364 489829483 489501724 488966560 488484802
3083.1 488484802 487624130 486233406 485405998 485003204 484833412 484332733 483371887 483155365 482877617
3091.8 482877617 482318039 481882477 481159134 479987907 479102097 479000511 478517761 477836494 477503624
3100.5 477503624 477087326 476154938 475105934 474514122 474133873 473861618 473189049 472712440 472494240
3109.1 472494240 471500969 470154915 469385033 469437180 469119873 468317986 467539406 466786385 466086845 465424690
3118.8 465424690 464970703 463937836 462931480 462509041 462096481 461808739 461141281 460036240 459057388
3127.5 459057388 458598747 458090134 456994019 456069031 455615196 455120125 454321671 453816681 453386879
3136.1 453386879 452710190 452329521 451670113 450491180 449758568 449359818 448832359 448260956 447172127
3144.8 447172127 445997581 445557785 445227394 444505424 443753777 443166771 442424698 441538010 441003838
3153.5 441003838 440643387 439475327 438190575 437684326 437132378 436489716 435644798 434751053 434425354
3162.2 434425354 434201965 433404198 432126579 431095276 430416641 430211296 429977303 429394760 428639030
3170.9 428639030 427395973 426612930 426296730 425496025 424291878 423446808 422753563 421821709 421444778
3179.5 421444778 420736694 419762878 419391174 418979454 418133469 417020988 416465111 416051445 415268745
3188.2 415268745 414469147 413733597 413280029 412833557 411723175 410551529 410186615 409715805 409000244
3196.9 409000244 408074608 407104950 406781693 406360130 405862617 405182228 404465141 403822975 403269234 403287621
3206.5 403287621 402471657 401359711 400973053 400190086 399271927 398864861 398432693 397630043 396667175
3215.2 396667175 395696945 395136681 394734764 394375572 393640404 392404556 391991730 391755981 391132736
3223.9 391132736 390610542 390075569 389344101 388677139 388269272 387623482 387125854 386816826 386586990 386214638
3233.5 386214638 385332909 384372444 383552170 383119888 382529869 381727333 380878105 380140953 379720802 379467735
3243.2 379467735 379585037 379154358 378671608 378114815 377106628 376684914 376115761 375625801 375080338
3251.9 375080338 374317169 374105530 373953514 373804245 373408318 372581024 371933784 371703568 371202011 370433922
3261.5 370433922 369774246 369239273 368912239 368129921 367707634 367868309 367598801 367232971 366678085 365914078
3271.2 365914078 365553589 365463791 365007553 364454842 364152412 363810997 362966919 362207870 362557411 362754364
3280.8 362754364 361983452 361159782 360908852 360751381 360342255 360035629 359408569 358794289 358535347 358492317
3290.4 358492317 358416672 357975235 357690010 357490349 356785164 355825768 355604057 355366058 354703751 354318199
3300.1 354318199 353788528 353593674 353338890 352456894 351728821 351592407 351440659 350864296 350744553 350813560
3309.7 350813560 350353889 349347763 348805923 348493385 347768784 347582626 346843529 346054077 346095886 345611725
3319.4 345611725 344643059 344022102 343741760 342996483 342486992 342450485 342224884 341370201 339932747 338981781
3329 338981781 338121796 337451935 337169991 336868935 336098709 334974518 334614677 334139709 333490410 332889519
3338.7 332889519 331925774 331284561 330552521 329694633 329222679 328894463 328371162 327622910 327231483 327246513
3348.3 327246513 326367722 325093994 324659348 324358444 324226685 323986092 323546753 322902412 321922417
3357 321922417 321733894 321747856 321227646 320221443 319445820 319350967 319099388 318803120 318608646 318311958
3366.6 318311958 317572155 316898422 316559048 315955048 315513477 315298119 314765358 314250202 314399567 314238167
3376.3 314238167 313601818 313008080 312490540 312542248 312170715 311546059 311548004 311678905 311502724 311260586
3385.9 311260586 310934582 310283718 310480289 310639610 309866486 309291630 309209347 309385223 309014053 308718071
3395.6 308718071 308848038 308565655 307877522 307435837 307396545 307259483 307096691 307223949 307640915 307307262
3405.2 307307262 306452656 306238098 307005196 307945995 307158146 306096745 306148281 306617718 306894722 306732292
3414.8 306732292 306698570 306448746 306501579 306660557 306660080 306882896 306874638 307209034 307279186 307014980 306988220
3425.5 306988220 307102051 307396011 307803173 308362694 308424721 307983284 308232613 309156170 309002705 308643532
3435.1 308643532 309281998 309641018 309988155 310340958 310331917 310548611 311050129 311252785 311848316 312570801
3444.7 312570801 312587929 313033829 312908382 313038406 313829136 314210320 314995251 315584545 316404610 317120380
3454.4 317120380 317450428 317715893 318190937 319406948 319452076 319508114 320604248 321456680 321936684 322386551
3464 322386551 323400726 324154663 324381485 324282455 324590073 325458145 326495972 327736626 328410072 329135170
3473.7 329135170 329966507 330293198 330697937 331575394 332288399 333031540 334294395 334906158 335164528
3482.3 335164528 335664444 336958466 338093109 338450851 339592743 340292816 340470276 341122322 342141266
3491 342141266 343000793 343509941 344868774 346451111 347365265 347848434 348583527 349321518 349993515 350817223
3500.7 350817223 351844864 353321609 353638306 353664818 354757385 356336403 357553978 358703575 360284119
3509.4 360284119 360585670 361070595 362119446 362950363 363716087 364631920 365974922 366790543 367950287
3518 367950287 369252357 369976463 370529823 371792450 373888779 374389763 374673882 375717926 376720810
3526.7 376720810 377707176 379061966 380395203 381239166 382308044 383382912 384611320 385416222 386984825
3535.4 386984825 388589287 389139748 391024551 392219009 393026276 394329185 395696030 396849594 397831421
3544.1 397831421 398929520 399025879 400470276 401883354 403790627 405675278 407327881 409938736 409457245
3552.7 409457245 410413094 411949959 413106537 415944862 417273979 418689308 420478592 422377739
3560.5 422377739 423513260 425319099 427233772 427876015 431501350 433191414 434140778 434612999 433580132
3569.1 433580132 437077942 439455643 441103020 443240013 445141182 446576042 448297501 450652084
3576.9 450652084 451832962 454040108 455554466 457168465 459901619 462258339 464218788 464951172
3584.6 464951172 468364639 470874062 470547409 472683868 472647171 475144615 478787689 482094193 483205109
3593.2 483205109 483589325 486723709 487643166 490645981 494087105 494897308 497346306 498723259 500369530
3601.9 500369530 503475342 506386681 508928604 511209793 513200722 513300629 517097244 518214188 518069420
3610.6 518069420 524866219 527188568 526139984 530434990 531147156 534619980 538292351 539504623
3618.3 539504623 541764870 541483116 543950653 547526207 550217133 552877731 555916405 558454399
3626 558454399 561148834 568381844 569454918 560650482 565734253 570806198 576106834 577828369 577031860
3634.7 577031860 579873009 583544922 587080231 588536720 590377846 593077011 595392418 596922684
3642.4 596922684 598349152 601608467 605355644 610972939 611511269 608042946 612605629 613346596 613521423
3651.1 613521423 614545898 619528770 623487587 626447144 631084747 626068649 628447151 633650475
3658.8 633650475 635233154 636948357 637672272 639787331 641212692 643407974 645846863 646653595 650800018
3667.5 650800018 653922272 654595642 654448242 648917618 651547241 658855362 667472839 667955322 651858139
3676.2 651858139 653770905 661583252 667220306 664891815 664438095 666922989 668769226 670243301
3683.9 670243301 670668182 671642380 676083221 682476273 673557816 669771118 677511826 672873001 673103561
3692.6 673103561 677668381 678384094 680192032 680829697 681185913 682947693 682884903 684686661 688471909
3701.3 688471909 684585266 682078552 685983353 687266769 687288971 687333984 690158234 694299698 687656479
3709.9 687656479 691122513 694142456 681553574 687023849 692068176 692266541 692549362 694255371
3717.7 694255371 694960785 692137299 693531647 698931503 695783234 691665039 696484451 697061462 696457443
3726.3 696457443 694711380 694577560 697719879 698974915 704406738 701029968 693219757 700923615
3734 700923615 700962753 693284683 694333954 697733841 698161316 700043106 703649902 699988022 702014084
3742.7 702014084 712550125 702167664 687324905 697653046 703100281 707977448 705415573 694824829
3750.4 694824829 702590714 696102295 692282562 699364319 704126358 707032242 701947327 704406509
3758.2 704406509 709723587 701971664 700727005 704298935 704796219 705295486 709558411 707624588 702532120
3766.8 702532120 706048279 711008072 710194931 701757202 703817596 706810760 707155914 707926636 707602844
3775.5 707602844 708690643 709341888 711957169 712523041 704929123 706262436 708376617 709213715 710533066
3784.2 710533066 707890472 707374496 708578720 709354248 709872437 709374771 709302597 709668884 710534286
3792.9 710534286 709893417 710974121 714873734 711130753 706828537 709214859 713761292 720273895
3800.6 720273895 714028015 703235245 706242981 708458252 712386322 716788406 707694092 704213867
3808.3 704213867 708918686 711074448 711769562 712257156 712140961 713224106 718139343 716189957 702993317
3817 702993317 708013153 713336868 717031021 717886734 702856827 705526886 709954147 711619492 714049835
3825.7 714049835 713660202 709532623 709709244 711897583 715244217 716759109 708555374 711627960 719473419
3834.3 719473419 713823471 711908646 717671890 709314804 706258774 714897842 712085648 710622635
3842.1 710622635 715616455 713304672 710540771 712781372 713790588 714195404 715485687 714356079
3849.8 714356079 715245514 718813553 713077164 714564209 701635437 702687912 712553558 712512131 711461563
3858.4 711461563 713695297 715746307 718155899 712459793 711082535 716136322 710807266 707702026
3866.2 707702026 712121658 716788712 722224731 714022293 705465164 709576340 714941864 717849579
3873.9 717849579 708845978 709736557 713726654 713895493 716035080 719212265 712624283 705743790 711704407
3882.6 711704407 714069824 716023712 719942627 707186813 708655396 713221207 714428787 718220901
3890.3 718220901 716394424 708766632 710594406 713770218 712607574 713268280 713672867 714941635 716264267
3898.9 716264267 709148483 713829880 715223846 711213837 715465469 712281265 710992966 710477295
3906.7 710477295 710750656 713211899 713235321 713279037 713020325 713357391 713543320 712998428 714105225 715363846
3916.3 715363846 712043762 709292526 712936172 713027191 710222549 712741699 714922485 715407333 712053375
3925 712053375 708957214 710806961 712466431 713538513 713328857 713475571 714908676 712731934 711289215
3933.7 711289215 712152786 712575912 713155441 713431778 712854996 711847916 711516266 713061676 713692398
3942.3 713692398 710149612 710360489 712245712 712550430 713083420 711410751 712192459 712373734 710487213
3951 710487213 712167358 711934433 711502151 712220001 712545242 712805176 712257233 712594147 711769562 711661530
3960.7 711661530 712416229 711849289 711791992 711506653 711660156 711909637 712142868 712857513 712300644 711155548
3970.3 711155548 711792984 712541580 711880341 711642761 711737518 712029877 711806107 711669617 711381607 710458069
3980 710458069 710981522 711243820 711095123 711433868 711935272 712364273 712436066 712701721 712677460 712643814
3989.6 712643814 712057419 711897736 712176666 712602997 713392487 712268295 711302719 711195831 711494751
3998.3 711494751 712042465 711750336
4000.2 711750336
##END=$$ End of the data block
