##TITLE=$$ Begin of the data block
##JCAMP-DX=5.00 $$ ACD/SpecManager v 10.08
##SPECTROMETER/DATA SYSTEM=Varian
##DATE=08 Jan 2013 14:52:04
##DATA TYPE=INFRARED SPECTRUM
##DATA CLASS=XYDATA
##ORIGIN=
##OWNER=
##NPOINTS=3735
##FIRSTX=399.26403809
##LASTX=4000.35498047
##MAXX=4000.35498047
##MINX=399.26403809
##MAXY=78.61641693
##MINY=47.34098816
##XFACTOR=1.0000000000
##YFACTOR=0.000000100000000
##FIRSTY=66.04747009
##DELTAX=0.96440572
##XUNITS=1/CM
##YUNITS=TRANSMITTANCE
##XYDATA=(X++(Y..Y))
399.3 660474701 674622879 683544235 677475739 668193588 666972885 665658951 660524216 658259125
407 658259125 659124985 662968063 669502945 680441666 685522690 687828903 687407303 669873352 657974625
415.7 657974625 655182343 647787781 637107658 637085495 656974792 669759750 678887329 674889145
423.4 674889145 661782150 655544052 654440308 655511246 658272629 665790024 675640335 683240128
431.1 683240128 684075699 676346512 665639801 657957764 656565247 657801743 659834747 665221786
438.8 665221786 672337494 676608505 675034866 669290009 663231735 657313309 652813797 650365753
446.5 650365753 654690475 666200027 679370651 681801071 675954514 669529037 663720932 658696976
454.2 658696976 656106644 658859711 656225662 654053802 668695908 676134262 674119186 667354736
462 667354736 657420349 648620224 647492447 652842331 656271133 657883606 664075165 672704239 675952606
470.6 675952606 676505890 668928833 651997681 645858307 647023621 648814011 655296021 666601562
478.3 666601562 670722656 671108093 669362793 662412949 656775970 651441727 647935715 649255981 653796310
487 653796310 660379410 668510284 674056931 672090759 665365677 658921967 653661346 650960922 652276611
495.7 652276611 655577240 659945145 666804504 670489044 669540558 667080917 657710571 648843002 647025681
504.4 647025681 649150925 653267975 659934769 667042694 670443420 666728363 658530807 650569687
512.1 650569687 645977249 644899216 645187302 647252350 653272934 661362457 666695786 667631226 664821014
520.8 664821014 657689819 648317642 642692795 639819183 641458130 650700150 658855438 662682724
528.5 662682724 663280563 659469681 652237854 646371231 643422623 643244171 645404816 648588104 654218140
537.2 654218140 661048737 662213974 659620209 655112457 647387085 642368774 640212097 640180740 643761597
545.9 643761597 649431534 657035065 659890747 657743530 653289566 646559601 642029648 641082382 642091522
554.5 642091522 643533401 648169861 653532715 656023560 655985718 651609573 646638336 641804581 637332458
563.2 637332458 637091980 641016006 647632523 653355026 656514969 658484879 656778870 650822067 644579926
571.9 644579926 640889587 638954506 640933990 645568314 650742645 655522995 657620773 655764160
579.6 655764160 649850998 643934631 640976944 639095459 640421143 646246338 652101212 655622177
587.3 655622177 657577591 656797638 651989136 645732574 640930939 639486198 641186600 645935364 651566010
596 651566010 655886993 657318268 655858536 652071609 646002045 640658112 637892456 639896164 645755539
604.7 645755539 649981995 652384720 654539032 654739227 651915588 645939178 640241089 637833748 638263702
613.4 638263702 640854721 644380112 647778702 649310150 649454193 648284531 644501495 640465622 637382088
622 637382088 635835800 638032532 643290100 650226898 655838547 658100967 656350174 650268784 643405304
630.7 643405304 639904938 639630585 642842407 649131851 654785080 658350220 661007462 660447006 656060257
639.4 656060257 651466980 647381516 645203171 645569992 647682953 653018570 658624878 661964340 661505356
648.1 661505356 657146378 652657242 647659225 643670807 644508591 648489075 653782272 659013290 663257065
656.8 663257065 664767227 662342148 657463531 652347336 648649979 648064041 650620193 655481415 662215500
665.4 662215500 666836624 661968231 625974846 635828209 647119904 648501129 648118668 648674164
673.2 648674164 651728973 658171387 663077164 665628738 665553513 663490829 659400482 653151550 649125290
681.8 649125290 649591446 654331131 659511337 663826752 669403000 672999191 671452179 666701889 661541443
690.5 661541443 657294693 656701508 660050812 664894180 670378189 675356293 678013458 677765503 675283356
699.2 675283356 670734558 665909195 663946991 664516068 667730560 673399582 679692459 683893051 683963776
707.9 683963776 680854034 675010300 669432831 667232132 667929993 670947647 675536957 681601791 686391678
716.6 686391678 687473221 685809708 679929581 672729568 670247040 670930328 673560867 677956390 682930603
725.2 682930603 687762680 690637054 690428085 686997223 682739563 679470901 676982803 677738495 681042023
733.9 681042023 685562515 691350098 695121536 695538330 693799744 689609680 684354324 682182236 682017593
742.6 682017593 682630539 686569672 692566681 696973648 698023758 697343826 694766083 690022507 686779175
751.3 686779175 686356201 688314514 690931091 694779205 699976883 703024750 702875748 700336914 697058563
760 697058563 693916092 692202911 692419357 694319000 697990570 702052078 705027618 706121292 705604477
768.6 705604477 702351456 697805252 694870834 694112167 696051178 699471664 704170837 707742844 707701874
777.3 707701874 705847778 703411331 700717163 697812805 696021500 695836105 698532791 703366852 707275543
786 707275543 709838104 709824982 707261658 703932419 701183929 698649063 698106995 701694183 706953278
794.7 706953278 710516357 711239319 711087570 709669189 706474152 702568359 699934616 700253525 701422272
803.4 701422272 703696213 706643295 709555664 710523834 707999344 704262390 699757156 697085266 696663513
812 696663513 697539902 699420853 702048645 704353943 704670944 704684906 702151794 698197327 695593567
820.7 695593567 693889542 694099960 696214447 700981598 706022568 709499207 710604248 708959656 706587906
829.4 706587906 703852310 702596817 703243866 706581039 711565704 716338120 720610809 722019348 721137772
838.1 721137772 718442459 714963531 712797394 713866119 716546631 719552002 724511795 728351440
845.8 728351440 729571304 728844910 727382278 724582214 721474152 720829849 721380920 724207535 729134521
854.5 729134521 734769745 738123322 738181458 736664658 732907639 729827881 727817535 727392731 729676971
863.1 729676971 733821716 737968597 740440598 742200851 741077194 737141113 731278915 725815659
870.9 725815659 723337631 722934570 724837875 728309479 732196121 733990402 732737198 729906769 726659012
879.5 726659012 724438248 723575134 723855896 725553741 729387207 732960739 735564804 736960907 735634308
888.2 735634308 732329330 727429657 724316254 723385315 723854218 726367950 729480362 731844788 733484039
896.9 733484039 733851471 730689926 727259903 724315567 721377182 721092606 723184814 726655502 729393921
905.6 729393921 732269363 733717499 732349091 730065002 726729507 724680405 724358597 726279373 730073090
914.3 730073090 733964462 736427689 736665649 735225296 731120834 727342682 724071960 721436844 721172104
922.9 721172104 722339325 724672775 726270447 727069931 726082687 722866974 718600616 714525452 712154465
931.6 712154465 710518417 710604630 712463150 714953003 716998215 717347870 716086349 713049622 709606705
940.3 709606705 706471100 704401855 703804474 705208817 708086700 709651566 709751816 709236832 708740005
949 708740005 707421799 704766235 701694336 700084229 700989304 702778168 705348053 706740723 705820312
957.7 705820312 704314804 701531372 698010330 694934998 692547531 691971436 693230133 694645691 695782776
966.3 695782776 695858765 694149323 691797562 688649750 685490112 683372116 682179108 681654663 681013412
975 681013412 680714798 680785599 679634247 676994171 674051895 671299820 668456421 665512543 663542175
983.7 663542175 663036194 662698898 661217804 658546677 655285416 652143936 649044724 645502167 642510910
992.4 642510910 640548553 639713821 639438744 638903198 638147736 636191368 633852005 631563759 628559380
1001.1 628559380 626593056 625934029 624739075 623792419 623507919 622565651 621507072 619579849 617078476
1009.7 617078476 614849701 612422409 610821991 610344086 610713768 610310745 609585495 608586273 606335640
1018.4 606335640 604106560 601486015 599318924 597942734 596926384 595698814 594568520 594668770
1026.1 594668770 594316902 593089333 590931206 588551102 586265450 584362373 583294907 582911873 584177818
1034.8 584177818 585291367 586141167 587342186 588362350 588179817 587796631 588791809 589203148 590072098
1043.5 590072098 591363602 592400398 593764420 593973694 592841377 591411972 589698906 587510796
1051.2 587510796 586506729 586167641 586388969 587120132 586882401 586135445 584757271 583922462 582726212
1059.9 582726212 581476288 581543427 582844238 586076431 588911057 591288109 593850021 595206833 594947624
1068.6 594947624 595012817 594870071 593566437 593370476 593846359 594939919 596087303 597471848 598834534
1077.2 598834534 598999634 598704262 597178268 595789795 594960480 595579109 597853851 599711380 601103859
1085.9 601103859 601596832 602440453 603312073 603561058 603036423 602295570 602871819 604201584 606055794
1094.6 606055794 607567825 609397354 611464424 612625084 612279243 611275978 610320969 608607025 609278183
1103.3 609278183 611376190 612371330 613553162 614935150 615866776 615385056 614751244 614117584 613466225
1112 613466225 613128510 612977676 614614716 617108765 618892059 619873619 620674858 620308228 618847008
1120.6 618847008 617774773 617187195 617152023 617369537 618931427 620630188 621786385 623033600 623307228
1129.3 623307228 623540573 624140091 624970512 625469971 626369438 628323135 630615921 633488007 635827255
1138 635827255 637396660 638007507 637304306 636541214 636856689 638037529 638451576 638630714 639756546
1146.7 639756546 640977707 641375351 641174011 640878296 640260239 639133873 638287811 638611450 639295387
1155.4 639295387 639625702 639575768 639541054 639751511 639250259 638098640 636747894 636236763 636503334 636967888
1165 636967888 638504868 640667877 643230133 645451736 646791763 647565231 648293762 649635620 651182022
1173.7 651182022 652709198 654644775 657081604 659161148 661004333 662843399 664273682 665943451
1181.4 665943451 667126846 667675552 669081268 670446701 671428757 672626877 673573685 674270096 674864960
1190.1 674864960 675100937 674874496 675022736 674927902 674411087 674275360 674170151 674012375 673693771 673595657
1199.7 673595657 673187332 672587051 672135315 671314468 670957108 671102600 670995178 670116425 669655457 670223999
1209.4 670223999 670566406 669964752 668961945 668829041 668826141 668775330 668623123 668263779 668303604 667967148
1219 667967148 667622681 667699966 667743607 667248917 667331696 668001556 667337189 666925583 666977921 666397629 665863495
1229.6 665863495 665373459 664843750 664645004 665081100 665389786 665366592 665259171 664724960 663993835 663466492
1239.3 663466492 663105164 662828445 662916412 663236923 663580093 663901596 664121780 663897476 663220901 662686615
1248.9 662686615 662203522 662044678 662291946 662464142 662354126 662367630 662661133 662541504 662210159 661856689
1258.5 661856689 661519394 661223373 661123657 661339493 661668930 662800217 664096146 664524612 664517059 664451599
1268.2 664451599 664832993 665397110 665584641 665802689 666638031 667520218 668286438 669324570 670235825
1276.9 670235825 670850449 670950928 670977020 671070175 671222305 671629181 672210464 673675690 675254517 676161346
1286.5 676161346 676597977 677098618 677628174 677490311 677653351 677930222 678277206 679223709 679927063 679854355
1296.2 679854355 680213089 681061859 680736237 679962769 679371719 679371948 679337616 679106064 679299316 679315796
1305.8 679315796 679603424 679113541 678467560 678232651 677752609 677032471 675504150 674840240 675063782
1314.5 675063782 675655441 675826645 675457764 675326996 675141220 676056213 676561432 676641693 676865005 677052383
1324.1 677052383 677688217 677836456 678281860 678717804 678806915 678638306 678106689 677854843 677458878 676901855
1333.8 676901855 676384201 675925751 675045166 674416046 674175110 673741684 674167328 675557327 676893539
1342.4 676893539 677148895 677001495 677160263 677410431 677573090 677716217 678216171 678316879 678609390 678627167
1352.1 678627167 678330994 677790604 676710663 676283798 675887756 675734253 675604172 675830383 675680542
1360.8 675680542 674850388 674221573 672365036 672595673 672810440 672307281 671771240 670293655 670067673
1369.4 670067673 670709000 671222687 671123047 670385666 668765793 667800140 668225861 667930069 667259750 666811066
1379.1 666811066 666966171 666750641 666195755 665243988 663477783 662603226 662527084 662187271 660932236
1387.8 660932236 662037354 663342056 663365021 663775406 663503189 663013992 660557709 657610092 656974564
1396.4 656974564 655655518 654239578 651066208 650838928 651923447 651640854 650998688 649571228 646801682
1405.1 646801682 644483871 643412933 641738892 640140305 639267387 638757935 638805084 638616829 638570442
1413.8 638570442 637803688 636267662 634097023 631574783 629980850 626452751 628242035 631210365
1421.5 631210365 632817001 633363152 632437592 632788239 633124771 631880341 630883713 630010948 629594154
1430.2 629594154 631160316 633375282 634899673 636243286 637384644 637061424 633562660 634342651 636998177
1438.9 636998177 638206902 639230881 640729370 642351837 644138794 644888916 645623627 645673447 644236069
1447.6 644236069 642194290 642889328 644509277 645169601 646475449 647754135 649084473 649549942 647884064
1456.2 647884064 643465347 642023697 645719452 648318634 651833344 654275055 655919342 658004990
1464 658004990 656673126 657558365 659156265 659827499 660368118 661302109 663357391 663774872 663052826
1472.6 663052826 666076202 671126709 674116974 674137497 674994659 676439362 677129593 677387924 677669601
1481.3 677669601 679387436 682272186 684286575 684784546 685214462 684046021 682517319 682559586 679577026
1490 679577026 679221497 682770844 685351944 686346359 687226410 686801758 681852341 683106918 682005310
1498.7 682005310 679443970 680243988 679930344 680769730 682023621 682862625 682416840 675250320 668370438
1507.3 668370438 671871185 674694977 674767990 676816177 677467880 677511520 679510574 679698563 678583908
1516 678583908 675405273 672237091 674502029 675130005 668823471 664601974 668858414 673118744 676007843
1524.7 676007843 675494537 675549011 674815826 673007050 673724442 674055405 673769531 673895416 673146362 671959152
1534.3 671959152 674627380 676006393 675749512 674989395 665349960 659319687 665294571 668144455 669325562
1543 669325562 671991959 673165436 672561951 674565506 674935989 674457932 672084351 670819168 673338928
1551.7 673338928 675306168 676717758 673717880 674177704 676406403 676201782 665041885 650783997
1559.4 650783997 663543472 668846817 671944427 673361206 674161301 673106537 672041016 671983414 670224380
1568.1 670224380 667498245 659646072 661321793 663010941 662614136 662758636 662407379 661363754 651620789
1576.8 651620789 651892700 651658096 649729233 648097610 645777283 645089874 643899765 643404922 641446533
1585.5 641446533 639168968 636628380 632793121 629952507 626271858 624849739 623110886 622617416
1593.2 622617416 621594772 619172020 618020859 614964066 612869682 609753685 607501297 604890289
1600.9 604890289 602804718 602286263 601100426 601247673 599625397 598734398 595934334 593554611 591547394
1609.6 591547394 589174347 589535675 588246956 588798561 588417397 588753624 588314705 581111069 582200203
1618.2 582200203 581289787 581284790 580131645 580260391 579361076 577933769 580702934 581106262 582234802
1626.9 582234802 579922142 578522453 578840294 578591347 578934250 579034462 581266403 582420158 579094467
1635.6 579094467 578231125 580921440 581187172 581566238 582905731 582684135 584277191 585230865 588037682
1644.3 588037682 590216713 587290421 587126579 586882744 590167809 591798286 594149971 596377335 592389221
1653 592389221 590026474 594550133 600204926 602761269 604659538 605286980 605594521 606469727 607543411
1661.6 607543411 608090553 609260406 614546204 617864456 619830437 621718750 622770729 620703964
1669.4 620703964 620691376 624017067 625581169 629499893 633746719 634867058 635731621 639558449 642698669
1678 642698669 643667908 643840408 643590698 646921616 650801392 650159760 648918762 654745941 660659943
1686.7 660659943 663136520 663511505 665302963 666279221 668388290 671124344 674001236 677593536 680554886
1695.4 680554886 677498398 680544739 685005798 688662872 686051865 681618347 688447113 692955933
1703.1 692955933 695605774 697414017 699288788 700577621 702722473 704571686 704042740 703629837 704946213
1711.8 704946213 706421585 708100281 708819275 710009918 713251953 713120117 707086868 710645294 713332138
1720.5 713332138 714208145 715020981 716008301 717885056 720562592 722574234 723577423 724161682 724053268
1729.1 724053268 721050949 719467392 721463547 723068542 720633774 719032211 725519714 729732513
1736.9 729732513 730305634 731359787 729621429 726899796 729623260 730991898 730850067 732928467 736671448
1745.5 736671448 738991318 740020981 740247192 738395615 739614029 737839813 737764816 742645569 746302109
1754.2 746302109 749618378 752396774 751657639 751899490 752575912 751963806 752123642 749316711 749580994
1762.9 749580994 753707886 756963730 759481812 761508408 761698990 757819901 758183594 759480133 756578674
1771.6 756578674 753352280 754602356 759679031 763074951 764290924 765970688 765517731 764601059 762836533
1780.3 762836533 760095520 760222931 762211533 764087830 765096436 767569122 770013504 770645218 769550018
1788.9 769550018 768408737 765873566 763210449 761045990 762803726 767205124 769529495 771002045
1796.7 771002045 772878952 773794632 771883011 768238449 767914963 766621323 767466660 770354156 772582016
1805.3 772582016 774788971 775837173 775697632 775133591 773772049 770678253 769971848 770987015 772276917
1814 772276917 774570160 776526031 778499527 779015656 778468857 777193832 774623260 773472366 772681122
1822.7 772681122 773719559 775186691 775115509 777685928 780464096 781009598 778234634 773233414 773191910
1831.4 773191910 774290085 774446335 775675507 777847519 779770279 780944519 781214523 781510162 780121918
1840.1 780121918 778192520 776037674 775396957 775210495 773404160 777632141 781324005 782198181 782092056
1848.7 782092056 781574097 780379410 778390579 776943588 776813049 778319855 780150452 782382278 784081497
1857.4 784081497 784275131 783647919 781699066 779820175 778079071 777585144 778265457 779594269 781620255
1866.1 781620255 782618256 783940506 783092575 780877914 780492706 779408417 778393097 778383942 779710846
1874.8 779710846 781146011 783046341 784717331 785189514 784579697 782671585 780954285 779132156 778398056
1883.4 778398056 778898087 780558853 782951355 784659576 786164169 785057449 781464157 780621796 780210495
1892.1 780210495 779236526 779528732 780265656 781374283 784210129 785813065 785898132 785186539 783449020
1900.8 783449020 781618195 779905319 779569092 780241852 781844406 783783340 785036087 785135651 784508972
1909.5 784508972 783469925 781705551 780478821 779297562 779463654 780910873 782945251 785310364
1917.2 785310364 784709015 783941956 784037628 783016891 781239548 778576431 778548889 780271301 781961670
1925.9 781961670 783707733 785603104 786143341 785298843 783922577 781849976 780430374 779713135 780221710
1934.6 780221710 781511459 782990799 784442139 785169601 785402756 784104919 782488937 779860458 777306061
1943.2 777306061 778410721 779943695 781350708 782955399 784375076 784687042 783869934 782503433 780924149
1951.9 780924149 779503784 778622818 779265289 780838242 782738190 784210129 784732666 784408264 782894669
1960.6 782894669 781069336 779468536 778606186 778492889 779350815 781025925 781979904 782784653 783809052
1969.3 783809052 783573914 781686401 779763184 778178101 777739105 778832016 779999237 781596527 783290482
1978 783290482 784144745 783554840 781987762 780147552 778234787 777360001 777511063 778751144 780558090
1986.6 780558090 782054596 782731857 782583542 782249222 780496826 777766266 776463089 776504211 777528839
1995.3 777528839 779122925 780729904 781933365 782761688 782215881 780415115 778200302 776424637 775755692
2004 775755692 776200256 777699966 779250412 780953674 782137299 781686401 780294952 778479996 776742096
2012.7 776742096 775339737 774816208 775556259 777043304 778713150 780099640 780843430 780699158 779531021
2021.3 779531021 777273102 775175629 773934174 774245377 775782623 777547226 779509659 780525513
2029.1 780525513 780292892 779179840 777382507 775264816 773565903 773101654 774037933 775919876 777517014
2037.7 777517014 778896866 779620895 778931961 776982956 774646530 773294983 772561722 772768326 774112015
2046.4 774112015 776009598 777646942 778374634 778295288 777020111 775107346 772979813 771812286 771902771
2055.1 771902771 772471924 774260483 776347427 777669067 778029480 777338409 775684204 773693924 772140121
2063.8 772140121 771133118 771546936 773025436 774935074 776413422 776843719 776571274 775638657 774203491
2072.5 774203491 772248535 771224594 771335831 771896896 773110580 774628067 776158752 776541748 775673294
2081.1 775673294 774046555 772240295 771082458 770618744 770932236 771974335 773550720 774784775 775581512
2089.8 775581512 775698776 774415207 772521439 770909653 769955368 769718399 770582809 772393341 774080658
2098.5 774080658 774821548 774911804 774424286 773037109 771420670 769886932 769258499 769568939 770806198
2107.2 770806198 772846527 774067841 774550858 774066467 772546768 770901871 769279022 768154984 768187180
2115.9 768187180 769322510 771102448 773023376 774118729 774197998 772902145 770649567 768876038 767908173
2124.5 767908173 768041687 768608475 769819794 771529160 772831573 773553238 773106155 771819916 769776459
2133.2 769776459 768174210 767646255 767814331 769097519 770636139 771944656 772711639 772598190 771469040
2141.9 771469040 769852371 768588333 767810516 767758179 768439407 769870987 771374054 772511444 772766876
2150.6 772766876 771849670 770403900 768631058 767321243 767181625 768086090 769067688 770391846 771759720
2159.3 771759720 772247391 772184372 770864487 769347839 768316422 767483368 767267838 767956161 769682770
2167.9 769682770 771338730 772553482 772406082 771215363 770028076 768536148 767279282 766564178 767207260
2176.6 767207260 768894424 770814056 772265472 772752762 772372284 770835266 769095840 767537384 766661224
2185.3 766661224 766682663 767886124 769945755 771558914 772781143 772710342 771795883 770244293 768161163
2194 768161163 766896286 766529465 767432632 768884888 770512543 771978683 772517624 772032318 770630569
2202.6 770630569 768836441 766951065 766183395 766592102 767860794 769653168 771437836 772737274 772458801
2211.3 772458801 771309433 769621811 767813339 766590118 766254883 767047577 768749161 771047516 772473526
2220 772473526 772833023 771960068 770002213 768196182 766548462 765639648 765985031 767411194 769216843
2228.7 769216843 771229706 772653351 772396088 771061707 769212418 767517166 766111679 765548935 766387253
2237.4 766387253 768292313 770231400 771359177 772058563 771913681 770456238 768103638 766063538 765180359
2246 765180359 765599442 766634064 767948456 769816666 770791016 770474625 768934479 767208557 765910568
2254.7 765910568 764681091 764713669 765304794 766627121 768478317 769949112 770472412 769457092 767826920
2263.4 767826920 765787125 764299774 763433990 763740768 764925690 766142654 768033371 769127121 769023666
2272.1 769023666 767752228 766045990 764249496 762818604 762686234 763378754 765313187 767143097 768565140
2280.8 768565140 769053955 768906174 768133469 765761108 763884277 762411804 762621460 763271637 764020691
2289.4 764020691 765395050 765459518 765760727 764250946 761852646 759517822 757576981 757323151 757143402
2298.1 757143402 758539886 758985977 759361649 759491806 758026505 756543808 753486633 750902786 748346100
2306.8 748346100 747684860 748013306 747873230 748387146 747398529 747024765 744750214 742758942 741070175
2315.5 741070175 738153534 737237244 735415344 734491196 732688904 731498795 730930634 728260422 726337738
2324.2 726337738 724016342 722226181 719358673 718599854 718514404 718018341 718233719 717322464 718080292
2332.8 718080292 716824036 716275940 713802185 710989761 712335205 712189102 712332230 712861633 713990631
2341.5 713990631 712659760 713306580 713973694 712737350 715901489 720825500 729166641 732370758 728075027
2350.2 728075027 723483963 718734207 713766251 708782730 702626343 696903229 692031937 689056702
2357.9 689056702 689130936 690963516 692126389 694500427 695413132 696632156 696606827 696554871 698954849
2366.6 698954849 701334763 705318909 709173126 714755249 720541992 724536514 727571487 729882278
2374.3 729882278 732404327 734691315 737253113 740120544 744118881 748477478 752198410 755259399
2382 755259399 757197952 758527908 759090271 759030991 758519974 758726654 760156937 761755142 763024902
2390.7 763024902 763628235 763921280 763198624 761882935 760560150 759175262 758671112 759134750 760400848
2399.4 760400848 761479874 762428970 763108826 762915192 761939468 760234680 759110565 758457184 758125763
2408.1 758125763 758484802 759627914 761147156 761853180 761848450 761118546 760154724 758899612 757405624
2416.7 757405624 756930466 757451706 758678970 759968338 760675507 760815887 760508804 759505997 758053513
2425.4 758053513 756726608 755881195 756125870 756878815 757887192 759149857 759753036 759602432 758975754
2434.1 758975754 757578049 755832367 754538727 753917465 754700394 756053543 757230911 758542709 758859634
2442.8 758859634 758229294 757283401 755924683 754313507 753529205 753855591 754637756 755815964 756706085
2451.5 756706085 757344360 757518768 756839371 755365448 753223572 751957321 751865997 752469711 753953552
2460.1 753953552 755587845 756347885 756408539 755857010 754392166 752962341 751945801 751112518 750821838
2468.8 750821838 751429443 752785263 754393234 755281448 754999466 754049835 752395782 750980682 750024796
2477.5 750024796 749721832 750728378 751699219 752689209 753609695 753626556 752910385 751633987 750031738
2486.2 750031738 748675232 748279343 748180618 748458862 749601669 751014557 751685867 751092148 750305328
2494.8 750305328 749277573 747908783 746986771 746791763 747365112 748321838 749249649 750071106 750518112
2503.5 750518112 749923859 748654861 746887970 745341110 744763947 744714050 745504456 746558838 747647324
2512.2 747647324 748204041 747914658 747387924 745899353 744580841 743897324 743305435 743658066 744760208
2520.9 744760208 745812531 746604614 746869354 746288071 745080948 743276672 742074509 741683884 741541443
2529.6 741541443 742662354 744009552 744748840 745172424 745004807 744194946 742934494 741539459 740327301
2538.2 740327301 740299377 741257935 742395325 743400040 743913269 743901291 743188400 741942139 740731277
2546.9 740731277 739934540 739298401 739260101 739739304 740406570 741578751 742282486 742221451 741222610 739884949
2556.6 739884949 738806000 737786789 737656021 737953949 738992920 740473175 740924683 740641174 739514542
2565.2 739514542 738098221 737440872 737122803 736548233 736356735 736906662 737870560 738944473 739150467
2573.9 739150467 738335419 737225647 736342697 735420914 734456253 734552002 735464859 736137848 736607361 736840820
2583.6 736840820 736710815 736377487 735464020 734393539 733456421 732755661 733108902 733896790 734726715
2592.2 734726715 735281143 735257492 735171890 734435654 733072662 732006454 731447372 731267319 731781540 732811813
2601.9 732811813 733506699 733673248 733453369 732684326 731176376 729822235 729318542 729428024 729906921
2610.6 729906921 730772552 731708374 732014923 731893082 731111374 729806671 728877869 728334198 727679596
2619.3 727679596 727344437 728175354 729064713 729780807 730312729 730084457 729407730 728021088 726752472
2627.9 726752472 725975113 725671082 725916367 726548233 727525406 727862320 727741547 727050934 726043777
2636.6 726043777 725347977 724335175 723618546 723742981 724348450 725012741 725733719 726079483 725537491
2645.3 725537491 724375229 723015213 722179565 721747284 721625137 721743774 722127533 723065491 723881989
2654 723881989 723879547 722887421 721654434 720568848 719790268 719576492 719658432 720241776 721056213 721550217
2663.6 721550217 721753616 721366882 720261230 719181671 718025055 717065277 717151413 717923050 719038162
2672.3 719038162 719606094 719768982 720004425 719614487 718512115 717131653 716318283 716022034 716322098
2681 716322098 716922760 717451553 718060150 717977142 717403717 716275101 715012436 714082718 713463593 713719406
2690.6 713719406 714190979 714815140 715603409 716297379 716165848 714910126 713969498 713206100 712310333
2699.3 712310333 711936417 712260895 713126144 714146652 714572906 714502258 714238739 713162308 711922760
2708 711922760 710863571 710152206 710141983 710482559 711116257 711642380 712161713 712357635 711815796 710721817
2717.6 710721817 709442062 708660507 708484879 708878479 709402466 710167618 710959396 710985336 710389328 709499435
2727.3 709499435 708566360 707254715 706400070 706900024 707727585 708246689 708867950 709516602 709503555 708804932
2736.9 708804932 707677689 706722870 706036530 705513916 705634079 706256104 706946945 707409973 707817078
2745.6 707817078 707776566 707017593 705786514 704710388 704408417 704228439 704682770 705788498 706674728
2754.3 706674728 707186890 706996536 706045456 704622803 703767548 703483810 703475494 703600311 703771820 704284058
2763.9 704284058 704562683 704701080 704176025 703115234 702523346 702140884 701894531 701808243 702128525 702759247
2773.5 702759247 703543015 703918915 703329468 702367859 701660767 700962219 699961700 699629593 699630890 699838867
2783.2 699838867 700604172 701066818 701024399 700447845 699763031 698705902 697770844 697415314 697488098 698320160
2792.8 698320160 698707428 699193344 699406357 698430023 697387772 696292725 695454330 694823608 694706879
2801.5 694706879 695042496 695144043 695389557 695571671 695646133 695213699 694232178 693440857 692477646 691497269
2811.2 691497269 691444855 691927719 692298279 692341537 692032471 691509476 690311279 689183731 688381653 687620010
2820.8 687620010 687319870 687124786 687283249 687377243 687376938 687335892 686626434 685789413 684766312 683778915
2830.4 683778915 683181686 683120728 683236542 683157501 683068924 682137985 680567169 679009857 677658463 676204376
2840.1 676204376 674487381 673215714 672230682 671108017 669593048 668262177 666975784 664712982
2847.8 664712982 661717987 658822632 657077866 656308060 655883484 655930786 656649323 657447739 657535095
2856.5 657535095 657319031 657125931 657353897 657556152 657323074 657660522 658522415 659083176 659377365 659851227
2866.1 659851227 659724503 658740616 658093491 657630844 656655579 656090393 656416550 657031937 657908859 658291321
2875.8 658291321 657758255 656909943 656174164 655649338 654937286 654351273 654185104 654405441 654654999 654584198
2885.4 654584198 654106369 652980652 651873093 650758820 649588318 648874207 648393784 648113480 648075790
2894.1 648075790 648002548 647521973 646885376 645845566 644317245 643047867 642002258 641019440 640095444
2902.8 640095444 639903107 640342865 640171814 639496727 638680611 637305717 635543594 633848915 632239304
2911.4 632239304 631096077 629692497 628010292 626980820 625418892 623446999 621712189 619786453
2919.2 619786453 617981758 616445427 615380783 615237198 615901146 616365051 616883926 617460365 617124138
2927.8 617124138 617253036 618154526 618649139 619231377 620048943 621041451 622633858 623956642 625269814
2936.5 625269814 626935387 627748947 628381577 628819427 628973503 629648437 630462227 631634979 632691765
2945.2 632691765 633301888 633658028 633461571 632956276 632337227 631826019 631258430 631245499 632075729 632551498
2954.8 632551498 633184128 634078674 634190292 633739204 633109932 633043671 633871346 634836464 635537109 636151810
2964.5 636151810 637288322 638734131 639723816 640039902 639917221 640182419 641035690 642045593 643144073
2973.2 643144073 644313126 645061340 645526505 646052704 646259460 646190948 645839081 645665283 645720825 645794754
2982.8 645794754 646400604 647291641 648119125 648408585 648433914 648067627 647353439 647337265 647385788 647406006
2992.5 647406006 647347717 647291336 647808990 648327408 648428802 648214645 647880096 646732330 645567017 645270844
3002.1 645270844 645343704 645713196 645643311 645490494 645653610 645815582 645655060 644824677 643864670 643203888
3011.7 643203888 642770767 642665253 643302917 643521347 643122787 642741852 641852417 641505127 641214752 640405655
3021.4 640405655 639998665 639770393 639417343 639303322 639722176 639523659 638889275 638716202 638356857 637456436
3031 637456436 636518784 636255760 636303749 636514587 636702499 636444168 636078300 635332603 634291039 633589058
3040.7 633589058 632741432 631846008 631433525 631154480 631255608 631366577 631367493 631162910 630108681 629433708
3050.3 629433708 628765335 627573929 626755943 626410141 626539459 626589012 626188583 625898247 625789108 624516754
3060 624516754 623176842 623017082 622871437 622682724 621993752 621972847 622676964 622398491 621767159 621171913
3069.6 621171913 620635185 619477081 618198433 617787628 618002243 618367920 618393860 618358269 617886391 617199173
3079.2 617199173 616067696 614801407 614288063 613883781 613751907 613741989 613937302 614143028 614028816 613310699
3088.9 613310699 612153778 611577530 610744438 610187683 610115929 609847908 609596672 609056664 608873482 609131660
3098.5 609131660 609095230 608033485 607078667 606595001 605710602 605283051 604873390 604503250 604672318 605150261
3108.2 605150261 605183830 604470215 603594666 602058144 600816498 600774269 600926437 600502510 600229187 600269356
3117.8 600269356 599595032 599066353 598916359 598312569 597075882 595660706 594754715 594756508 595140076 595088425
3127.5 595088425 595178490 594712410 593806725 593125725 592176018 591302872 590665283 590694160 590976486 591139603
3137.1 591139603 590670395 589822845 589564972 588588791 587527695 586964264 586471596 586381874 586102371 585455360
3146.8 585455360 584930992 585001869 584857101 584193764 583336830 582409859 581443176 580448875 580226517 580501137
3156.4 580501137 580763283 580283508 579517479 578908844 577730255 576856995 575902100 575049858 574811630
3165.1 574811630 574551125 574375534 573994789 573569984 573195343 572425346 571130676 570359116 570318794 570260391
3174.7 570260391 569943085 569361610 569407539 569018898 567938843 567229919 566862450 566828957 566048813 565035324
3184.4 565035324 564250336 563448792 562938766 562555389 562294350 561603279 560829201 560143623 559643555 559517555
3194 559517555 559059258 558725204 558683014 558254929 557384605 556857109 556446381 555687599 555124664 554387360
3203.6 554387360 553629608 553395615 553196945 552827835 552540245 552108002 551468887 550932541 550486946 549968910
3213.3 549968910 549060783 548488655 548027000 546889000 546185036 545926361 545528221 545170288 544957733
3222 544957733 544688797 544095230 543603210 543294067 542853317 542290154 541845589 541493988 541023598 540656433
3231.6 540656433 540164566 539391212 539035149 539005356 538642807 537953224 537447548 537149734 536472931 535787888
3241.3 535787888 535195732 534628563 534683800 534570923 533983574 533560257 533420906 533463860 532952118 531905365
3250.9 531905365 531366272 531147118 530320549 529724274 529738503 529720497 529532318 528936539 528224983 527337151
3260.5 527337151 526855545 526850853 526510582 526380539 526179619 525702934 525670815 525754242 525078583 524263191
3270.2 524263191 523930435 523708878 523665276 523081856 522270775 522091408 522039032 521713638 521412315 521209030
3279.8 521209030 520601997 520348358 520204926 519380379 518574867 518342285 518435326 518098221 517747307 517169609
3289.5 517169609 516794319 516982918 516324081 515689392 515409012 515204506 515157890 514650192 514416733 514417839
3299.1 514417839 513815613 513167229 512780380 512314758 512218323 512191772 511769218 511382065 510823479 510196114
3308.8 510196114 510013275 509870949 509215622 508780899 508676796 508278999 507701263 506992760 506342201 505738831
3318.4 505738831 505569305 505377655 504763947 504152946 503941689 504713402 504574776 503353386 502316246
3327.1 502316246 501568947 501460419 500827713 499989891 499246368 498406525 498230972 498204956 497681999 496646271
3336.7 496646271 495878716 495489502 495250626 494894485 494151039 493573952 493456726 493498459 492870369 492042542
3346.4 492042542 491559448 491265945 491035194 490765266 490458069 489774818 489338379 488806953 488053856 487694397
3356 487694397 487487411 487368507 487185402 487386169 487133942 485959816 484693146 484395294 485178108 484981232
3365.7 484981232 484734726 484934006 484335747 483938446 483618622 482814980 482299500 482063408 481752777 481824265
3375.3 481824265 481468048 481150970 481280174 480717926 480359268 479689865 478894958 478981819 479423256 479630966
3384.9 479630966 478786278 478349991 478529739 478377686 478376350 478338890 478327904 478223839 477666245 476717834
3394.6 476717834 476066399 476330185 476692734 476662483 476474533 476011734 475609131 475447922 475149956 474770355
3404.2 474770355 474379196 474117851 474286118 474981613 475384750 475100822 474835587 474371605 474202919 474333153
3413.9 474333153 474082642 473987999 473953362 473922653 474431038 475042343 474527130 473606529 473409882 473670731
3423.5 473670731 473710709 473463821 473833313 474238510 474565010 474532890 474065208 474137688 474347076 474777908
3433.2 474777908 474831123 474472313 474355431 474862480 475616341 475582809 475526161 475252953 475058403 475023422
3442.8 475023422 475188751 475600395 475892372 476341782 475312920 475414925 476300049 476509171 477633743
3451.5 477633743 477767258 477819252 478013878 478144608 478772507 478525009 478541336 478742447 479373093 480242004
3461.1 480242004 480429764 480293961 480400505 481389351 482089462 482510834 482484589 481992035 482050896 482774048
3470.8 482774048 483932190 484291725 484323120 484631119 484668007 484922295 485873299 487092285 487721062 487812958
3480.4 487812958 487771988 487598114 487861786 488910904 489453583 489779968 490112343 489709625 490110245 491113319
3490.1 491113319 492107353 492499466 492497673 493376503 494110413 494255028 494189110 494626846 495281258 495567207
3499.7 495567207 496123810 497060661 497939377 497830887 497721329 498304024 498709030 499420967 501295547
3508.4 501295547 502431221 501973877 502540359 503099136 503709259 504395676 504396591 504888535 505679817 506663513
3518 506663513 506960335 506667862 507302094 508829269 509365654 508445930 509206543 510345230 510895157 511819000
3527.7 511819000 512493401 512981758 513972816 514850044 515291481 516097450 516572304 517496567 518297424 518443832
3537.3 518443832 519464874 519967155 520102158 520685120 522404480 523708763 524157333 524588814 524365578
3546 524365578 525014763 524891510 526298218 527723312 528810081 531159554 530056877 530033531 530915489
3554.7 530915489 532045364 533764458 533822021 535576935 536744957 536919289 537184563 538405724 539405670
3563.4 539405670 539124146 541811256 541524773 540910263 540898819 539888039 543449516 545472450 546393547
3572 546393547 547634354 549112282 549666367 549729729 551209908 551660957 553974190 555484810 555082283
3580.7 555082283 556072769 557158928 557883110 558134232 561626740 563222656 560231094 560400200 560480843
3589.4 560480843 564001350 566922607 568208656 567908554 567801514 569704094 568259315 570216751 572702751
3598.1 572702751 572765427 574899826 575258141 575590172 577951355 579777832 580485306 582817230 585550575
3606.8 585550575 584524231 586980057 586497116 585820274 591879120 592047272 589156036 592143440 591485214
3615.4 591485214 594796295 599067535 598636513 599171448 597558250 597470245 600534973 602923126 604188385
3624.1 604188385 606072540 607646675 609571724 616073837 614599304 603972816 608497314 613063698
3631.8 613063698 617971764 618769951 617200966 619248734 621834259 624069672 624616547 626151428 628383675
3640.5 628383675 631041336 632784653 632356644 633421593 636356430 642092819 641216354 635512466 638952293
3649.2 638952293 638670197 636348305 636519356 642040482 646305084 649418869 653255386 646389999 647904434
3657.9 647904434 652761765 653657227 654056396 654034653 655981140 656987381 657698975 658613586 658746185
3666.5 658746185 662147446 662996216 660816574 661826706 657055511 659118805 666160583 673214493
3674.3 673214493 670148010 653180771 657298508 664885483 669092255 667252502 668454819 671077576
3682 671077576 671565323 671970901 671298370 671114197 674336472 679846802 672082214 667366791 674210129
3690.6 674210129 669009323 669209595 673876495 674142303 676018219 676536255 675900955 676457520 676155396
3699.3 676155396 677695923 679994659 674822159 672551727 677278976 678420105 678592911 679519806 680925827
3708 680925827 682846756 675909729 679206390 682893372 672651215 677100830 681641312 682386017 682739105
3716.7 682739105 684479370 685157166 681027451 681084671 686044922 682258377 677455292 682000351 682763138
3725.4 682763138 681910095 678681717 678824234 682571945 682932053 687413177 685318756 679141006 687188568
3734 687188568 687450256 677743454 679086227 681987610 682161026 684944992 688366318 685662384 688405380
3742.7 688405380 698848495 689312820 672369080 681206970 686006241 691289673 688461227 679296036
3750.4 679296036 690293579 686229935 679088974 684233780 688955765 692309799 687413483 688995743
3758.2 688995743 693649063 686764603 685027695 688555908 689776077 690285645 693382645 690826721
3765.9 690826721 686419144 689216232 694142075 694230194 685107269 687160873 690682068 690811844 691371002
3774.5 691371002 691165161 691932068 692615433 694922028 694154129 686838760 688742523 691144409 692257309
3783.2 692257309 693648529 691009521 690412521 691401138 691711731 692205734 691951218 691863327 691954803 692212296
3792.9 692212296 691474075 692382126 694835815 690759277 687961426 690506210 694252625 699080200 692266769
3801.5 692266769 682607498 686102753 689220963 693671570 698949280 690460892 686043549 690186386
3809.3 690186386 691995163 692543182 692781754 692831192 693934937 697902222 694916229 682725449 688344269
3817.9 688344269 693042831 695055618 694457855 679279785 682828674 688772583 691339722 693890915
3825.7 693890915 693267975 689803543 690376663 691689224 694679794 695729675 687057190 689433289 695547791
3834.3 695547791 689115143 688134079 696530838 689239502 683799667 691123276 687075043 688297653
3842.1 688297653 694646301 691902008 688832245 690999603 692507172 692285919 693724670 693259277 694178009
3850.7 694178009 699408493 693321381 691312408 678745041 681121292 690722122 689815140 688086395
3858.4 688086395 689967499 692558899 694744415 689485703 689528275 694274368 688123703 684130249 688608627
3867.1 688608627 693349228 698021927 691294250 683328018 687073593 692109985 694205170 686429520
3874.8 686429520 687297897 690463715 690497360 692890091 696734848 691637573 685182037 690143967 691302872
3883.5 691302872 692410507 696593704 685521011 686923065 691095734 691292877 694308090 692641678
3891.2 692641678 685204773 687168350 690165482 688770370 689754486 690963440 692503586 693510895
3898.9 693510895 685802689 689821854 690690155 684933395 688837128 686979065 686534500 688234024 689591904
3907.6 689591904 691299820 690547333 690375290 690252151 691036987 691308823 690102768 691264420 693175659
3916.3 693175659 690053558 686969681 690514755 690494385 687509995 689849701 691175613 691841507 689825134
3925 689825134 686936111 688290253 689675140 691090546 690278931 689840317 690722733 687088547 686523666
3933.7 686523666 688552780 689107208 690067368 690327301 689588089 689069901 688814316 689890060 690158768
3942.3 690158768 685797348 685426331 688152466 689427414 689824677 687455292 687951965 688793945 686770935
3951 686770935 688084488 688508453 687814713 688027649 688332748 688617477 688174515 688970108 689244614 689504166
3960.7 689504166 689744339 688290634 688194809 687846985 687209320 687979050 688792877 689441376 689240341 688316116
3970.3 688316116 688024139 687807465 687769165 687830505 687476501 687747879 687729263 687616043 688306046 688663177
3980 688663177 688810730 688598633 687719574 686675873 686294479 686755524 687804565 688507690 687822037 687353134
3989.6 687353134 687567444 687959671 687859421 687384644 687652893 687398605 687644501 688039169 686955109
3998.3 686955109 686987534 687501907
4000.2 687501907
##END=$$ End of the data block
