##TITLE=$$ Begin of the data block
##JCAMP-DX=5.00 $$ ACD/SpecManager v 10.08
##SPECTROMETER/DATA SYSTEM=Varian
##DATE=08 Jan 2013 14:52:00
##DATA TYPE=INFRARED SPECTRUM
##DATA CLASS=XYDATA
##ORIGIN=
##OWNER=
##NPOINTS=3735
##FIRSTX=399.26403809
##LASTX=4000.35498047
##MAXX=4000.35498047
##MINX=399.26403809
##MAXY=79.09597015
##MINY=47.14024353
##XFACTOR=1.0000000000
##YFACTOR=0.000000100000000
##FIRSTY=68.85166168
##DELTAX=0.96440572
##XUNITS=1/CM
##YUNITS=TRANSMITTANCE
##XYDATA=(X++(Y..Y))
399.3F88516617J983871n300064l043670J608810l465424j0276413p446746k642899
407F59934082m872742J587525J1947784J2195587P913132J91498q563233j3385696
414.7F66947937n929947k407837o566314n946351R126816J2335663O520615Q929977
422.4F83010559k734680j0830765r789734q463287L500290M319610N631943R393158
430.1F74037094Q873520K090225j2423401j0341034k934951P95898L510437p73773
437.8F62834015L977814P666244L440476l682023p574081l886185n293884o575851
445.6F50906525o265793N945968J3364106R980926P186279J831360o921997r645538
453.3F66381836m973068l134537j454086n574189o123199J5936203J6347427M857636
$$ plain form
399.3 688516617 690500488 685200424 682156754 683765564 680300140 670023727 662576981 659934082
407 659934082 655061340 656648865 668596649 680792236 688705368 688896866 680333633 666947937
414.7 666947937 661017990 658610153 652043839 646097488 655224304 667559967 674080582 683010559
422.4 683010559 680275879 669445114 659655380 651192093 654692383 659011993 664643936 674037094
430.1 674037094 682910614 685000839 672577438 662236404 659301453 660097351 663607788 662834015
437.8 662834015 666811829 674478073 677918549 674236526 666662445 662776260 657482376 650906525
445.6 650906525 644640732 650586700 663950806 673931732 681118011 682949371 676027374 666381836
453.3 666381836 661408768 658274231 656820145 651245956 645122757 661058960 677406387 682264023
461F82264023r247055j0478821q792496m646072M257355M022293K370300M683075O100235
469.7F70532837K558365P96661j587982j2856216q269196j796112j139908K551117
477.4F50789566J0183106J1291656N444336o143417j2729416q114853n590515k021485
485.1F43108978N139771Q282928O655350P743759N114212l872604q053055p710953
492.8F56408386o015396l633270P46765R327087R573670L276977p93686r62677j842041
501.5F66085815r876861p755966l272400o20499L973160Q362045R061966K636948j986771
510.2F66607437k715225o998825p799225m168930p35626J655273N146179Q092957N712280
518.9F64796295J587753l084259o862411p261047n020142l574982P02820O326828O978073
$$ plain form
461 682264023 673016968 662538147 653745651 649099579 653356934 657379227 659749527 664432602 670532837
469.7 670532837 673091202 673887863 672299881 659443665 651174469 649378357 648238449 650789566
477.4 650789566 660972672 672264328 677708664 671565247 658835831 650720978 645130463 643108978
485.1 643108978 648248749 656531677 663187027 670930786 676044998 672172394 664119339 656408386
492.8 656408386 650392990 646759720 647506485 656833572 666407242 669684219 668890533 667927856 666085815
501.5 666085815 656208954 648452988 645180588 644560089 648533249 656895294 665957260 668594208 666607437
510.2 666607437 663892212 656893387 649094162 644925232 644189606 645844879 650991058 659084015 664796295
518.9 664796295 666384048 663299789 656437378 649176331 644156189 640581207 641284027 647610855 654588928
527.5F54588928N648728J711883l420334o069946o190262l544998p08160P24945M327850
536.2F47068634O419525N357361K713165k230072n981369o701355o155166k937737
543.9F37552986R80148L465996O840287P200775K977218r90982m705200m587097n007324
552.6F43726807m485665l395J508179L874969M748841K889404l8605k737732m035949
561.3F45446854o182328l933525P81136L742142M417877N644150M341812O38046l32947
570F54563217m730530n999908l339539k823944J262970M698029P671356M612503j101990
578.6F54812164k142486m139252n854187l178215j284409N7450M610481N889511M661255
587.3F53432312L709488j534729n539551n584946m083862j811867j61132L496818O397095
$$ plain form
527.5 654588928 660237656 661949539 658529205 652459259 646268997 642723999 642015839 642740784 647068634
536.2 647068634 653488159 658845520 661558685 659328613 653347244 646645889 640490723 637552986
543.9 637552986 638533134 641999130 648839417 656040192 659017410 658026428 653321228 648734131 643726807
552.6 643726807 639241142 639237747 640745926 644620895 649369736 652259140 652220535 649482803 645446854
561.3 645446854 639264526 635331001 636112137 639854279 644272156 649916306 654258118 654896164 654563217
570 654563217 649832687 643832779 640493240 637669296 638932266 643630295 651301651 655914154 654812164
578.6 654812164 652669678 648530426 642676239 639498024 638213615 638271065 642881546 648771057 653432312
587.3 653432312 657141800 655607071 650067520 644482574 640398712 638586845 638425713 641922531 648319626
596F48319626O643600L155060j832809m449311n693283n470504k312890J617928K935257
604.7F42912674M350204M457093K220764r89151l616943n313187n483666k810478j065025
613.4F34662285J895218M927177M034500J621170K56501j29624k951126m020080k157784
622F38138237j622238J181526M895096O594925N021515J948623j275253m380875n583343
630.7F44918213m674835j334534L025818M820251N172882N089341K261734j550370
638.4F57728500l415451m139862l224258j338196k69470J723480N170441O704712L726120
647.1F62666016j404496l840026m413071m364472l412323j190033K924271N446777
654.8F52412643N047074N148315K868119j977616n584488n316314l346024j907883
$$ plain form
596 648319626 654963226 658118286 656285477 651836166 646142883 640672379 638359489 639977417 642912674
604.7 642912674 647262878 651719971 653940735 652951584 649334641 644021454 638537788 635727310 634662285
613.4 634662285 636557503 641484680 645519180 647140350 647396851 647267227 644316101 640296021 638138237
622 638138237 636515999 637697525 642592621 649187546 654209061 656157684 654882431 650501556 644918213
630.7 644918213 640243378 638908844 641934662 646754913 651927795 657017136 659278870 657728500
638.4 657728500 654313049 650173187 646948929 645610733 645341263 647064743 652235184 658939896 662666016
647.1 662666016 661261520 657421494 653008423 648643951 645231628 644041595 646965866 652412643
654.8 652412643 657459717 662608032 665476151 663498535 657914047 652597733 649251709 647343826
662.5F47343826J145554N481110P840576M603576n228042l4540978R365578J1086655
670.3F47097855Q02307j624298P48825L353347N841675N675202M127350M07867j960068
678.9F64470062m375000p448730l974991K252274M559249L417969N472794O723251
686.7F71096878K041016k441025m786759m082183k895127j127701K708207M785080
694.4F65298386N185623M711303L127289R4834l444519n092240m800262k598343Q75778
703.1F63357849M533997O012649N879441M061813O04553k491989n259323m912338k513428
711.7F69273224R8266K336579L774109N539551M184417J745606q13904n729370o077652
720.4F74330826j585312j54343R55811M546203N948716M706268L408737O95648l096161
$$ plain form
662.5 647343826 648489380 653970490 661811066 666414642 661186600 626645622 636011200 647097855
670.3 647097855 647900162 646275864 647024689 650378036 656219711 661894913 666022263 666430130 664470062
678.9 664470062 660095062 652646332 648671341 650923615 655482864 658900833 664373627 671096878
686.7 671096878 673137894 670696869 665910110 661827927 658932800 657805099 660513306 665298386
694.4 665298386 670484009 675195312 678322601 678417435 674972916 669880676 665080414 662482071 663357849
703.1 663357849 667891846 673904495 679783936 683845749 684450302 681958313 676698990 671786652 669273224
711.7 669273224 669371490 671708069 675482178 681021729 685206146 686951752 686137848 680408478 674330826
720.4 674330826 672745514 672591171 673546982 678093185 684041901 688748169 692156906 692852554 689756393
729.1F89756393n045166m595871k576370M77753K459106M838791O318970M196091J197128
737.8F97026825j893234m131012m758911l407441j068573J686249M258652M674072
745.5F92386627M191132K081833j48392k529297m933395k328873L67813Q37631K189637
754.2F92114716L399505L565445L720474J852112k320862l678360l510437k062530
761.9F93080063N5084K364121M093170K941742L093033J953048r87243l199311m603882
770.6F98789825k875061p84607J589814M172973M761658K896347M52881j089478k906570
779.2G05007782l637695l337250j393509Q40302K795715M299621M149933K954941p54776
787.9G10925064k773666k463608k695770k212677l46299K751313M525833L990326J625671
$$ plain form
729.1 689756393 684711227 680115356 677538986 678016739 680475845 685314636 691633606 695829697 697026825
737.8 697026825 695133591 691002579 686243668 682836227 681767654 683453903 687712555 692386627
745.5 692386627 696577759 698659592 698511200 695981903 691048508 688719635 689087448 689925079 692114716
754.2 692114716 695514221 699079666 702800140 704652252 702331390 698653030 695142593 693080063
761.9 693080063 693135147 695499268 699592438 702534180 705627213 707580261 706593018 703393707 698789825
770.6 698789825 695914764 695130157 696719971 700892944 705654602 708550949 709003830 707914352 705007782
779.2 705007782 701370087 698032837 696639328 697479630 700275345 704574966 708724899 711679840 710925064
787.9 710925064 708151398 705687790 702992020 700779343 700433044 703184357 707710190 711700516 713326187
796.6G13326187o42319j538086k567062l583908k929611m81796J667404K548599K805023
805.3G08604431L021698M05121k840500m030762m218978k290879r23538P85751J957932
814G00470276K985687L573074R61915q72498l228989m399871k944642p59201P77741
822.6F96563492K137604M909133M673996L345108M47236k658997k124252j969528o09742
831.3G04714050J100769L086319M700699M263458L570099K062531p43866l634491l293457
840G15826111j368485J829071K691727K553482M779663L440171J151275o90231j797028
848.7G28415756k843475k245865k14539K44828L147278M130477L986664L771897J743393
857.4G40136414j423264m400406k884140k029648k80838K167511L772583M117737K630386
$$ plain form
796.6 713326187 712683868 711145782 708578720 704994812 702065201 701583405 703250809 705799408 708604431
805.3 708604431 711626129 712031250 709190750 705159988 700941010 698650131 697726593 698512344 700470276
814 700470276 703455963 707029037 707990952 707118454 703889465 699489594 696544952 695785751 696563492
822.6 696563492 698701096 703610229 708284225 711629333 712076569 709417572 707293320 705323792 704714050
831.3 704714050 705814819 708901138 713601837 717865295 721435394 723497925 722754059 719119568 715826111
840 715826111 714457626 716286697 718978424 721531906 726311569 729751740 730903015 730212784 728415756
848.7 728415756 725572281 723326416 723111877 723356705 726503983 730634460 734621124 738393021 740136414
857.4 740136414 738713150 734312744 731428604 729398956 729118118 731285629 735058212 739175949 741806335
866G41806335K421189j252136l786087n343400n868148k630463k46353J709747K210922
874.7G29021606K980347K353058o49109k941971l196640j732712p99484P7286R20258
883.4G26032639M223327M582596K328186J297607j873626l050232m189377l521576
891.1G25829544j521988j11389K539444L392639L275147J533203L204k398453m197464
899.8G28343887l340759l142166r69467J918716L526154M013977L581772J175613j397705
908.5G33710022j887131l065567k111587k43759J359558L119430L548584K725525L22342
917.2G37477417j993027l711395l584824l582306k398529J09559J510849K485427J107483
925.8G27420654K80533q74557k941513l750458m234772l127289j212082O87333J521835
$$ plain form
866 741806335 744227524 742975388 739189301 733845901 727977753 725347290 725100937 726810684 729021606
874.7 729021606 732001953 734355011 733705902 730763931 727567291 725834579 725035095 725112381 726032639
883.4 726032639 730255966 734838562 737166748 738464355 736590729 733540497 729351120 725829544
891.1 725829544 724307556 724196167 726735611 730128250 733403397 734936600 734939804 732541351 728343887
899.8 728343887 725003128 721860962 720891495 722810211 726336365 730350342 733932114 735107727 733710022
908.5 733710022 731822891 728757324 726645737 726401978 727761536 730880966 734429550 737155075 737477417
917.2 737477417 735484390 731772995 728188171 724605865 722207336 722316895 723827744 726313171 727420654
925.8 727420654 727701187 726826630 723885117 720134659 715899887 712772598 711560516 712247849 713769684
934.5G13769684K486343K476807K92282j236954l175583l651657l179550k738571j024551
943.2G04018250J224365K608566J879883R40857j22910j071396k084274l042450k399444
951.9G01951447n31769J433105J760864J967698J046218r88998j749878k885284l414383
960.6F98589020l006363j725769k76413L73688J057510P78885K11410j335144l177490
969.2F91489334k915268k488098k121658r59168l96805l52020r6588l91998j500092
977.9F80267639k782669l305740k848664k839813k525024j756821j461487o34994r76792
986.6F61135635k146988l056716l558579l153839k844009k287217k135696j187210
994.3F40765381m09851q62770j041603j852303k057228k475891k682800j941376j446762
$$ plain form
934.5 713769684 716256027 718732834 719025116 717788162 714612579 710960922 707781372 705042801 704018250
943.2 704018250 705242615 707851181 709731064 710671921 710549011 709477615 707393341 704350891 701951447
951.9 701951447 701419678 702852783 704613647 706581345 707627563 706638565 704888687 702003403 698589020
960.6 698589020 695582657 693856888 693580475 693954163 695011673 695790558 696001968 694666824 691489334
969.2 691489334 688574066 686085968 683964310 683005142 682608337 682256317 682159729 681767731 680267639
977.9 680267639 677484970 674179230 671330566 668490753 665965729 664208908 662747421 662112427 661135635
986.6 661135635 658988647 655931931 652373352 649219513 646375504 644088287 641952591 640765381
994.3 640765381 640355530 639492760 638451157 636598854 634541626 632065735 629382935 627441559 625994797
1003F25994797p22466m20723p41615j570206j477775j663513k310753k261582k026520
1011.7F12799644j258010n23949K72140n59158r01642o20117j654053k201996k968978
1020.3F02383881k612534j554909q68873o60782o23779k89307p57218j685791k438926
1029E90891762k070351j832924j218757q26302K29454J486130N11970P91207M76989
1037.7E88439178P32232N80520l61938l3951l78990J157264J950112J567688P08885
1046.4E94361000K39945J34964j419487k357789l037262j457099k27509M04663O27060
1055.1E87268486p39479l45459o65398o44416j257782q56324P84493J324615K534867
1063.7E87403603K249565K502861K387390J183624o3629k05383l99361r12552L85895
$$ plain form
1003 625994797 625272331 624851608 624109993 622539787 621062012 619398499 617087746 614826164 612799644
1011.7 612799644 611541634 611017685 611289825 610730667 609829025 609208908 607554855 605352859 602383881
1020.3 602383881 599771347 598216438 597347565 596686783 596063004 595773697 595016479 593330688 590891762
1029 590891762 588821411 586988487 585769730 584943428 585172882 586659012 587170982 587962189 588439178
1037.7 588439178 589171410 589751930 589389992 589356041 588977051 590134315 592084427 593652115 594361000
1046.4 594361000 594600945 594735909 593316422 590958633 587921371 586464272 586236763 586641426 587268486
1055.1 587268486 586529007 586183548 585518150 584873734 583615952 582759628 583544121 584868736 587403603
1063.7 587403603 589653168 592156029 594543419 595727043 595663414 595458031 595058670 594146118 594532013
1072.4E94532013L68843J153297J575203J428757Q58841l22685j37558j703301j328888
1081.1E96424522p8544R01260J630821J163063K007447J672744J451951M65469m27094
1089.8F05211639l28178n67932j29776M43077J588783K048455K399978J462174N63125
1098.5F12691345k74467r87549k36740j167298R6322J738929J743775J580200J183052
1107.1F16367569J232033r22470j652451j095924p68776K37694P11326J298828J907654
1115.8F17315483K678528J555519j09367j160660j066933o58264p94983K86980O95648
1124.5F18741951J468964J385460J352233J197625J93252N86281k54250P63207J580162
1133.2F27014885J030731J886101J951294K371750K190475J442528M72488j05552l62740
$$ plain form
1072.4 594532013 594900856 596054153 597629356 599058113 599916954 599594269 599456711 597753410 596424522
1081.1 596424522 596345978 597247238 598878059 600041122 602048569 603721313 605173264 605638733 605211639
1089.8 605211639 604883461 604315529 604185753 604628830 606217613 608266068 610666046 612128220 612691345
1098.5 612691345 612416878 611429329 611192589 610025291 610121613 611860542 613604317 615184517 616367569
1107.1 616367569 617599602 616677132 615024681 613928757 613159981 613397675 614109001 615407829 617315483
1115.8 617315483 619994011 621549530 621440163 620279503 619212570 618554306 617759323 618046303 618741951
1124.5 618741951 620210915 621596375 622948608 624146233 624339485 624925766 624671516 625434723 627014885
1133.2 627014885 628045616 629931717 631883011 634254761 636445236 637887764 638360252 638254700 637891960
1141.9F37891960p92961K27966R33915J503219J146622P58438R38339j59454n25742
1150.5F41922302j150360j482811l21731O21109Q24623N35812M91333J00174m04587
1159.2F41135864n00412q52127j535835r24378O10886J224938J573867J767350J982421
1167.9F44482574K087784J918946J382675O17141M57917J354904K131271K101517K132187
1176.6F58666916K060089K024612J657563J093673J112900J240921J368180J588668
1184.3F70813522J324234Q02460N18189P73773J269836Q32367K11258k11792j96533
1193F76137314J27182k22702l89786m70276m37546J13831J13068k43302n20172q14819
1202.6F73392792m60358n52292m66614K35596m17480m97971p2708k05078n6381k49329
$$ plain form
1141.9 637891960 637098999 637326965 638260880 639764099 640910721 641669159 642607498 642448044 641922302
1150.5 641922302 640771942 639289131 638967400 639588509 640413132 640948944 641440277 641540451 641135864
1159.2 641135864 640635452 639783325 638247490 637323112 637933998 639158936 640732803 642500153 644482574
1167.9 644482574 646570358 648489304 649871979 650489120 650947037 652301941 654433212 656534729 658666916
1176.6 658666916 660727005 662751617 664409180 665502853 666615753 667856674 669224854 670813522
1184.3 670813522 672137756 672940216 673458405 674232178 675502014 676334381 676545639 676333847 676137314
1193 676137314 676264496 676041794 675652008 675181732 674744186 674858017 674971085 674727783 674207611 673392792
1202.6 673392792 672932434 672380142 671913528 672149124 671731644 671233673 671160965 670955887 670899506 670650177
1212.3F70650177l13721j26342k08054n89981k99378K24839q2550j58081J98593K75039
1221.9F69570541j57623k5711J30234m30298m63028m46548q68607q71506j20315p8431
1231.5F66238708J16349O57882p1411k72522O6071k94266p55310m78668j48163k43378
1241.2F64815292K41700L90319J26572R1400Q3695k72293r47190q72192l42941r7657
1250.8F63216705L2883N71213M62723M2877K46048j91422k31170j1521o67877p49207
1260.5F62721252j08184L61938R06296J043243O97480M80728J07879J07346L85895
1269.2F66703873J74560R3842M25873J067199R76486O15082Q00858Q81653N42984r6207
1278.8F72186203M6616%L75518J266022P27768P83920J301346J333389O51093j18866
$$ plain form
1212.3 670650177 670336456 670210114 670002060 669412079 669112701 669337540 669254990 669096909 669295502 669570541
1221.9 669570541 669412918 669387207 669517441 669087143 668624115 668177567 667308960 666437454 666317139 666238708
1231.5 666238708 666355057 667012939 666941528 666669006 666735077 666440811 665685501 665206833 665058670 664815292
1241.2 664815292 665056992 665447311 665573883 665665283 665748978 665476685 664529495 663657303 663314362 663216705
1250.8 663216705 663249588 663820801 664283524 664326401 664572449 664381027 664149857 664138336 663470459 662721252
1260.5 662721252 662613068 662975006 663881302 664924545 665622025 666102753 666210632 666317978 666703873
1269.2 666703873 666878433 666972275 667398148 668465347 669441833 670056915 670857773 671739426 672282410 672186203
1278.8 672186203 672232819 672232819 672608337 673874359 674602127 675386047 676687393 678020782 678671875 678553009
1288.4F78553009L86200M77142K29264p6142K00119O98700M98810K42615L69797N62057
1298.1F82141571J47171j82877n87463k18124n7144j83030K76719O5155J47857m50287
1307.7F81099548n94940m11301p67822o26373j132202p79038J4572N04075L68576j6404
1317.4F77658691k64358o14090P80258J145401N21469N2109j00021J94625J46790O03027
1327F80123901K14920J4420p3090n93872j70135r3842l81164n35584p21741q81805
1336.7F76902008m45862l49273j44349L93448J085892J612930L37677k30026N0278
1345.3F79212723j13220K04620J54343J92565L10212P85980L05786n73273r51614p92236
1355F78735886j79444q24127m53110J2360K19803l27301j090927n29938q83331N56869
$$ plain form
1288.4 678553009 678939209 679416351 679645615 679569473 679769592 680468292 680967102 681209717 681579514 682141571
1298.1 682141571 682288742 682105865 681518402 681300278 681243134 681060104 681336823 681401978 681549835 681099548
1307.7 681099548 680504608 680093307 679325485 678699112 677566910 676787872 676802444 677306519 677675095 677658691
1317.4 677658691 677394333 676780243 677560501 678705902 679227371 679279480 679179459 679374084 679520874 680123901
1327 680123901 680338821 680353241 680280151 679686279 679516144 679422302 679041138 678505554 677783813 676902008
1336.7 676902008 676456146 676106873 675962524 676355972 677441864 679054794 679392471 679162445 679212723
1345.3 679212723 679099503 679304123 679458466 679651031 679961243 680747223 681053009 680479736 679528122 678735886
1355 678735886 678556442 677732315 677279205 677291565 677511368 677184067 676093140 675563202 674679871 675236740
1364.6F75236740p6065r81827p26852j314469k08435O70319P77054M3793q02079j889114
1374.3F70729065j147080R81827q697j014405o60247J66397L02658q1253j039047j990891
1383.9F66238327j017303k62452p03353j180115Q32443Q21838K89612P22275l25317
1392.6F65415955m83399k437515l338394n94635j261368j838608k885055K20871J084823
1401.3F53882675k63214o02493j313706k432556k209472j476212j847305j492539q92029
1409.9F41353149o08368k01187j11618L91159n00106j681214k164726k126923j225967
1418.6F33124199l937225R71565K855301J503677M33006o11724L89518K97585j017647
1427.3F34008255r95216r46961J7662J603775K067452J556129J411057J293182k93999
$$ plain form
1364.6 675236740 675160675 674178848 673451996 672137527 671929092 672599411 673376465 673420258 672618179 670729065
1374.3 670729065 669581985 670563812 670555115 669540710 668880463 669046860 669349518 669268265 668229218 666238327
1383.9 666238327 665221024 664958572 664255219 663075104 663907547 664729385 665018997 665741272 665415955
1392.6 665415955 664932556 662495041 659156647 658562012 657300644 655462036 652576981 652797852 653882675
1401.3 653882675 653619461 653016968 651703262 649270706 647061234 645585022 643737717 642245178 641353149
1409.9 641353149 640744781 640543594 640431976 640823135 640323029 638641815 636477089 634350166 633124199
1418.6 633124199 629186974 630158539 633013840 634517517 634950523 634338799 634728317 635025902 634008255
1427.3 634008255 633013039 632066078 632083740 633687515 635754967 637311096 638722153 640015335 639721336
1436F39721336k912750J95313J776504J290245J347199J487274J197204J283188Q75244
1444.7F46260757Q16575J45874j026535j664429Q72574J415786M03367J054229J102829
1453.3F49381027J573029J027069k80762m327087l145676M438477K804260L116150
1461.1F54586487K228088J458435J903992j082382R74197J505509Q27026M98428O61316
1469.7F63561096J578140M3869L15171L355942M960327K977981l14255N78232J472321
1478.4F78528824J040344M53491J88523J501007K529678K052918R88311N39780j161194
1487.1F86661682j571350p64542l150940P44400L600159K466202R52454P67746o94199
1495.8F89011612m745178J442947r17892k613755O55289j41067P25708J403656J102142
$$ plain form
1436 639721336 636808586 637003899 638780403 640070648 641417847 642905121 644102325 645385513 646260757
1444.7 646260757 647077332 647223206 646196671 644532242 645404816 646820602 647223969 648278198 649381027
1453.3 649381027 650954056 651981125 651700363 647373276 644227600 648666077 651470337 654586487
1461.1 654586487 656814575 658273010 660177002 659094620 660068817 661574326 662401352 662899780 663561096
1469.7 663561096 665139236 665183105 665498276 668854218 673814545 676792526 676478271 677056503 678528824
1478.4 678528824 679569168 680022659 680211182 681712189 684241867 686294785 687283096 687822876 686661682
1487.1 686661682 685090332 684325790 681174850 681919250 685519409 687985611 688938065 689705811 689011612
1495.8 689011612 684266434 685709381 684791489 682177734 682833023 682691956 683417664 684821320 685923462
1504.5F85923462r47418p913361o289368M133301L040161L81165K041626j1292k59781
1513.1F80098495J818238k83966j569748l095246j313552J714096l41416n345917l345870
1521.8F68335114M193801L958741K252273q26187j11923m11530j362686O11115N59005
1530.5F77197723m9438k18887n31311n17502K011032J060257l49045j245728r045028
1539.2F68312073l983155M224778J363144N08575K742767K367707M73404J653366m58
1547.9F77662201o85043k103806j306610K249374J817780J257553k818909N97916K851334
1556.5F79521790P77664q567353q878860N960236L833007K953492J201858L57666j356583
1565.2F75802917j001510l01438j721954k588653p399979J961288J832123m57535m58068
$$ plain form
1504.5 685923462 684976044 677062683 670773315 674906616 677946777 678327942 680369568 680358276 680098495
1513.1 680098495 681916733 681632767 680063019 676967773 675654221 677368317 677026901 671680984 668335114
1521.8 668335114 672528915 676487656 678739929 677913742 677801819 677390289 676027603 676638718 677197723
1530.5 677197723 677148285 676929398 676398087 675880585 677891617 678951874 678602829 677357101 668312073
1539.2 668312073 664328918 668553696 669916840 670425415 673168182 675535889 676009293 677662659 677662201
1547.9 677662201 676977158 674873352 673566742 675816116 677633896 678891449 676072540 676670456 679521790
1556.5 679521790 680299454 671732101 662853241 668813477 672646484 675599976 676801834 677159500 675802917
1565.2 675802917 674801407 674499969 672778015 670189362 662789383 664750671 666582794 666125259 665667191
1573.9F65667191l40577o74362r493179J90124j046524k307892j652526k439118n12161
1582.6F47390976j088104p48291k144013k255554k640076l793945k628288l505821
1590.3F28586884j554909k050591n32417r93996k512359j482811k982483j880226l494225
1599F11102867k374229k584114k232247n50728j204834L55378j461144j446304l319931
1607.6E96284714k074013j888084k700959j08604j490250N77088o81305L67241r18579
1616.3E87367249p436486K026711q64601l33825j542968K62794l18794j661568K267342
1625E79765854M72336J370315k463226j441612K0027m73824M40255P4195K447281J645584
1634.6E81857185k361297k017861K360154J099739O37512J172752k76146J613198R78050
$$ plain form
1573.9 665667191 665326614 664652252 655159073 655349197 654302673 651994781 650342255 647903137 647390976
1582.6 647390976 646302872 645554581 643410568 641155014 638514938 634720993 632092705 628586884
1590.3 628586884 627031975 624981384 624448967 623454971 620942612 619459801 616477318 614597092 611102867
1599 611102867 608728638 606144524 603912277 603361549 602156715 602512093 601050949 599604645 596284714
1607.6 596284714 594210701 592322617 589621658 589513054 588022804 588599892 587918587 588285828 587367249
1616.3 587367249 579930763 581957474 581092873 580759048 579216080 579478874 579160080 577498512 579765854
1625 579765854 580238190 581608505 579145279 577703667 577723694 577249870 577690125 577764320 580211601 581857185
1634.6 581857185 579495888 577478027 579838181 580937920 581575432 582748184 582472038 584085236 585063286
1643.3E85063286K907715K578315j477813L88412j980934K676468J965332K135925
1651E94256706J652031o910705j491204Q018380O279106K648887J799088L68690O26602
1659.7F07247581J117821J187630J063576J201324M644356L181915K421417J800766
1667.4F23866386J150208j046791o74820K612953J766472M262009M624061K053185
1675.1F38613663K12745L585854L437195R94568q5526l95355L400726L446503j400528
1683.8F51809845N06668N954971N692368K901001J000137Q66013N22537K601090K832641
1692.5F74687271K930451L457565K383957l340073L553467M274292L277435j357269
1700.2F89867096m651108O337586M684372L159408K087631J972428J120224J912155
$$ plain form
1643.3 585063286 587971001 590549316 589071503 589459915 587478981 590155449 592120781 594256706
1651 594256706 595908737 588998032 587506828 595525208 601804314 604453201 606252289 606620979 607247581
1659.7 607247581 608365402 609553032 610616608 611817932 616462288 619644203 622065620 623866386
1667.4 623866386 625016594 623969803 623294983 625907936 627674408 631936417 636560478 638613663
1675.1 638613663 638826408 642412262 645849457 646844025 646758499 646363144 649763870 653210373 651809845
1683.8 651809845 652316513 658271484 663963852 666864853 667864990 668731003 669253540 671854630 674687271
1692.5 674687271 677617722 681075287 683459244 680119171 683672638 687946930 691224365 689867096
1700.2 689867096 685215988 691553574 696237946 699397354 701484985 703457413 704577637 706489792
1707.9G06489792K248764l66058o56510J259384J558609J922226J74103J155090L987046
1716.6G17772446k15760o394043L698121K794265O89545O60019J144943J680603K524338
1725.3G24354477K073898J035385L91922o91681l526840r65729K749482J961059j329345
1734G26052628j045990N116424L838349Q21609R04083k761535k927781K937699J328049
1742.7G34263535K13470K465286M113388K549057L15628l48129j095657J971512j335526
1751.3G43112564l31497M526062L478317L138657K716598o20346o6986O73371k60392
1760G56366348L10974k517547L43933L535614K633209K715073K416458K61993l967666
1768.7G62098389J91955J054611k842025k284394R56726M858170L593826J297608J855697
$$ plain form
1707.9 706489792 708738556 708372498 707715988 708975372 710533981 712456207 712630310 713785400 717772446
1716.6 717772446 717556686 711162643 714860764 717655029 718344574 719004593 720149536 721830139 724354477
1725.3 724354477 726428375 727463760 727855682 727164001 723637161 722671432 725420914 727381973 726052628
1734 726052628 725006638 730123062 733961411 734783020 735687103 732925568 729997787 732935486 734263535
1742.7 734263535 734477005 736942291 741055679 743604736 743920364 743572235 742476578 744448090 743112564
1751.3 743112564 742781067 747307129 750785446 753924103 756640701 756020355 755953369 756626740 756366348
1760 756366348 756677322 754159775 754503708 758039322 760672531 763387604 765804062 766066055 762098389
1768.7 762098389 762290344 763344955 760502930 758218536 759175262 764033432 767627258 768924866 770780563
1777.4G70780563k75268q59604j944351k570572K41318J313781J732102J566391K454986
1786G72439346K184983L71627j256408j273651k891083k755509j617736K122726M716950
1794.7G72041245K449035J181564J668702O57501j940842l427505j35956j088181P90100
1803.4G72195663K865296K298965K290421J007767j84479n26428j468506l121796p47757
1812.1G74609146Q97751J487732K436600J796569J923523L46070p33719r88083k157364
1820.8G79618225j085434j180038M55017J180267N60455K900391K522354N14374k378082
1829.4G83107529m541550m48608O39267l3493J320266K599411K236862J265259P1717
1838.1G86216660l1052j596451j862335j888733p79419l02887j256866M421539L582916
$$ plain form
1777.4 770780563 770505295 769645691 767701340 765130768 765372086 766685867 768417969 769984360 772439346
1786 772439346 774624329 774995956 773739548 772465897 769574814 766819305 765201569 767324295 772041245
1794.7 772041245 774490280 775671844 777340546 777998047 776057205 772629700 772493744 771405563 772195663
1803.4 772195663 775060959 777359924 779650345 780658112 780473633 779947205 778478699 775356903 774609146
1812.1 774609146 775506897 776994629 779431229 781227798 783151321 783497391 782763672 781775589 779618225
1820.8 779618225 778532791 777352753 777807770 778988037 779548492 782448883 784971237 785485611 783107529
1829.4 783107529 778565979 778117371 778756638 778723145 780043411 782642822 784879684 786144943 786216660
1838.1 786216660 786185608 784589157 782726822 780838089 780058670 779755783 778498917 782920456 786503372
1846.8G86503372M14658l26309j88370r44748k151108j417541k21253J279144K132187
1855.5G85080032K236176J418228j3809n78537j621246j798020j686401o22406O52313
1864.2G83066330J423416J808701J048813J402053j040039k407913k50931n54580q71811
1872.8G83624039k65808J295394J580430J996078J651993M41360o45675k020340j832962
1881.5G85824509j820374o39191M45557J624985K400970J531830J564636o12487l144989
1890.2G87175446j192933j005249j036453K73819O48575J347809K762298J465149L84980
1898.9G90823441n90210k059098j893158j535568m01840N13534J681595J939392J270981
1907.6G89749069M60968o09283q67310j542053j529465j336136q926J247635J953812
$$ plain form
1846.8 786503372 786918030 786591721 786403351 785458603 783307495 781889954 781668701 782947845 785080032
1855.5 785080032 787316208 788734436 788720627 788142090 786520844 784722824 783036423 782414017 783066330
1864.2 783066330 784489746 786298447 787347260 788749313 787709274 785301361 785050430 784495850 783624039
1872.8 783624039 783358231 784653625 786234055 788230133 789882126 790323486 789677811 787657471 785824509
1881.5 785824509 784004135 783364944 783810501 785435486 787836456 789368286 790932922 790320435 787175446
1890.2 787175446 785982513 784977264 783940811 784214630 784863205 786211014 788973312 790438461 790823441
1898.9 790823441 790233231 788174133 786280975 784745407 784343567 784857101 786538696 788478088 789749069
1907.6 789749069 790210037 789600754 788733444 787191391 785661926 784325790 784316864 785564499 787518311
1916.2G87518311K416534n31845o35452N79452j205444k085114k572021m02222J819611
1924.9G84901810K107773J840362J663513M46244q03223j494141j966476j519394j133881
1933.6G84042587L58811J422271J587143J548691R81598L32031j250076j561737k759628
1942.3G84701691k672959J432267J844787J236420J688080J536712L21274p43942j597138
1951G87747192j680374j514358j098633K84500J434708K332229J675415N71518k42157
1959.6G89510040j305542j812896k115937j006393k5406R31854J776657J213837J165543
1968.3G88331757O41937n08423j628265j903687j695785o49720Q80890J273804J813888
1977G86556396J650696Q15430l47977j582031k188034k109299j024017r308J345749
$$ plain form
1916.2 787518311 789934845 789403000 788767548 789347000 788141556 786056442 783484421 783082199 784901810
1924.9 784901810 787009583 788849945 790513458 790959702 790156479 788662338 786695862 785176468 784042587
1933.6 784042587 784401398 785823669 787410812 788959503 789941101 790273132 789023056 787461319 784701691
1942.3 784701691 782028732 783460999 785305786 786542206 788230286 789766998 790088272 789344330 787747192
1951 787747192 786066818 784552460 783453827 783738327 785173035 787505264 789180679 789752197 789510040
1959.6 789510040 788204498 786391602 784275665 783269272 783243866 784175720 785952377 787166214 788331757
1968.3 788331757 788973694 788465271 786837006 784933319 783237534 782587814 783468704 784742508 786556396
1977 786556396 788207092 789022522 788674545 787092514 784904480 782795181 781771164 781761856 783107605
1985.7G83107605K212524K140503J145020j75781o15845k174606k979737j498413k47192
1994.3G80914078J016845J706543J827088J652603R25293o59866j418152k144089k297134
2003G81523209j022034L10516J766815J882706J689224R85108m68521r77555j612243
2011.7G84077225j971970j773910n80216R85565J627274J760254J339569Q09860l02887
2020.4G85970764j446380k067566k147522j574402O6452J575241K027130K067719J149673
2029.1G85621109J1673r01260k042771k540970j428222K5100P47986J738587J813965
2037.7G83045197J096725O09131m84085j900101k235336j579361r54361L86581J509476
2046.4G79493866J843185J586228N98297q3008r10644j857682k168274j354065Q9875
$$ plain form
1985.7 783107605 785320129 787460632 788605652 788429871 787814026 785639420 782659683 781161270 780914078
1994.3 780914078 781930923 783637466 785464554 787117157 788042450 787382584 785964432 783820343 781523209
2003 781523209 780501175 780811691 782578506 784461212 786150436 787135544 786667023 785689468 784077225
2011.7 784077225 782105255 780331345 779751129 780736694 782363968 784124222 785463791 786273651 785970764
2020.4 785970764 784524384 782456818 780309296 778734894 778801346 780376587 782403717 784471436 785621109
2029.1 785621109 785632782 784731522 782688751 780147781 778719559 778744659 779492645 781231232 783045197
2037.7 783045197 784141922 784751053 784266968 782366867 780131531 778552170 777597809 777984390 779493866
2046.4 779493866 781337051 782923279 783521576 783438568 782527924 780670242 778501968 777147903 777237778
2055.1G77237778J035156J502304J719513J517639O60248o14624j797333j893768j603928
2063.8G77762985j382599K7848J737213K364731J454544M88586l08075r13086j243820
2072.5G79988327j877365j131058j76544M36783J161728J558380J500854M55475o91070
2081.1G81225510j575013j707611j377563n27268L01362R33532J898651J522065O19812
2089.8G81313477m65622j073685j428299j960602j108932J7242J223984J666260J380310
2098.5G79564133R01489r918n48706j209030j557618j543579p77054K95563J415024
2107.2G76530304K061157J275253N03998l86886j289673k165604j988907q54263J28708
2115.9G73814087J372223J739044J769333J076355k1515r11102j788941j805801j323166
$$ plain form
2055.1 777237778 778272934 779775238 781494751 783012390 783672638 783058014 781260681 779366913 777762985
2063.8 777762985 776380386 776408234 778145447 780510178 781964722 782453308 782145233 781232147 779988327
2072.5 779988327 778110962 776979904 776803360 777240143 778401871 779960251 781461105 781916580 781225510
2081.1 781225510 779650497 777942886 776565323 776038055 776339417 777272949 779171600 780693665 781313477
2089.8 781313477 780847855 779774170 778345871 776385269 775276337 775293579 776517563 778183823 779564133
2098.5 779564133 780465622 780455704 779906998 778697968 777140350 775596771 774819717 775115280 776530304
2107.2 776530304 778591461 779866714 780370712 779983826 778694153 776528549 774539642 773685379 773814087
2115.9 773814087 775186310 776925354 778694687 779771042 779749527 778838425 777049484 775243683 773920517
2124.5G73920517j1673P13043J380615J710434J064377N35584p15485j438751j859665
2133.2G75298996j344452m02756K41089J384049J357803J265564Q07953l00598j110382
2141.9G77197266j363831j265793j155395P1258R66416J361007J441574J043168M22439
2150.6G78718109p72018j481552j729203j264419n93949M30451J678619J788178J007614
2159.3G77781830M25796K36817j048050j694184j432418j139145q4534Q00324J689682
2167.9G75536118J727218J100235K89917r50851j566315j649475j086273l37906L79181
2176.6G73441849J583481K241058J274567J52816m67071j283188j970215j877823o49185
2185.3G72446289L88107J597290J952973J287460J088028K2965r44825j688232j813583
$$ plain form
2124.5 773920517 773908844 774621887 776002502 777712936 778777313 779312897 778597412 777158661 775298996
2133.2 775298996 773954544 773551788 773792877 775176926 776534729 777800293 778608246 778307648 777197266
2141.9 777197266 775833435 774567642 773412247 773483505 774449921 775810928 777252502 778295670 778718109
2150.6 778718109 777946091 776464539 774735336 773470917 772876968 773307419 774986038 776774216 777781830
2159.3 777781830 778207626 778444443 777396393 775702209 774269791 773130646 773046112 773846436 775536118
2167.9 775536118 777263336 778363571 778653488 777702637 776136322 774486847 773400574 773062668 773441849
2176.6 773441849 775025330 777266388 778540955 778693771 778226700 776943512 774973297 773095474 772446289
2185.3 772446289 772834396 774431686 776384659 777672119 778760147 778783112 777838287 776150055 774336472
2194G74336472j295243o06918R13925J797638J935654J273880N93338m54560j564331
2202.6G76929855j674194j895447r43374L31497J343918J847686J736069J350861k0981
2211.3G79005890j008530j806259j882324j292038m74167P53403J924057K317428J056671
2220G78594131L39509n85633j950836j996994j475983o65054M32510J650238J563950
2228.7G75905838J642609J524048r1858j175614j895523k113266j794205l62548R67331
2237.4G72606812J479492K080688J538086N80063k56119j276855j942749j942215j378784
2246G71488419J86004J251450J494751K070236R89609l10135j232910j727600j441880
2254.7G72767944j456985n01709M22516J483230K042237J710510O82068j087723j687317
$$ plain form
2194 774336472 773041229 772434311 773348236 775145874 777081528 778355408 778948746 778494186 776929855
2202.6 776929855 775255661 773360214 772416840 772748337 774092255 775939941 777676010 779026871 779005890
2211.3 779005890 777997360 776191101 774308777 773016739 772542572 773295975 775220032 777537460 778594131
2220 778594131 778933640 778348007 776397171 774400177 772924194 772259140 772691650 774341888 775905838
2228.7 775905838 777548447 779072495 778980637 777805023 775909500 773796234 772002029 771639481 772606812
2237.4 772606812 774086304 776166992 777705078 778285141 778029022 776752167 774809418 772867203 771488419
2246 771488419 771674423 772925873 774420624 776490860 777480469 777170334 775937424 774209824 772767944
2254.7 772767944 771310959 770809250 771231766 772714996 774757233 776467743 777149811 776062088 774374771
2263.4G74374771j846847j674195j182785Q4152J096039J594315J640014R84574N26352
2272.1G75596390j380005j680527j370010j585999l08532P79647J925354J779633J603851
2280.8G75359802O91071j55106j011658k656707j883011j584702P7896R32541R27506
2289.4G70697632J297226N5008K09427j669922k420349k276383j892319k09808k70233
2298.1G63520279J054840K52228M81796J43128j492920j487503l063813k335663k481155
2306.8G54591217r99832L83453j06048O6147j300126m96749j863785j791992k014466
2315.5G46467819k864456j156006j635818l77350k192078k063522j447525k192154
2323.2G32538910j089935k490387k038498l184128p82318m06494m28315P12738j975555
$$ plain form
2263.4 774374771 772527924 770853729 769670944 769755096 770851135 772445450 774085464 775070038 775596390
2272.1 775596390 774216385 772535858 771165848 769579849 769271317 770050964 771976318 773755951 775359802
2280.8 775359802 776050873 775895767 774884109 772227402 770344391 768759689 768837585 769770126 770697632
2289.4 770697632 771994858 772049866 772259293 770589371 768169022 765892639 764000320 763790512 763520279
2298.1 763520279 764575119 764827347 765309143 765452271 763959351 762471848 759408035 757072372 754591217
2306.8 754591217 753591385 753974838 753868790 753934937 752634811 752138062 750274277 748482285 746467819
2315.5 746467819 743603363 742447357 740811539 740434189 738242111 736178589 734731064 732538910
2323.2 732538910 731448975 728958588 726920090 723735962 722953644 722547150 722118835 722831573 720856018
2331.9G20856018M82788L92227J89133l502960l685074J698074R33380M22745j165771
2340.6G16620560M75540j044464j55411Q25348J77536M204407M845886Q148880L446884
2349.2G37545166m676056n434799m447556m718475o063309n299987l911591n985413
2356.9F97007980l519287l15170j25351J498413K808457l52555J479187J53656l19748
2365.6F98315582L760681K830658M614029N495453N442581M498978L415375L913574
2373.3G32286911L116074K383422K041550K812958L603744M033738M293594M266510
2381.1G58838501L500137K001419R98001K23008k08588k04239O70624J400833J417236
2389.7G68636932J492081J056900K66876j025161j853409j465836q87604n42450M60968
$$ plain form
2331.9 720856018 721338806 721731033 721920166 718417206 714732132 716430206 717363586 717786331 716620560
2340.6 716620560 717096100 716051636 715896225 716721573 716899109 721103516 725949402 734098282 737545166
2349.2 737545166 732869110 727434311 722986755 718268280 712204971 706904984 702993393 697007980
2356.9 697007980 693488693 693173523 693048172 694546585 697355042 697002487 698481674 698635330 698315582
2365.6 698315582 702076263 704906921 709520950 715016403 720458984 724957962 728373337 732286911
2373.3 732286911 735402985 737786407 739827957 742640915 746244659 750278397 754571991 758838501
2381.1 758838501 762338638 764340057 765338058 765561066 765352478 765148239 765818863 767219696 768636932
2389.7 768636932 770129013 771185913 771452789 770427628 768574219 767108383 766220779 765678329 766139297
2398.4G66139297J318970J152115R85260L44467Q8501q66546j871796j233749j101990
2407.1G64954529j29776J108169J470642J406174P56989j32370j009522j144333j632156
2415.8G65648346j336365n08957K85034J520463J157226P75452N91049l03650j134720
2424.5G66693878j625366j569901q66851M03823J041413J420746J200790M47540K7466
2433.1G67173538p84225j359787j427765j463165j058655M73709J574249J415634J134873
2441.8G65678406N50308m35944j479873j646042j238785o96793R6283R05762J414108
2450.5G63147430J045075N46570L5476o40869j576233k012405j241913n2948J012955
2459.2G60263138J221390J407699J127548Q3847m97131j197205j812744j811905r76409
$$ plain form
2398.4 766139297 767458267 768610382 769595642 769940109 770028610 769162064 767290268 766056519 764954529
2407.1 764954529 764824753 765932922 767403564 768809738 769566727 769434357 768424835 767280502 765648346
2415.8 765648346 764311981 763803024 764088058 765608521 766765747 767541199 768132248 767828598 766693878
2424.5 766693878 765068512 763498611 762631760 763035583 764076996 765497742 766698532 767146072 767173538
2433.1 767173538 766389313 765029526 763601761 762138596 761079941 761553650 763127899 764543533 765678406
2441.8 765678406 766228714 765792770 764312897 762666855 761428070 760731277 760827560 761733322 763147430
2450.5 763147430 764192505 764739075 764774551 764133682 762557449 760545044 759303131 759250183 760263138
2459.2 760263138 761484528 762892227 764019775 764103622 763606491 762409286 760596542 758784637 757808228
2467.8G57808228K42233J141205J491546J424408O57044k25907n88607j501389j701508
2476.5G58747253j449432o32400O09512Q97140J638718J159973Q6899n95703j474610
2485.2G58987350j471557j394959n92422J62582O58493J198426R59320P52639o2179
2493.9G59197693j236801j720963j197510o71844l93372O67038J198807R26972P72094
2502.6G57542114O333r31092j028671j452713j413498n07049P8735P73849J146622
2511.2G54214630J138153M26789m57077q06733j158828j120453q93784l58734M37393
2519.9G51421356R33533P71866Q83789P21741m98200j194534j699295j212235n69229
2528.6G49558792n10559O23703J700287J421966k7694o78406q69675j084366j037368
$$ plain form
2467.8 757808228 758050461 759191666 760683212 762107620 762764664 762538757 761950150 760448761 758747253
2476.5 758747253 757297821 756665421 757274933 758172073 759810791 760970764 761057663 760461960 758987350
2485.2 758987350 757515793 756120834 755528412 755690994 756349487 757547913 758507233 759259872 759197693
2493.9 759197693 757960892 756239929 755042419 754370575 753977203 754644241 755843048 756770020 757542114
2502.6 757542114 757548447 756617355 755588684 754135971 752722473 752215424 752294159 753068008 754214630
2511.2 754214630 755352783 755779572 755322495 754515762 753356934 752236481 751342697 750983963 751421356
2519.9 751421356 752354889 753126755 754010544 754732285 754234085 753039551 751340256 750128021 749558792
2528.6 749558792 749048233 749671936 751372223 752794189 752766495 752088089 751218414 750134048 749096680
2537.3G49096680p61109K84195L80173N89371J095199R02710J89820r82819j307755
2546G49486465j290054q84399m83246J63193P42340O91681J018905M53415l04794r89151
2555.6G48604355j397553j306991j059189K03705Q63342J039963J057281M13895l40042
2564.3G48078766j016235j092530o44455n23681p21665L7155P32270Q92028P06940
2573G46448593O9809m59518j068879q59527r40247q67386Q8273N05523O61698O74514
2582.6G44252853Q65097j2970q93325q81272j238937j025162o34231J04446Q60901
2591.3G41397400J142807Q60214j95694p06863p05261o56739q24661q94852m48837
2600G38967514M85077J034927P05643K07138m96597p96890r31778r28574n29480k66647
$$ plain form
2537.3 749096680 748335571 748619766 748999939 749589310 750684509 751587219 751777039 750794220 749486465
2546 749486465 748196411 747312012 746828766 746991959 747734299 748425980 749444885 749898300 749593506 748604355
2555.6 748604355 747206802 745899811 744840622 745044327 745907669 746947632 748004913 748418808 748078766
2564.3 748078766 747062531 745970001 745325546 744801865 744080200 744117355 744849625 745741653 746448593
2573 746448593 746518402 746058884 744990005 744130478 743190231 742322845 742411118 742916641 743578339 744252853
2582.6 744252853 745117950 745104980 744211655 743330383 742091446 741066284 740432053 740536499 741397400
2591.3 741397400 742540207 743400421 743204727 742497864 741792603 741135864 740311203 739416351 738967514
2600 738967514 739452591 740487518 741193161 741400299 740903702 740106812 739175034 738246460 737716980 737450333
2609.6G37450333j88828L51639J294174P29828K670m40826j281815j017761p23724
2618.3G36175690n60150R4909N10941N75561P54929O06155M959p76291j634368j439896
2627.9G34312439q75092m2114M41437M11987J065140P02972k55584p47757p55692q23364
2637.6G33434372j084442n23453N9052M36782N50995N07050R7732l45382o29273j249161
2647.2G31254272r51690n76630k85950K56806P09152J134873M90951l87268p69424
2655.9G30875092r12400j167679j085128k65198L98636O59942N84488N13306J93405
2664.6G29794464j07956o79245j648331j563949o52390J98594M71878Q07037J065903
2673.3G27686005O64825M7836q81042j195526q65479q38699q35877j56173O15082R32998
$$ plain form
2609.6 737450333 737261505 737613144 738907318 739637146 739639816 739198990 737917175 736899414 736175690
2618.3 736175690 735615540 735710449 736221390 736796951 737551880 738158035 738162994 737386703 735752335 734312439
2627.9 734312439 733437347 733395233 733836670 734248657 735313797 736016769 735761185 735013428 734257736 733434372
2637.6 733434372 732349930 731826477 731885529 732322311 732873306 733380356 733478088 733132706 732503433 731254272
2647.2 731254272 730302582 729725952 729440002 729696808 730405960 731540833 732031784 731644516 730875092
2655.9 730875092 729962692 728795013 727709885 727444687 727843323 728503265 729087753 729601059 729794464
2664.6 729794464 729686508 729007263 727358932 725794983 725142593 725341187 725813065 726620102 727686005
2673.3 727686005 728350830 728398666 727517624 726322098 725456619 724617920 723782043 723625870 724240952 725173950
2682.9G25173950Q81577P6p21359r37653j119232r40170m76609J02692O24848O41860
2692.5G23229980N00794N61066l51258j098785p58972n83649o66504p18078J05972
2701.2G20220566Q58764Q62885Q20770K54135p86438j415252r83887o13556o51169
2709.9G18566818l33404M62722R74656N13076M8829R4451j5945j153564j533661o83365
2719.5G16940613k30255M28772O98166O83441O13403J40076k89460p60421r13697j170349
2729.2G16140289r74884J41449O58341M22210N99823O46897J8005o04553j075974q82034
2738.8G15089569p95669p33490J38549Q29773J016770P41882L18222j81961p39441
2747.5G15684204j274109r64966m81338n17349N72891R65195P31048O09055l25470
$$ plain form
2682.9 725173950 726055527 726055603 725334244 724396591 723277359 722337189 721860580 721963272 722588120 723229980
2692.5 723229980 723730774 724291840 723940582 722841797 722082825 721499176 720832672 720114594 720220566
2701.2 720220566 721079330 721942215 722762985 723017120 722230682 720815430 719831543 719217987 718566818
2709.9 718566818 718233414 718696136 719670792 720183868 720232697 720327148 720311203 719157639 717623978 716940613
2719.5 716940613 716710358 717139130 717837296 718520737 719134140 719274216 718984756 718224335 717310638 716140289
2729.2 716140289 715165405 715306854 715965195 716387405 716987228 717634125 717652130 717047577 715971603 715089569
2738.8 715089569 714293900 713560410 713698959 714528732 715545502 716287384 716605606 716423645 715684204
2747.5 715684204 714410095 713445129 712963791 712446442 713019333 713984528 714715576 715324631 714999161
2756.2G14999161o27136r11026j272660q54645K44294M23431M0894Q11309P22962o3172
2765.8G13513412p41119r72900n76554p30743l93295K50930K16523M04434O51550K20642
2775.5G11842880m07791j085358j053466l82157l26156j72196j6784K06527O42014
2784.2G09247513N40771R461n72281q94470r84803o69632o30111l71704K63748O81839
2793.8G06620331J017608L16620m35867q75092j225204j309433j046066j43433M26026
2802.5G03345490P41424J98135k80380r8953n28412q49533j031799q95157n68009j6479
2812.1G00016327N86777M60662p5149m20761m38614q79746j286239j344681p25784
2820.8F95892792j10932N0965L99856K42081K5024p32956r49554q54034j392212p66220
$$ plain form
2756.2 714999161 714372025 713460999 712188339 711333694 711577988 712001419 712042313 712853622 713576584 713513412
2765.8 713513412 712772293 711799393 711222839 710492096 710098801 710349731 710566254 710970688 711622238 711842880
2775.5 711842880 711435089 710349731 709296265 708914108 708587952 708415756 708398972 708605499 709247513
2784.2 709247513 709788284 709797745 709225464 708330994 707346191 706676559 706046448 705674744 705938492 706620331
2793.8 706620331 707637939 707954559 707518692 706643600 705418396 704108963 703062897 702919464 703345490
2802.5 703345490 704086914 704285049 704004669 703905716 703377304 702527771 701495972 700600815 700032806 700016327
2812.1 700016327 700603104 701063766 700988617 700567856 700129242 699249496 697963257 696618576 695892792
2820.8 695892792 695781860 695832825 696232681 696474762 696499786 695766830 694817276 693963242 692571030 691804810
2830.4F91804810k72217j50376l39889j24207J65253o50024q83179j350021j680222
2839.1F86519928j765976j703644j078644j118164j394271j400147j220856j971359
2846.8F74866867k669296k486344k187194j650849j297302o83441m5090P53021Q62961
2855.5F65463333K60315O5918J07498O90537j04218p71866K54517Q60214Q17719O15081
2865.2F68259048K46506p39975q58230m81186p96128r91134m94995N92270P51800O00662
2874.8F66088638L09296k93045p40585j186753p75909k62070k04162k43760J5183K32620
2884.4F62939453q3542m84924q56628q26798r57565j236420j106110o05087l47442
2893.1F56434937m82941m730J19476q13980j470184j102906r89151j100158q24967
$$ plain form
2830.4 691804810 691532593 691382217 691042328 690918121 691083374 690433350 689550171 688200150 686519928
2839.1 686519928 684753952 683050308 681971664 680853500 679459229 678059082 676838226 674866867
2846.8 674866867 672197571 669711227 667524033 665873184 664575882 663892441 663847351 664600372 665463333
2855.5 665463333 665723648 665789566 665897064 666587601 666483383 665711517 665966034 666826248 667643967 668259048
2865.2 668259048 668505554 667765579 666907349 666426163 665630035 664638901 664143906 664736176 665487976 666088638
2874.8 666088638 666397934 666104889 665364304 664177551 663401642 663139572 662935410 662691650 662706833 662939453
2884.4 662939453 662855911 662370987 661514359 660687561 659729996 658493576 657387466 656782379 656434937
2893.1 656434937 655951996 655947266 656066742 655252762 653782578 652679672 651690521 650590363 649765396
2901.8F49765396p53174k45819j62506l52707j95541p08542j531677j904755j699371
2910.5F42211304j655350j632729j682930j287651j176872k069321j627807j526375
2918.2F29552269k007027j518402j367798r77401q5602P88383O97098J0338K36282
2926.9F25328140N47791L39279M37622O35643O25839Q45757J193123K013931J811409
2935.6F33778534Q01620P98912N14298L39661N00793M95415N45120J085091J703453
2944.2F40562897J055755L97950M6768l04261n01480o50863k93350L2577L44620L69110
2953.9F41059723R1934J42670K60467L25775K6322j27487M78058Q38241M90112N34668
2963.5F44120483J268464J339721P32269P87888N95703k3727K7771L25699R71603J305695
$$ plain form
2901.8 649765396 649012222 648766403 648603897 648251190 648055649 647347107 645815430 643910675 642211304
2910.5 642211304 640555954 638923225 637240295 635952644 634775772 632706451 631078644 629552269
2918.2 629552269 627545242 626026840 624659042 623681641 623596039 624384422 625081520 625091858 625328140
2926.9 625328140 625875931 626215210 626652832 627288475 627914314 628760071 629953194 631967125 633778534
2935.6 633778534 634580154 635379066 635893364 636233025 636733818 637229233 637774353 638859444 640562897
2944.2 640562897 641618652 642016602 642063370 641759109 641257629 640606766 640313416 640345993 640690613 641059723
2953.9 641059723 641151657 641294327 641554794 641880569 641906891 641779404 642257462 643095703 643585815 644120483
2963.5 644120483 645388947 646728668 647460937 648248825 648844528 648820801 648848572 649174271 650145874 651451569
2973.2F51451569J243820J113968Q91037Q56781J67617m27932m88282j48544K39716
2981.8F54899750L04565M56925N66024J088562O97251k73895o45829o04706j28250
2990.5F56360397j86920Q621K04163M14276N84335J27106j87988n32074k01340n25970
3000.2F56064606r36051l77578k27890L11889K92740j11084J67770J89438l74145q46100
3009.8F54153595q69751q48007m94538K18125O17676N1269M654P7972r80453r04236
3019.5F51026306n57175q83255q32138l41339j08337J6479M44336j40075m09851J64794
3029.1F48379745j64871j149444j511536q96225l2577O10351M12750j15814n79986
3037.8F44952393p48291r18656j069031n91201n41382n09644k53601P4310J23368j27411
$$ plain form
2973.2 651451569 652695389 653809357 654700394 655557175 655724792 655296860 654808578 654660034 654899750
2981.8 654899750 655204315 655661240 656227264 657315826 658013077 657739182 657093353 656488647 656360397
2990.5 656360397 656173477 656182098 656386261 656800537 657384872 657511978 657323990 656791916 656590576 656064606
3000.2 656064606 655128555 654750977 654523087 654834976 655127716 655016632 655184402 655373840 654999695 654153595
3009.8 654153595 653283844 652435837 651941299 652159424 652777100 652828369 652833023 652910995 651930542 651026306
3019.5 651026306 650469131 649585876 648753738 648412399 648304062 648320541 648764877 648624802 648214951 648379745
3029.1 648379745 648214874 647065430 645553894 644657669 644625092 645235443 645648193 645532379 644952393
3037.8 644952393 644204102 643285446 642216415 641625214 641083832 640574188 640320587 640394897 640518265 640390854
3047.4F40390854j53809p30171r32999r67750r72557o37436k27852J70517O87j17455
3057.1F35822029n68886p63969r48753j114159m13017j39237j34659k42500K18277
3065.7F31715126K12860l90053l79181q20770p56187p74803r24912l77426J7929j83144
3075.4F27339439m69856l61900m31252k34031r01108j062660j3771j45035m81987k86827
3085F22951012J74713l11737n30625J0567k8114n91851j349563n57404m40712o20651
3094.7F18705635j62506n25246r9945J21384k17285q84743q53462o81381p56340j79139
3104.3F14466972p17506l21732J69869k44904j77955m54865n43403q80433r54895m90760
3114F09850388J92756j35498n58815J55792n94139q28132l81890m08134n04990j307831
$$ plain form
3047.4 640390854 640237045 639506874 638573875 637606125 636633568 635996132 635768280 635938797 635939484 635822029
3057.1 635822029 635253143 634489174 633540421 632426262 632013245 631874008 631739349 631496849 631715126
3065.7 631715126 631927986 631537933 631158752 630337982 629581795 628806992 627882080 627504654 627522583 627339439
3075.4 627339439 626869583 626507683 626076431 625842400 624941292 623878632 623864861 623719826 623237839 622951012
3085 622951012 623125725 622813988 622283363 622293930 622265816 621673965 620324402 619766998 619326286 618705635
3094.7 618705635 618543129 618017883 617917938 618039322 617822037 616937294 616083832 615402451 614646111 614466972
3104.3 614466972 613749466 613427734 613597603 613352699 613174744 612719879 612176476 611296043 610341148 609850388
3114 609850388 610043144 609907646 609348831 609504623 608910484 608082352 607700462 607292328 606787338 605479507
3123.6F05479507j096687m01039Q6517J48964k62146m98886q36792q92944o27937o33584
3133.3F00464973p56073k81944J26190K68784j23253r02367r16214q62007q00514q73451
3142.9E95344124p16553k29034j80397j57204l27873n07164p35626o41137l89404n69534
3152.5E90890198o25420o82907o51588o36254l24783N0964k16369q06351j042099n26810
3162.2E85428581n71518j107216m88281L85285l92952r66378m00428m90952n28641
3170.9E80867500o81038j065521j090965n01480J42135j97258k51236n81512q13866
3179.5E75826759n27191p75528n42869l19062n09643j027298q61435p2136k50931l36227
3189.2E70604439l82729r38339j251907n61638j984q82530o81954M13437j21765q13484
$$ plain form
3123.6 605479507 604382820 603981781 604068298 604217262 603955116 603456230 602619438 601726494 601098557 600464973
3133.3 600464973 599708900 599426956 599553146 599821930 599698677 598796310 597880096 597018089 596217575 595344124
3142.9 595344124 594627571 594398537 594218140 594060936 593733063 593225899 592490273 591849136 591459732 590890198
3152.5 590890198 590264778 589581871 588930283 588294029 587969246 588020210 587803841 586997490 585955391 585428581
3162.2 585428581 584857063 583749847 583261566 583646851 583253899 582287521 581887093 581396141 580867500
3170.9 580867500 580186462 579120941 578029976 577528496 577670631 577473373 577222137 576640625 575826759
3179.5 575826759 575299568 574524040 573981171 573662109 573152466 572125168 571263733 571191597 570940666 570604439
3189.2 570604439 570221710 569283371 568031464 567469826 567467842 566585312 565903358 566316795 566195030 565381546
3198.8E65381546o51588o35643q15239p61719l23753n39742j025581n88379q5640J3656
3208.5E59967918k81448l17039p32079j311264o16722o10008o00014l26691o70891
3217.2E54501762k43034l50189l88184l69110r51233m79393m00886o87638l11699j32789
3226.8E50187607l55721q05931p24220m95834m34227m18511q39538p19071l22342n41916
3236.4E44530296p20787m04968j43318j93024k00500r37233r41468J33400m15573o09512
3246.1E40097313J13296l1013l77770j075058j143836q9074L58391k39944o35262m41971
3255.7E36535072j91040l51982o98128l38630m02527p15866m76227n40390m75655n00221
3265.4E31844406k45323L71666o3706o44149m79470l77922m74014n95207o28662m35181
$$ plain form
3198.8 565381546 564729958 564094315 563279076 562517357 562193604 561653862 560628281 560039902 559954262 559967918
3208.5 559967918 559686470 559369431 558637352 557326088 556709366 556099358 555499344 555172653 554501762
3217.2 554501762 554258728 553908539 553520355 553151245 552200012 551720619 551319733 550632095 550320396 550187607
3226.8 550187607 549831886 549025955 548301735 547805901 547371674 546953163 546113625 545394554 545072212 544530296
3236.4 544530296 543809509 543404541 543261223 543068199 542867699 541930466 540988998 541122398 540706825 540097313
3246.1 540097313 540210609 540179596 539801826 538726768 537582932 537493858 537852249 537612305 536977043 536535072
3255.7 536535072 536344032 535992050 535293922 534955292 534552765 533836899 533360672 532820282 532344627 531844406
3265.4 531844406 531599083 531970749 531907043 531262894 530783424 530405502 529931488 529336281 528707619 528272438
3275E28272438m89960k58102K37121m1122p10335r60502l77312R3307k45590q84170
3284.7E24635773q19435k4796j6594l24592k44294p0991n1232n14602p39212l57056
3294.3E21472969J85051j04218o69441m07066m01840o67305p04003q56590m88930J49269
3303.9E17507896q0490l32336j76277l29819m96292m90570n24101q10471r14345m33845
3313.6E12919350j14212n80254q67271l13683K8153j54458q23402q17718r5063k11487
3323.2E08969955N4589q2436j295471j509705p46307k81677m06380l53661p33566q56819
3332.9E02758522m52270q55752o87789m61045l05404j06278j086693r75341P4882j24207
3342.5D97778625p55043p84263m61121m54101m97818m26979l10860l95126o66085o30531
$$ plain form
3275 528272438 527782478 527524376 527761497 527720375 527010040 526049538 525672226 525765533 525519943 524635773
3284.7 524635773 523816338 523791542 523774948 523450356 523206062 523135071 523083839 522569237 521830025 521472969
3294.3 521472969 521658020 521553802 520884361 520477295 520075455 519408150 518704147 517847557 517358627 517507896
3303.9 517507896 517427406 517095070 516918793 516588974 516092682 515602112 515078011 514267540 513353195 512919350
3313.6 512919350 512805138 512224884 511357613 511043930 511072083 510917625 510094223 509276505 509181442 508969955
3323.2 508969955 509024544 508942108 507646637 506136932 505390625 505108948 504702568 504348907 503615341 502758522
3332.9 502758522 502306252 501450500 500762711 500301666 499996262 499889984 498803291 497827950 497902832 497778625
3342.5 497778625 497023582 496239319 495778198 495324097 494826279 494399300 494088440 493693314 493027229 492396698
3352.2D92396698p30133m76379j05744l54156m95072n28908k84538l13644l35350r3613
3361.8D88679161o34384k70386N5084r03511j022796p22924m25415J42594j23749q76656
3371.4D83897018o84700l37181l79753k43454l2768L00407k80304o93588l91884p87162
3381.1D80366631n13764j28288l55568k04811J9150r2354l52783j39885j83373m96864
3390.7D77918091k40174m26445q38851l95623j23329N9586J88942m15764k84462l7155
3400.4D75404816k42462k86179r64089o52847N88150J75400p74879p7782P67174J85203
3410D74122505k20566j95121n19104p10373m89350n7716M54063L55606J44921M73175
3419.7D73358040k29759n48630O3400l93028n69153k78435J89438Q66738M55665j73530
$$ plain form
3352.2 492396698 491666565 491190186 491084442 490730286 490235214 489706306 489421768 489108124 488772774 488679161
3361.8 488679161 488044777 487774391 487829475 486925964 485903168 485180244 484754829 484897423 484773674 483897018
3371.4 483897018 483212318 482875137 482495384 482251930 482219162 482519569 482239265 481545677 481153793 480366631
3381.1 480366631 479852867 479724579 479369011 479164200 479183350 479090996 478738213 478598328 478414955 477918091
3390.7 477918091 477677917 477251472 476412621 476016998 475893669 475953255 476142197 475726433 475441971 475404816
3400.4 475404816 475162354 474876175 473912086 473259239 473847389 474022789 473247910 473170128 473937302 474122505
3410 474122505 473901939 473706818 473187714 472477341 471987991 471930275 472384338 472739944 472884865 473358040
3419.7 473358040 473128281 472579651 472643051 472250023 471680870 471402435 471591873 472458611 472914276 472740746
3429.3D72740746L08837L50838k79312P8506K78473l22380l57322K41241N69000J88408
3439D73797035k40326J54801J54037l98025J983K0256M02260O13861o31027Q812P79304
3449.6D74662971O53115O31714L37906L0822j35002K79274M80080N49087N00908J60370
3459.2D78151245M29840K81449k70424L02848J100083P83691N88494K82097j77994
3467.9D81471329N3329M02680Q77723N05753J37939K78015K45286k2889L16887J287041
3477.5D85553093M52309L76587Q90121J95618n6610k73362N46189N71594Q68568J274224
3487.2D90398331j10131q1329L71437N21088O42357J139679J306076J73645K6664L28713
3496.8D94716530Q87031J174813Q78639M68979L51715L62167o01463L4294R16290O92711
$$ plain form
3429.3 472740746 473049583 473400421 473121109 473199615 473478088 473155708 472798386 473039627 473608627 473797035
3439 473797035 473556709 473711510 473865547 473467522 473469505 473489761 473892021 474505882 473874855 473883667 474662971
3449.6 474662971 475316086 475947800 476285706 476316528 476181526 476460800 476940880 477489967 477990875 478151245
3459.2 478151245 478581085 478862534 478592110 478894958 479995041 480778732 481367226 481649323 481471329
3467.9 481471329 481524658 481927338 482805061 483310814 483448753 483726768 483972054 483949165 484266052 485553093
3477.5 485553093 486005402 486381989 487272110 487467728 487411118 487137756 487683945 488255539 489124107 490398331
3487.2 490398331 490288200 490206871 490578308 491099396 491741753 492881432 494187508 494361153 494387817 494716530
3496.8 494716530 495603561 496778374 497657013 498125992 498477707 498839874 498238411 498272705 499188995 499881706
3506.5D99881706J201630J482811P9880Q8195J502572N29479N63164O49567L18108
3515.1E06297112J038894K44675J55716R44061J121140P81173O53572L21808n48401
3523.8E11009750N10865Q65402Q25271J097031M60701M39453J272812J197319N17349
3532.5E18195953Q08449N32074P99561O91642r4299Q45337J244698J084518P27272
3541.2E24835205J282120P41119P1259R80263J012840P82470p05719J277695J895561
3549.9E32172813J295052J630249j201210P29294J050110R80529K085343J8387Q37822
3558.5E39598389R77707P40394R03206J399117P40280M39529L284683j154594q29659
3567.2E46099052R00345j133651L268013K487793J508407R45664P69119P42378R53865
$$ plain form
3506.5 499881706 501083336 502566147 502646027 502734222 504236794 504766273 505329437 505979004 506297112
3515.1 506297112 507336006 507580681 507736397 508680458 509801598 510582771 511236343 511558151 511009750
3523.8 511009750 511520615 512386017 513211288 514308319 514769020 515208473 516481285 517678604 518195953
3532.5 518195953 519004402 519536476 520336037 521027679 520933380 521778717 523023415 524107933 524835205
3541.2 524835205 526117325 526858444 526929703 527909966 528922806 529705276 528999557 530277252 532172813
3549.9 532172813 533467865 535098114 533896904 534626198 535676308 536656837 538742180 538760567 539598389
3558.5 539598389 540576096 541316490 542219696 543618813 544359093 544798622 548083305 546928711 546099052
3567.2 546099052 546999397 545865746 549133759 551621552 553129959 554075623 554844742 555587120 556540985
3575.9E56540985K083283L48892J861152J515236J94817J187744Q32939P04346M2534
3584.6E65311928L236618J540298k188492J536179p19566K000580K623405K279396
3592.3E75620346P04689M36859K479325k050782J741333L018456L01704K310410M46358
3601E85008698P03277K238655J630402Q73489J988106J834984j694374L131523j9989
3609.6E95694771R918O980591J21536k425117K791824j418076M224549M509811q04405
3618.3F09685402R88502r45243N02166K328949J662026J576195J805038J572456K406426
3627F21581917O878853R05952j0643844K860641M335060M687538N03617j069832K754211
3635.7F32794113K789231K005615P56836J817245J832581J829376J155548q8882J813278
$$ plain form
3575.9 556540985 558624268 558973160 560834312 562349548 562544365 563732109 564565048 565269394 565311928
3584.6 565311928 568548546 570088844 567900352 569436531 568716965 570717545 573340950 575620346
3592.3 575620346 576325035 576761894 579241219 577190437 578931770 581950226 582251930 584562340 585008698
3601 585008698 585711975 587950630 589581032 590454521 592442627 594277611 592583237 595714760 595694771
3609.6 595694771 595704689 602685280 602806816 600381699 603173523 601755447 605979996 610489807 609685402
3618.3 609685402 610673904 609728661 610230827 612559776 614221802 615797997 617603035 619175491 621581917
3627 621581917 628460770 629366722 618722878 621583519 625918579 630606117 631109734 630039902 632794113
3635.7 632794113 635583344 637588959 638345795 640163040 641995621 643824997 644980545 644891663 646704941
3644.4F46704941K964630M382400j879806m118347M080276o88705k030411J489334
3652.1F50904312N252991L560028L252182M374390n954285J494369M597245P80639
3659.8F68261871Q49610L28140J299362R17053Q51517Q69675N8746L397675K255249
3668.5F79088898j632996j126175p225342K255783P829667O840820k470932j5787430
3676.2F67772293M524536Q265534L876114k853241K30484K825622J428299J290436
3683.9F87360077M07944j36032K211685M132156q112717l794021P042999m316025N79148
3692.6F85375214M252395k17209J602250M20684l62396L281j046067J797410K590026
3701.3F94415588m033203k116775M044342J579284L59498N22995J711578K532196p416153
$$ plain form
3644.4 646704941 649669571 654051971 652172165 648053818 652134094 651445389 649414978 650904312
3652.1 650904312 656157303 659717331 662969513 667343903 661389618 662883987 667481232 668261871
3659.8 668261871 669111481 669439621 670738983 671656036 672507553 673377228 673435974 676833649 679088898
3668.5 679088898 677455902 676329727 669104385 671360168 679189835 686030655 683559723 667772293
3676.2 667772293 672296829 680562363 684438477 681585236 681815720 684641342 686069641 687360077
3683.9 687360077 687768021 687631989 689843674 693975830 685863113 682069092 689112091 684796066 685375214
3692.6 685375214 689627609 689410400 691012650 691433334 691070938 691074219 690028152 691825562 694415588
3701.3 694415588 690382385 688265610 692309952 693889236 694248734 694771729 696483307 699015503 691599350
3709.9F91599350K182083L175278q642426N295487M146499J93100P84989K253723j98059
3718.6G00790024m540405P37762M235306m160385m050675L990250j1597q34808k079773
3727.3F94075699L32031L346863R38797N051422l159485p604217Q222961P01065r714126
3736F92191010K259216L485336K15302L115768K810211m365082K510605R893189j0021362
3744.7G02094193j2912064R327698M191131M258805k262116p907257J0436020l965912
3752.4G03260498p151031M438095L739013K732621m184952J997223M209137n951844
3760.1G03088760r12475L141784R85032J60064K433930l294068m066467L565521M561997
3768.8G09664078r83811q693847K780609L771210O76269P69043n93719O94885Q9264
$$ plain form
3709.9 691599350 693781433 696956711 688314285 693609772 697756271 697949371 698734360 700988083 700790024
3718.6 700790024 696249619 696987381 701222687 697062302 693011627 697001877 696990280 696155472 694075699
3727.3 694075699 694407730 697754593 698693390 703744812 700585327 692981110 701204071 701905136 692191010
3736 692191010 694450226 697935562 698150864 701266632 704076843 699711761 702222366 712115555 702094193
3744.7 702094193 689182129 698509827 702700958 706959763 704697647 696790390 707226410 703260498
3752.4 703260498 696109467 700547562 704286575 707019196 702834244 704831467 709040604 703088760
3760.1 703088760 702176285 705318069 706303101 706463165 708897095 705603027 701536560 705102081 709664078
3768.8 709664078 708680267 699986420 702767029 706538239 707214508 707983551 707389832 708084717 708173981
3777.4G08173981J860122J3123o223297J908111J296540M87823J540680k570114n33066
3786.1G05953903J308670Q03986L33938k46200M32510m1427k85035p49435R20258K285156
3795.8G10716324m214020l243713K664566L586502N051117m684677j0352021K270508
3803.5G01794586K551117M756775N902634q133011m471817M191665J743699J34048
3811.2G08469696O72379k97471P58667M688340k847138j2114563M460449N128861L362503
3819.9G12281723j144867j4641571K643127N518952K169266K018585j81351l090973
3827.6G05572891Q13446J311112K913055J283875q337784J916199O009903n105591
3835.3G06377106j182633O144562q658676j669464Q882141n078735n34668N072860
$$ plain form
3777.4 708173981 710034103 710047226 703823929 705732040 707028580 707516403 709057083 706486969 705953903
3786.1 705953903 707262573 708066559 708400497 708154297 708586807 708545380 708260345 707510910 708431168 710716324
3795.8 710716324 706502304 703258591 705923157 709509659 714560776 709876099 699524078 701794586
3803.5 701794586 704345703 709102478 715005112 706872101 702400284 706591949 708335648 708469696
3811.2 708469696 709142075 708844604 709603271 714291611 711444473 699329910 703790359 708919220 712281723
3819.9 712281723 711136856 696495285 699138412 704657364 706826630 708845215 708663864 705572891
3827.6 705572891 706386337 707697449 710610504 711894379 703556595 705472794 711482697 706377106
3835.3 706377106 705194473 711339035 702680359 701010895 709893036 704814301 704279633 709352493
3843G09352493k806167k054673L150483J115951l88031J241532j989213R94568M689789
3851.7G13306732p145157j190414r452057K933044Q634797j87073j780701J796646
3859.4G06915817K988663J305466o955643m80194O228943m104386l558578M129791
3867.1G06469879M610291N499496q213806r059219L846511N461808K423858q759384
3874.8G02279434K214966L946381q42591K074585L876267o511536o377945O202850
3882.6G06862411J892014J016769L128739j0988846J275940L503113J138077M094009
3890.3G11922226j352921q758850N15671L280640l50418J766891J735001J753387J105499
3898.9G11617126q586730L871688K288590n142975L360443k872696j555939J218644
$$ plain form
3843 709352493 706546326 704491653 707642136 708758087 708370056 709611588 707622375 708616943 713306732
3851.7 713306732 706161575 704971161 695519104 698452148 707086945 706899872 705119171 706915817
3859.4 706915817 709904480 711209946 704254303 703774109 710003052 705898666 702340088 706469879
3867.1 706469879 711080170 716579666 708365860 699306641 703153152 708614960 711038818 702279434
3874.8 702279434 704494400 708440781 707598190 709672775 713549042 707037506 700659561 706862411
3882.6 706862411 708754425 709771194 712899933 701911087 703187027 706690140 707828217 711922226
3890.3 711922226 710569305 701810455 702326126 705606766 705256348 707023239 708758240 710511627 711617126
3898.9 711617126 703030396 706902084 709190674 704047699 707408142 704535446 702979507 704198151
3906.7G04198151J221542K385025K25830p00836j156769O27976O64062n07355J074372
3915.3G08031998J178283k762146k599258L805618K07443m316329J539688K326126
3923.1G07411423J406555l269806l258896K550125J358719O44531q9340L7232J303024
3931.7G08093567k626953j236725J202164J7776Q49533R83658j16272n98068r88083
3940.4G05580597P27768P92465l268127p64771J509552J450882O05316k100219J160354
3949.1G05693817K94953k105561J973419N36881r77783j44043m959O32095k10190J58234
3958.7G05846863M09622R85718J82342k047653k30484o332l31498M45786k23465L63388
3968.4G05394287O7597p06330N53589J66626o70700k72598k45514K68402K73590j30615
$$ plain form
3906.7 704198151 705419693 707804718 708030548 707329712 706172943 706800919 707464981 706957626 708031998
3915.3 708031998 709210281 706448135 703848877 707654495 707861938 703545609 705085297 707411423
3923.1 707411423 708817978 705548172 702289276 704839401 706198120 706842651 706753311 706790543 708093567
3931.7 708093567 705466614 704229889 705432053 705449829 706299362 707283020 707166748 706568680 705580597
3940.4 705580597 706308365 707100830 703832703 703067932 704577484 706028366 706633682 704533463 705693817
3949.1 705693817 705988770 703883209 705856628 706393509 705415726 705271683 705266724 705898819 705688629 705846863
3958.7 705846863 706256485 707242203 707424545 705376892 705146408 705140076 704808578 705254364 705030899 705394287
3968.4 705394287 705461884 704755554 705309143 705475769 704805069 704532471 704286957 704555359 704828949 704698334
3978G04698334J16729k8762N7296M34723k8915k02103p3929n38406J94092O87408J39923
3988.6G05456390O77872N7907r64584k96707J05591L22189n6763n53741j38550j85242
3998.3G04424362K26212K72140
4000.2G04922714
$$ plain form
3978 704698334 704815063 704786301 704843597 705278320 705249405 705047302 704973373 704434967 704629059 705316467 705456390
3988.6 705456390 706134262 706192169 705227585 704930878 705036469 705358658 705301895 704748154 704609604 704424362
3998.3 704424362 704650574 704922714
4000.2 704922714
##END=$$ End of the data block
