##TITLE=$$ Begin of the data block
##JCAMP-DX=5.00 $$ ACD/SpecManager v 10.08
##SPECTROMETER/DATA SYSTEM=Varian
##DATE=08 Jan 2013 14:51:54
##DATA TYPE=INFRARED SPECTRUM
##DATA CLASS=XYDATA
##ORIGIN=
##OWNER=
##NPOINTS=3735
##FIRSTX=399.26403809
##LASTX=4000.35498047
##MAXX=4000.35498047
##MINX=399.26403809
##MAXY=80.09089661
##MINY=46.26297760
##XFACTOR=1.0000000000
##YFACTOR=0.000000100000000
##FIRSTY=65.62384033
##DELTAX=0.96440572
##XUNITS=1/CM
##YUNITS=TRANSMITTANCE
##XYDATA=(X++(Y..Y))
399.3F56238403K1960450j711274m346237k61230n83496r973450r579468k222977l413086
$$ 656238403 678198853 676487579 672141342 671880112 671296616 661323166 651743698 649520721 646107635
407.9F46107635j792907O344223R299164J4769592P777252r848938j3885422q694305
$$ 646107635 644314728 650658951 659958115 674727707 682504959 672656021 658770599 650076294
415.7F50076294n627213o322708r008445N723342J9006234R623718Q978958J615448
$$ 650076294 644449081 638126373 629117928 634841270 653847504 663471222 672450180 674065628
423.4F74065628j0485840o528244n399475l003464L93372K810821R855042J0145950
$$ 674065628 663579788 657051544 651652069 648648605 649041977 651852798 661707840 671853790
431.1F71853790L809967p371597j3822784q169938k202758K488022J125564M905396
$$ 671853790 675663757 668292160 654469376 646299438 644096680 646584702 647710266 652615662
438.8F52615662J3754577Q972168m809570j4227295n586014J40000o822586q604165
$$ 652615662 666370239 675342407 670532837 656305542 650719528 650859528 644036942 635432777
446.5F35432777P267800J4826889R477691K610627p93763m313964q311997o618347
$$ 635432777 642700577 657527466 667005157 669615784 668822021 664508057 656196060 649577713
454.2F49577713m063492J13144o64673J655350J3483810P141724k146378p047424n787735
$$ 649577713 645514221 645627365 644962692 646618042 660101852 667243576 665097198 658049774 652262039
462.9F52262039m486008m266510q26263l98788n57557O473084J1870270L083648m100113
$$ 652262039 647776031 643509521 642683258 642284470 641726913 648199997 660070267 663153915 659053802
471.6F59053802n507431r060821m659462k66037N69572L726273J0344086O103286j392059
$$ 659053802 653546371 644485550 639826088 639560051 640129623 643855896 654199982 660303268 658911209
480.3F58911209k804489l370819l153534o379089l638192J018029N055389R062042
$$ 658911209 656106720 652735901 649582367 643203278 639565086 640583115 645638504 654700546
488F54700546O146927K612381l067093q304138p936783p160148l721428L410720P713929
$$ 654700546 660847473 663459854 660392761 652088623 644151840 636991692 633270264 636680984 644394913
496.7F44394913N103759O666337N389862J039657k470169j2549133o888428j057091
$$ 644394913 649498672 656165009 661554871 662594528 660124359 647575226 640686798 639629707
504.4F39629707O18248M664002P117996Q198700J198502n367814m740753n579452n863114
$$ 639629707 640247955 644911957 652029953 660228653 661427155 656059341 651318588 645739136 639876022
513.1F39876022k788658P92694m49295J403046R139366O772995J180038j26419n130615
$$ 639876022 637087364 637880058 637430763 638833809 647973175 654746170 655926208 655799789 650669174
521.7F50669174q799820m840889m490165k840615P158737Q433724L944015K724991
$$ 650669174 641869354 637028465 632538300 629697685 636856422 645290146 649234161 651959152
529.5F51959152o92367m574051n106888n428848l012162J741944N480346N956269N126114
$$ 651959152 651266785 646692734 641585846 636156998 633144836 634886780 640367126 646323395 651449509
538.1F51449509K469253j776962n180817q204841m626961m84467n12695K930832O434936
$$ 651449509 653918762 652141800 646960983 638756142 634129181 633644714 633132019 636062851 642497787
546.8F42497787O974488K193680k283249m808960o132317m171982k748222K58865K378807
$$ 642497787 649472275 651665955 649382706 644573746 638441429 634269447 631521225 631780090 634158897
555.5F34158897M024926N427246M467926J315613m109955o615029o140556l955345
$$ 634158897 638183823 643611069 648078995 649394608 645284653 638669624 632529068 628573723
563.2F28573723k32506L942223N461654M060402L031464K136612n31845m294129m811287
$$ 628573723 628341217 632283440 637745094 641805496 644836960 646973572 646441727 642147598 637336311
571.9F37336311l685226k738609M33883L130875O682968N873413J841278j373215l546600
$$ 637336311 633651085 630912476 631346359 634477234 641160202 647033615 648874893 647501678 643955078
580.6F43955078n806961m987869j454773R59320N149307N186463K770385K478180n95932
$$ 643955078 638148117 633160248 631705475 632664795 637814102 643000565 645770950 648249130 647653198
589.3F47653198l461914o051979m793663r86252o73713L432502O985550O149216K706222
$$ 647653198 644191284 638139305 633345642 632359390 631685677 635118179 642103729 648252945 650959167
597.9F50959167j184463m109879o055374n424843k800712J161957L511276N000152
$$ 650959167 649774704 645664825 639609451 634184608 631383896 632545853 636057129 641057281
605.6F41057281M438630K054519L29895j895675n103226n494957k733803j191521J611176
$$ 641057281 645495911 647550430 647880325 645984650 640881424 635386467 632652664 631461143 633072319
614.3F33072319M002647M307023K737274k76642m55551k306366m408417m000664j701050
$$ 633072319 637074966 641381989 644119263 643842621 643387070 641080704 636672287 632671623 630970573
623F30970573L651619M865151M930839N692292K880325r64966m232559n608521m392051
$$ 630970573 634622192 639487343 644418182 650110474 652990799 652025833 647793274 642184753 637792702
631.7F37792702j362000K535019N330238O344834M539413J627961n02854l661194n781708
$$ 637792702 636430702 638965721 644295959 650640793 655180206 656808167 656305313 652644119 646862411
640.4F46862411l638381j368943q8501K569657N108337O169281L938522o37970k710037
$$ 646862411 643224030 641855087 641766586 644336243 649444580 655613861 659552383 658914413 656204376
649F56204376l690948m699326l933792n94864L365097N471649N603791L792877J073227
$$ 656204376 652513428 647814102 643880310 643285446 646650543 652122192 657725983 661518860 662592087
657.7F62592087j664047n049134n177765k909774j003876J533966N001373O913452
$$ 662592087 660928040 655878906 650701141 647791367 646787491 648321457 653322830 660236282
665.4F60236282L522644o915283l7496414J2945595J3731727K316361q96378O54145
$$ 660236282 663758926 656843643 619347229 632292824 646024551 648340912 647444534 648098679
673.2F48098679K828064N437622N525283L773880K89002j889801m113922n617676l125153
$$ 648098679 650926743 656364365 661889648 665663528 665952530 664062729 659948807 654331131 651205978
681.8F51205978j80206K525635M183655O261673P195358L227081j902084m475327m523468
$$ 651205978 651025772 653551407 657735062 663996735 671192093 674419174 672517090 668041763 663518295
690.5F63518295l934555j398544K743683N154266N574570M843979L353119R13314l056335
$$ 663518295 659583740 658185196 660928879 666083145 671657715 676501694 679854813 680768127 677711792
699.2F77711792n061111m104462l230057k24228M237290N380554O190567N184631K99301
$$ 677711792 672650681 668546219 665316162 665091934 669329224 674709778 680900345 686084976 686384277
707.9F86384277l287582m042130l528900l455124j166000K762146M300079N470276
$$ 686384277 683096695 679054565 675525665 672070541 670904541 673666687 677966766 683437042
715.6F83437042M582062J541519j134262n173645n716400j992569l96957J770019M094238
$$ 683437042 688019104 689560623 688426361 683252716 677536316 675543747 675146790 676916809 681011047
724.3F81011047M548417M600524L156586K43225k956924l535996k570877k888641j331253
$$ 681011047 685559464 690159988 693316574 693559799 690602875 687066879 684496002 681607361 680276108
733F80276108J663971N202789O534348M217071J353760k152023l911744l617477k656708
$$ 680276108 681940079 687142868 693677216 697894287 699248047 697096024 693184280 689566803 686910095
741.6F86910095j626205P78503M519654M564208L481675K728500J091995j549072m783859
$$ 686910095 685283890 686062393 690582047 695146255 698627930 701356430 702448425 700899353 696115494
750.3F96115494l403626j127090M65774K761307L684387M191208L004761Q24432j583175
$$ 696115494 692711868 691584778 692050552 694811859 698496246 702687454 705692215 706516647 704933472
759G04933472l485794l219223j861420q0032K249145L823624M153976L258667P98187
$$ 704933472 701447678 698228455 696367035 696287003 698536148 702359772 706513748 709772415 710570602
767.7G10570602q42819k577057m183883k801514m74701J394730K401123L658371L819656
$$ 710570602 709727783 707150726 702966843 700165329 699690628 701085358 703486481 707144852 710964508
776.4G10964508J761093o46591l259354l668670k782364j386948L79105K082443M577103
$$ 710964508 712725601 712079010 708819656 705150986 702368622 700981674 701360779 703443222 708020325
785G08020325M170532J602631M10995j383972l305512l107528k739716p31735L329925
$$ 708020325 712190857 713793488 714204483 712820511 709514999 706407471 703667755 702936020 706265945
793.7G06265945N416184M051208Q22983o05087j154175k797851m348450l558350j18103
$$ 706265945 711682129 715733337 716556320 715951233 714797058 711999207 707650757 704092407 703974304
802.4G03974304K352600L557968L178864J914291L40042k126770l591384l888474k467804
$$ 703974304 706326904 709884872 713063736 714978027 715318069 713191299 709599915 705711441 703243637
811.1G03243637r19037J12000J133423K342834K737579J586533j92337l323059m229736
$$ 703243637 702324600 702436600 703570023 705912857 708650436 710236969 710044632 706721573 702491837
819.7G02491837k619019q40836M59366K277146N145568M705964L151626R43680k534332
$$ 702491837 699872818 699031982 699491348 701768494 706914062 711620026 714771652 715715332 713181000
828.4G13181000k729416j744156j072235N95550L114014M416504M726181M034348K199478
$$ 713181000 710451584 708707428 707635193 708230743 711344757 715761261 720487442 724521790 726721268
837.1G26721268j60752l312530l419418j742936N24216J419907K552948N437622L751678
$$ 726721268 726560516 723247986 719828568 718085632 718609848 720029755 722582703 728020325 731772003
845.8G31772003J531830L88947j436921l350448l256302j21689J262894K552337L572464
$$ 731772003 733303833 733692780 732255859 728905411 725649109 725527420 726790314 729342651 732915115
854.5G32915115L931046L991241J807251j511230l695755l074341k400970k34299K187042
$$ 732915115 736846161 740837402 742644653 741133423 737437668 734363327 731962357 731728058 733915100
863.1G33915100L661804M542923K835694R85260j111451l097991n402680n123596k707367
$$ 733915100 737576904 742119827 744955521 745940781 744829330 741731339 736328659 731205063 728497696
871.8G28497696j051254J729736K579727K455979K057724k07291j750183k429962k266083
$$ 728497696 727446442 729176178 731755905 734211884 736269608 736062317 734312134 731882172 729616089
880.5G29616089j182404n02395O87713L382492M131623K393417M20074j094207k603073
$$ 729616089 728433685 727931290 728619003 732001495 736133118 738526535 738946609 737852402 735249329
889.2G35249329m220200l627777j512375J058044K639161L153686K272949J448975
$$ 735249329 731029129 727401352 725888977 726947021 729586182 732739868 735012817 736461792
896.9G36461792Q71658k485885l978501l761520k778244l21579K182159L491516K831498
$$ 736461792 737333450 734847565 730869064 727107544 724329300 724007721 726189880 729681396 732512894
905.6G32512894L584900K156372j197281k824021l367920k242050p90329J298752K113724
$$ 732512894 736097794 738254166 737056885 734232864 730864944 728622894 727832565 729131317 731245041
914.3G31245041L137741L117905J309967m93012l851852m080582l292694k225723n76325
$$ 731245041 734382782 737500687 738810654 738317642 734465790 730385208 727092514 724866791 724290466
922.9G24290466N54352J991882J598664Q42132j048355k359314l496399m394683l075638
$$ 724290466 724844818 726836700 728435364 729277496 728229141 725869827 722373428 717978745 714903107
931.6G14903107j796646J96609J289291K283020K179337K16980r68094k504272l128128
$$ 714903107 713106461 713303070 714592361 716875381 719054718 719271698 718303604 715799332 712671204
940.3G12671204l121033k046280r32159O83288K788620J893921P12738k84347j365281
$$ 712671204 709550171 707503891 706571732 707255020 710043640 711937561 712650299 712365952 711000671
949G11000671j954956k959137k875747n44586R38415Q81500J943512J364746k42309
$$ 711000671 709045715 706086578 703210831 702666245 703604660 704486160 706429672 707794418 707552109
957.7G07552109j677704l265076l405533l453140k174682o87J535416J418914k81601
$$ 707552109 705874405 702609329 699203796 695750656 693575974 693575287 695110703 696529617 696248016
966.3F96248016p13806j275024j894226j982727k659989k421951j051025m05961p28988
$$ 696248016 695534210 694259186 692364960 690382233 687722244 685300293 684249268 683843307 683114319
975F83114319q66318r52835j565781k314300k459641k555618k793121k567444k536011
$$ 683114319 682248001 681295166 679729385 677415085 674955444 672399826 669606705 667039261 664503250
983.7F64503250j583176n43823j577606k257004k577514k804184l001023l290329k504654
$$ 664503250 662920074 662376251 660798645 658541641 655964127 653159943 650158920 646868591 644363937
992.4F44363937k495803j478119k80991l89290q68416k094307k026100k453842k358131
$$ 644363937 641868134 640390015 640109024 639719734 638851318 636757011 634730911 632277069 629918938
1001.1F29918938j713944j813316q16078p47719j046372o73294m26063j984825k799225
$$ 629918938 628204994 626391678 625575600 624827881 623781509 623108215 622682152 620697327 617898102
1009.7F17898102k020798j969910r45320q72726o22521p0381k17666p00837k320060
$$ 617898102 615877304 613907394 612962074 612089348 611466827 611396446 611178780 610477943 608157883
1018.4F08157883k262688j895256j985817j349907j120338j470795r94568j02157m49105
$$ 608157883 605895195 603999939 602014122 600664215 599543877 598073082 597078514 596976357 596527252
1027.1E96527252j440658k214394k055893k592049j738777l2692R2430J011239J068611
$$ 596527252 595086594 592872200 590816307 588224258 586485481 586452789 586545219 587556458 588625069
1035.8E88625069O07338Q56857J086006m37431q74405N34935P18918J300888J715545
$$ 588625069 589232407 590089264 591175270 590737839 589863434 590398369 591117287 592418175 594133720
1044.5E94133720J605149K46925l61977p82852j834907j700707j678581l85246k93770
$$ 594133720 595738869 595985794 595623817 594840965 593006058 591305351 589626770 589241524 588947754
1053.1E88947754M70161L78380j837959n51682r6359r54819j243362Q5525N26848N66178
$$ 588947754 589417915 589796295 587958336 587406654 587310295 586355476 585112114 585197639 585724487 586290665
1062.8E86290665K502288K737694K456398J072426J111069J148071K78206j58806q08410
$$ 586290665 588792953 591530647 593987045 595059471 596170540 597318611 597596817 597438011 596629601
1071.5E96629601P21588O30302J07422O98204J202087P89872K80227N38483n31235
$$ 596629601 597351189 597981491 598088913 598787117 599989204 600779076 601059303 601597786 601066551
1080.1F01066551m49753o98471K03972J274567Q81843J588707J395264J006546M18434
$$ 601066551 600616798 599918327 600122299 601396866 602278709 603867416 605262680 606269226 606687660
1088.8F06687660Q35915j65787r89036j82648O80046K740288J313705J264610K295685
$$ 606687660 607523575 607357788 606368752 606186104 606866150 609606438 610920143 612184753 614480438
1097.5F14480438Q88748l07464j273079j194306j275901M58145J465988J423607K157173
$$ 614480438 615369186 615061722 613788643 612594337 611318436 611776581 613242569 614666176 616823349
1106.2F16823349J823006P93228o15196m31633j145478j337890R689J003914J788330
$$ 616823349 618646355 619439583 618824387 618392754 617247276 615909386 615919075 616922989 618711319
1114.9F18711319J574478K132340J225242L55225l25356j411857j295815j204338o2599
$$ 618711319 620285797 622418137 623643379 623998604 623673248 622261391 620965576 619761238 619698639
1123.5F19698639R11789J699524J301422J339378J485482O99615J078796O4927J77612
$$ 619698639 620610428 622309952 623611374 624950752 626436234 627135849 628214645 628279572 628457184
1132.2F28457184K37923K56118J962738K357750K630959K065811J268654N95360M2305
$$ 628457184 628695107 628951225 630913963 633271713 635902672 637968483 639237137 639832497 639874802
1140.9F39874802j39351k82555L66936O29005J162110J204910N32226J11237J23749
$$ 639874802 639735451 639452896 639819832 640448837 641610947 642815857 643348083 643459320 643583069
1149.6F43583069M69360m18625j416549p70340O04477L09448m88510k42691L23486
$$ 643583069 644052429 643633804 642217255 641446915 642051392 642360840 641872330 641629639 641953125
1158.3F41953125M96826k48718m72260q28552q34427j92566P20291J618195J728058
$$ 641953125 642449951 642201233 641728973 640900421 640065994 639873428 640593719 642211914 643939972
1166.9F43939972K383652K177658K092666J661530K20489K32010J388779J998749J470489
$$ 643939972 646323624 648501282 650593948 652255478 652475967 652707977 654096756 656095505 657565994
1175.6F57565994K006455K367325K231369K301025J331940J181030J477814J178817
$$ 657565994 659572449 661939774 664171143 666472168 667804108 668985138 670462952 671641769
1183.3F71641769O11267M08097J161651J414261J062622P59201J006089N99746k65426
$$ 671641769 672253036 672661133 673822784 675237045 676299667 677058868 678064957 678664703 678399277
1192F78399277N78537L69796o20117k56195l03268q62656p04956K9297L6621l63388
$$ 678399277 678977814 679347610 678727493 678471298 678168030 677305374 676600418 676629715 676666336 676302948
1201.6F76302948j047363n42908P04041K32543n11932r30023o72989l16772k63138
$$ 676302948 675255585 674712677 675416718 675649261 675137329 674207306 673534317 673217545 672954407
1210.3F72954407N0277o0424K1591J82800k6779o04782m68064K71454j38778n57328
$$ 672954407 673004684 672944260 672965851 673148651 673121872 672517090 672049026 672320480 672181702 671624374
1220F71624374j30233K73437K02484R8038L5629j13754k53449n53207r47342j095733
$$ 671624374 671494141 671767578 671970062 672068100 672103729 671989975 671736526 671183319 670235977 669140244
1229.6F69140244l80631J69220M95071N79148k8076j32142l20968o32553l91159k62223
$$ 669140244 668759613 668928833 669423904 670003052 669974976 669842834 669521866 668889313 668498154 668235931
1239.3F68235931l32183j19019K92435N67550L68729j96915k0141r156p50885q90045
$$ 668235931 667903748 667784729 668077164 668644714 669013443 668816528 668796387 668787231 668036346 667146301
1248.9F67146301o50711n48630l967O64063M97207M54865R9869k80610R9183l90015
$$ 667146301 666495590 665946960 665942993 666607056 667104263 667559128 667658997 667378387 667477570 667087555
1258.5F67087555r16519o97708M8828O53229Q70666R79462Q08716O24237J54647K47574
$$ 667087555 666171036 665473328 665522156 666175385 667046051 668025513 668834229 669458466 669613113 669860687
1268.2F69860687M40674j98746k19879N30930J359482R44595N29632J106339J029434
$$ 669860687 670301361 670102615 669882736 670413666 671773148 672717743 673247375 674353714 675383148
1276.9F75383148N26505J21612l9291k07825M37317R97849N46112J037979J240005
$$ 675383148 675909653 676031265 675991974 675784149 676221466 677219315 677765427 678803406 680043411
1285.5F80043411Q78525N96848M55551N50842J3199r1019K55661Q85697R96017N25742
$$ 680043411 680921936 681518784 681974335 682525177 682538376 682447357 682703018 683588715 684584732 685110474
1295.2F85110474J33133J17569O17828K6321n09643m82254j02845J24283J86615M03061
$$ 685110474 685243607 685361176 685979004 686005325 685495682 685013428 684910583 685034866 685221481 685624542
1304.8F85624542k30636k42386r1629k86026n49393o61545p02591j292724j009293
$$ 685624542 685393906 685151520 685059891 684773865 684224472 683562927 682860336 681567612 680558319
1313.5F80558319l6240O49872J47629j56937m1198j29242P58896P35168M30069K63367
$$ 680558319 680522079 681171951 681319580 681162643 681121445 680992203 681751099 682486267 682916336 683179703
1323.2F83179703K54898K63290K6551L68270K85950n1651n76782j80512J33667k78854
$$ 683179703 683434601 683697891 683724442 684092712 684378662 684327011 683750229 683569717 683703384 683424530
1332.8F83424530l01666p47223q41828r12857m92630k31552k84042J42898J289750
$$ 683424530 683122864 682375641 681533813 680620956 680128326 679896774 679612732 679755630 681045380
1341.5F81045380J840820J50909k54135L83759K66037L20968l20358J6327O41632O19202
$$ 681045380 682886200 683037109 682782974 683166733 683432770 683753738 683433380 683449707 684091339 684710541
1351.1F84710541j15128l03345j91268q37174p13577p21512m74548l11127K65198k51007
$$ 684710541 684595413 684292068 684100800 683263626 682550049 681828537 681353989 681042862 681308060 681057053
1360.8F81057053j176834m79203p24487P39899M4326j141738q17261j268234k05307
$$ 681057053 679880219 679401016 678676529 679416428 679460754 678319016 677501755 676233521 676028214
1369.4F76028214M13742N19256N51987n97077j809997q46405M28619L63617o38580
$$ 676028214 676441956 676961212 677513199 676916122 675106125 674259720 674688339 675051956 674413376
1378.1F74413376j141968K32925N81131L89100m21753j319046r67331q64182r01794
$$ 674413376 673271408 673504333 674085464 674474564 674052811 672733765 671766434 670902252 670000458
1386.8F70000458k152024M85917J186981J14136N36193l16543o51703k734909l208542
$$ 670000458 667848434 668334351 669521332 669635468 670171661 669855118 669203415 666468506 663259964
1395.5F63259964m11377j155701j707153l201218r3917J443710J29852n62973j216736
$$ 663259964 662848587 661692886 659985733 656784515 656690598 658134308 658264160 657701187 656484451
1404.2F56484451k703323k259369j072769j943741j882553j013641l48130K80304L2425
$$ 656484451 653781128 651521759 650448990 648505249 646622696 645609055 645260925 645541229 645573654
1412.8F45573654k15149q10928j262283j892701k161712k068329l996010J810837K636642
$$ 645573654 645358505 644547577 643285294 641392593 639230881 637162552 633166542 634977379 637614021
1421.5F37614021J620369O99158p81670N8976K56118o23626p00646j126365r86138
$$ 637614021 639234390 639933548 639151878 639210854 639466972 638843346 638142700 637016335 636030197
1430.2F36030197J348114K622223J754990J145477J188049j54648k764663K12555J813583
$$ 636030197 637378311 640000534 641755524 642901001 644089050 643934402 641169739 641382294 643195877
1438.9F43195877J318512Q58307R22317J530762J900787J090622O51856q6289j105117
$$ 643195877 644514389 645372696 646295013 647825775 649726562 650817184 651469040 651382751 650277634
1447.6F50277634j701966P74460J486817K94647P20291J508331J796799N24063n78613
$$ 650277634 648575668 649350128 650836945 651131592 651851883 653360214 655157013 655681076 655102463
1456.2F55102463l050919k390060L503341K507859K864074K055512J917496K154846
$$ 655102463 652051544 649661484 653164825 655672684 658536758 660592270 662509766 664664612
1464F64664612o06156J740265J550598L43247K80304N73044R17968o99691k5483M241944
$$ 664664612 664058456 665798721 667349319 667692566 667972870 668545914 669463882 668764191 668738708 672980652
1473.6F72980652N649032K750626j80359R57337J246795O12488L71933P07092K024460
$$ 672980652 678629684 681380310 681199951 682157288 683404083 684016571 684388504 685095596 687120056
1482.3F87120056K654114K065658R50547L56292j389999j401901o48117m159394K84424
$$ 687120056 689774170 691839828 692790375 693146667 691756668 690354767 689706650 685547256 685831680
1491F85831680L879166K547073J282654P99408m58298m037704Q95996j341629k902756
$$ 685831680 689710846 692257919 693540573 694339981 693881683 689843979 690739975 689398346 686495590
1499.6F86495590N84946L1357N34210J131439J530762j07041q586502p262344M442749
$$ 686495590 687080536 687111893 687646103 688777542 690308304 690201263 681614761 674352417 678795166
1508.3F78795166L263855N26810K135849Q6441m08097J804963Q4533j162719l569947
$$ 678795166 682059021 682585831 684721680 684808121 684400024 686204987 686289520 685126801 681556854
1517F81556854j515426K382431K09884n439834m723664M048005M517593K636948n84107
$$ 681556854 680041428 682423859 682633743 677193909 672470245 676518250 681035843 683672791 683088684
1525.7F83088684J02081p9956j111679N79605J35193q40301l33176k52380k29569K952805
$$ 683088684 683190765 683110809 681999130 682578735 682713928 681873627 681540451 681288071 681058502 684011307
1535.3F84011307J324920n75332m69742q009033p073746N154877J688614N88989L265915
$$ 684011307 685336227 684760895 684291153 676282120 669208374 674363251 676051865 676640854 679906769
1544F79906769K439575P41348K057953j27563j341248l129959r19724K843781J526184
$$ 679906769 682346344 683087692 685145645 685018082 683676834 680546875 679627151 682470932 683997116
1552.7F83997116J176300k289886N52368K414627m21372j1712417j1156082R727783
$$ 683997116 685173416 682883530 683435898 685850525 685429153 673716736 662560654 672288437
1560.4F72288437N413895L408432J172714L25012j223450n47027L71399j783905l421860
$$ 672288437 677702332 681110764 682283478 682608490 681385040 680838013 681209412 679425507 676003647
1569.1F76003647q305588K154312K021179k30026l47595p69501o01120q769455K02103
$$ 676003647 667698059 669852371 671873550 671643524 671295929 670526428 669925308 661155853 661357956
1577.7F61357956r04465k796173k202682k590180r25827j591034l75290j872329k201233
$$ 661357956 660453491 657657318 655454636 652864456 651938629 650347595 649972305 648099976 645898743
1586.4F45898743k422028m126244k968406l995705k068329k418136p29523q30345k365799
$$ 645898743 643476715 639350471 636382065 632386360 630318031 627899895 627170372 626340027 623974228
1595.1F23974228j499138l488808k232551l610115k761879k988892k297630p80296
$$ 623974228 622475090 618986282 616753731 613143616 610381737 607392845 605095215 604314919
1602.8F04314919k045327L2769j537400j308670l195305k552185k606277l413277l56521
$$ 604314919 602269592 602302361 600764961 599456291 596260986 593708801 591102524 587689247 587332726
1611.5E87332726j842423L98102q53081l28560j584930o960983K262268q66547l08075
$$ 587332726 585490303 585888405 585035324 584706764 583121834 576160851 578423119 577556572 577248497
1620.2E77248497j721382j23329q17414j347046K757264M62494Q56704k925796p40013
$$ 577248497 575527115 575403786 574586372 573239326 575996590 576459084 577315788 574389992 573649979
1628.9E73649979N87120j63422K66571k90718K098999J171379k005768j483078L121224
$$ 573649979 574237099 574073677 574340248 574049530 576148529 577319908 575314140 573831062 576952286
1637.5E76952286J633148Q00133J085815l51028K311630J328392K551193K247925j081581
$$ 576952286 578585434 579385567 580471382 580120354 582431984 583760376 586311569 588559494 587477913
1646.2E87477913J504211m96406K932739J506996J971855J499176l493309M08326O036567
$$ 587477913 588982124 588485718 591418457 592925453 594897308 596396484 592903175 593311501 599348068
1654.9E99348068N982933K483559K082901R70879J110458J148415P76710P48978J761131
$$ 599348068 605331001 607814560 609897461 610868340 611978798 613127213 613903923 614652901 616414032
1663.6F16414032N177917L462410K912178K481347J153907j784286j15967K719040
$$ 616414032 621591949 625054359 627966537 630447884 631601791 629817505 629701538 632420578
1671.3F32420578J784401M120827L839340J593246K151032M089889L161469J264572
$$ 632420578 634204979 638325806 642165146 643758392 645909424 649999313 653160782 654425354
1679F54425354M88434o98319K884522K550201k977905J704025P182846N869980K696305
$$ 654425354 654913788 654215469 657099991 659650192 656672287 658376312 665559158 671429138 674125443
1687.7F74125443J265792J400452Q7357K062988L118439L331832L308564J694183k124252
$$ 674125443 675391235 676791687 676879044 678942032 682060471 685392303 688700867 690395050 688270798
1696.4F88270798M463958L726349K691651j474915m276657O073914M693145L137360
$$ 688270798 692734756 696461105 699152756 697677841 693401184 699475098 704168243 707305603
1704.1G07305603J636200K021637J550140K341080K363892m92249p12662J069489J156235
$$ 707305603 708941803 710963440 712513580 714854660 717218552 716726303 716013641 717083130 718239365
1712.8G18239365J270141M0817J660462L842773l55911n194855M204102K695770M63867
$$ 718239365 719509506 719550323 721210785 725053558 724697647 719502792 723706894 726402664 726866531
1721.4G26866531j08642N56869K402344L302460K612304J077347L0518q31146l414231
$$ 726866531 726757889 727314758 729717102 733019562 735631866 736709213 736739731 735908585 732494354
1730.1G32494354r44671K617797J432877m009933q73185O928101M472656J036988Q33740
$$ 732494354 731549683 734167480 735600357 731590424 730717239 737645340 742117996 743154984 743988724
1738.8G43988724k364807k520295K610550O36902l28598K778168M184494K564773Q45490
$$ 743988724 741623917 739103622 741714172 742351074 742022476 744800644 748985138 751549911 752395401
1747.5G52395401J13220j007995J852493k276993o41479M608230L382263L452683K808227
$$ 752395401 752508621 751500626 753353119 751076126 750434647 755042877 758425140 761877823 764686050
1756.2G64686050k365P95288P65992l39356j19018l320923K95105L864135K783051
$$ 764686050 764683685 765478973 766244965 765905609 765786591 762465668 762760773 766624908 769407959
1764.8G69407959K486420K387466N90210l117828K48871M06494m034729l128205J993943
$$ 769407959 771894379 774281845 774872055 771754227 772003098 772409592 768374863 765246658 767240601
1773.5G67240601N059890L348847J666488K356034k2888r84345j884079k714996O2942
$$ 767240601 772300491 775649338 777315826 779671860 779648972 778664627 776780548 774065552 774128494
1782.2G74128494J431885J433868J322937K827073K764663P25174j381988j466599
$$ 774128494 775560379 776994247 778317184 781144257 783908920 784634094 783252106 781785507
1789.9G81785507l230285k924881j875458J761474M702988K676773J687241J860580
$$ 781785507 778555222 775630341 773754883 775516357 780219345 782896118 784583359 786443939
1797.6G86443939P69654j372452l277436r12323j586761R50317K788544K328110K657165
$$ 786443939 787213593 785841141 782563705 781651382 780064621 781014938 783803482 786131592 788788757
1806.3G88788757J334534n8289m63562j433792l506164j233673N87768J348419K699814
$$ 788788757 790123291 790065002 789601440 788167648 784661484 783427811 784015579 785363998 788063812
1815G88063812K268982K055969N19715l97263p69424k052689j553421j676483L43399
$$ 788063812 790332794 792388763 792908478 792511215 791741791 789689102 788135681 786459198 786802597
1823.7G86802597J000595P14111L136063K746277O55975k787018m783859J59378J074524
$$ 786802597 787803192 788517303 791653366 794399643 795055618 792268600 787484741 787644119 788718643
1832.3G88718643k56729R68933K148056J820908J729126P27615J01547j568603j882553
$$ 788718643 788461914 789430847 791578903 793399811 795128937 795856552 795958099 794389496 792506943
1841G92506943k244263j036453m13284j910477M486618L757477Q59298N29633o7749
$$ 792506943 790262680 789226227 788812943 786902466 791389084 795146561 796005859 796535492 796467743
1849.7G96467743j160507k334595j750183l18298J230850J828079K136765J928482
$$ 796467743 795307236 792972641 791222458 790904160 792135010 793963089 796099854 798028336
1857.4G98028336Q09631l38364j871872j886062j701584q40988j37863P16857K091523
$$ 798028336 798837967 798499603 796627731 794741669 793040085 792199097 792061234 792778091 794869614
1866.1G94869614J379928J390534n28488j704026Q0567p94907j522675r24453R07669
$$ 794869614 796249542 797640076 797111588 795407562 795488129 794693222 793170547 792246094 793153763
1874.8G93153763J699982K174148J979141J000138k71683j857453k013549k131195
$$ 793153763 794853745 797027893 799007034 800007172 799735489 797878036 795864487 793733292
1882.5G93733292q34809K85645J213379K278137K138367J759338n99213k532043r14078
$$ 793733292 792898483 793184128 794397507 796675644 798814011 800573349 799974136 797442093 796528015
1891.2G96528015j163330j568222k92206K61994J383285K987061J916122Q56247m72107
$$ 796528015 795364685 793796463 793504257 793766251 795149536 798136597 800052719 800908966 800436859
1899.8H00436859j837158j986389j988983q11997J99738J607742J919098J580353J071090
$$ 800436859 798599701 796613312 794624329 793812332 794012070 795619812 797538910 799119263 800190353
1908.5H00190353l23104j228791j710281j337433j408157k69318Q03375K049408K670899
$$ 800190353 799867249 798638458 796928177 795590744 794182587 793913269 794716644 796766052 799436951
1917.2G99436951l43857k7542N46036j193543k038650k981644n78385J404114J590195
$$ 799436951 799093094 799065552 799611588 798418045 796379395 793397751 792819366 794223480 795813675
1925.9G95813675J981430K167053P34101m80118j265259k125931j711426j173553L13187
$$ 795813675 797795105 799962158 800696259 800216141 798950882 796824951 795113525 793939972 794253159
1934.6G94253159J105423J466140J670761J197968P58896r94721j731872l133621k693482
$$ 794253159 795358582 796824722 798495483 799693451 800452347 799457626 797725754 794592133 791898651
1943.2G91898651R56802J334992J307373J698914K015457Q15353m03290j346969j879654
$$ 791898651 792855453 794190445 795497818 797196732 799212189 800027542 799624252 798277283 796397629
1951.9G96397629j618500j431198O9199J528244K191543J562805P88880K62909j471024
$$ 796397629 794779129 793347931 793417130 794945374 797136917 798699722 799488602 799751511 798280487
1960.6G98280487k111587j761399j238251p72628N44433J656800J435928J897430J211472
$$ 798280487 796168900 794407501 793169250 792396622 792941055 794597855 796033783 797931213 799142685
1969.3G99142685m11453j588135j876450k057037j141891N84564J164932J909256J963043
$$ 799142685 798731232 797143097 795266647 793209610 792067719 792652283 793817215 795726471 797689514
1978G97689514J235275n2719j173324j773987k285233j554794n25894J068497J978302
$$ 797689514 798924789 798872070 797698746 795924759 793639526 792084732 791558838 792627335 794605637
1986.6G94605637J840362J247177P8278j62964j634293l029632j682205l87268P25936
$$ 794605637 796445999 797693176 797771454 797608490 795974197 792944565 791262360 790875092 791601028
1995.3G91601028J443863J981659K015763R90600m24576j255874k221375k225418j205063
$$ 791601028 793044891 795026550 797042313 798032913 797608337 796352463 794131088 791905670 790700607
2004G90700607k39410J279373J802597J631470J353912M98200o65436j859131k395630
$$ 790700607 790461197 791740570 793543167 795174637 796528549 797026749 796361313 794502182 792106552
2012.7G92106552j962356n10254O83365J241989J597290J942520J605606M4784j233367
$$ 792106552 790144196 789633942 790317307 791559296 793156586 795099106 796704712 796749496 795516129
2021.3G95516129k382279k486114j753083k45437J450882J828842J886673J542816
$$ 795516129 793133850 790647736 788894653 788649216 790100098 791928940 793815613 795358429
2029.1G95358429O73447p35627k001571k362137k155686j044540R47418K096558J596298
$$ 795358429 796031876 795296249 793294678 790932541 788776855 787732315 788679733 790776291 792372589
2037.7G92372589J520004J335450n5848j840591k201920j611938j459351o3781Q37860
$$ 792372589 793892593 795228043 795172195 793331604 791129684 789517746 788058395 787994614 788832474
2046.4G88832474J571808K082519J248017M84466p59354j466827k148895j962128m77295
$$ 788832474 790404282 792486801 793734818 794219284 793459930 791993103 789844208 787882080 787404785
2055.1G87404785O18210J427002J483688J729050R84879l24402r75342j662369j960602
$$ 787404785 788022995 789449997 790933685 792662735 793647614 793323212 792347870 790685501 788724899
2063.8G88724899j862182r7428J528321J896286J618728J056061K37808j019897j221008
$$ 788724899 786862717 786765289 788293610 790189896 791808624 792864685 793102493 792082596 790861588
2072.5G90861588j487809j486511q33816l663J228028J816025J715545Q93479j83564
$$ 790861588 789373779 787887268 787053452 787049789 788277817 790093842 791809387 792702866 792519302
2081.1G92519302j460800k036056j540757q16192J13602Q70742J526184J685028J388016
$$ 792519302 791058502 789022446 787481689 786665497 786779099 787649841 789176025 790861053 792249069
2089.8G92249069J53656j117630j602936j787109j058273m78058O11038J836548J584167
$$ 792249069 792402725 791285095 789682159 787895050 786836777 786358719 786969757 788806305 790390472
2098.5G90390472R52988M85306l03955j191101j635132j817856q97064K50854J096039
$$ 790390472 791343460 791828766 791524811 790333710 788698578 786880722 785983658 786234512 787330551
2107.2G87330551J634369J363602J221466K17514j133347k002411k261657j270523
$$ 787330551 788964920 790328522 791549988 791767502 790634155 788631744 786370087 785099564
2114.9G85099564K18887J122894J655045K041626R07516J18866l06701j499482j960907
$$ 785099564 785318451 786441345 788096390 790138016 791045532 791164398 790857697 789358215 787397308
2123.6G87397308j668396k96554M98962J201706J738587J278686P97348m67148j124878
$$ 787397308 785728912 785432358 785931320 787133026 788871613 790150299 790947647 790480499 789355621
2132.3G89355621j632080j735840q37936r0942J005783J765289J751328R79461Q774
$$ 789355621 787723541 785987701 785149765 785058823 786064606 787829895 789581223 790560684 790569458
2140.9G90569458j017609j503067j280975j168671n02472N22004J311416J572647J738129
$$ 790569458 789551849 788048782 786767807 785599136 785096664 785618668 786930084 788502731 790240860
2149.6G90240860Q39767o95953j350326j797486j547317p31354M45709J139298J539001
$$ 790240860 791080627 790384674 789034348 787236862 785689545 784958191 785403900 786543198 788082199
2158.3G88082199J437073Q97064N57938j077271j498642j447372j757508m41055Q13446
$$ 788082199 789519272 790416336 790974274 789897003 788398361 786950989 785193481 784752426 785565872
2167G85565872J711502J723709J141739O35605k95029j544876j914520j295471p96356
$$ 785565872 787277374 789001083 790142822 790778427 790483398 788938522 787024002 785728531 784932175
2175.6G84932175L37753J308060J968078J766510R17206J03607j467895j919022j534347
$$ 784932175 785269928 786577988 788546066 790312576 791229782 791333389 789865494 787946472 786412125
2184.3G86412125j098481k04315J339035J900864J358566J369629M65088n28946j463242
$$ 786412125 785313644 785109329 786448364 788349228 789707794 791077423 791542511 791013565 789550323
2193G89550323j971893j525726r73511M02603J487580J802673J606140J198883j33667
$$ 789550323 787578430 786052704 785079193 785481796 786969376 788772049 790378189 791577072 791443405
2201.7G91443405j477127j814041k072067j142655J2131J136780J904068K112655J648255
$$ 791443405 789966278 788152237 786080170 784937515 784949646 786086426 787990494 790103149 791751404
2210.4G91751404J62658r07821j931458k003860j460037m56086O93665J438217K185593
$$ 791751404 791914062 791006241 789074783 787070923 785610886 785154800 785848465 787286682 789472275
2219G89472275J552505Q06275k33536j381836j978073k252197j317215K02865J601181
$$ 789472275 791024780 791831055 791597519 790215683 788237610 785985413 784668198 784871063 786472244
2227.7G86472244J803742K072754J551513O2409o95877j583557k109833k260132r92737
$$ 786472244 788275986 790348740 791900253 791962662 791266785 789683228 787573395 785313263 784320526
2236.4G84320526Q04367J882782J792450J477127J317139l56827j256409j987686k148895
$$ 784320526 785124893 787007675 788800125 790277252 791594391 791237564 789981155 787993469 785844574
2245.1G85844574j028671K29950J062774J009598J931152J417923P2937j018829j788025
$$ 785844574 784815903 785045853 786108627 787118225 789049377 790467300 790540237 789521408 787733383
2253.8G87733383j661300k093659p87964P08466J549682J878663J864852J137238o41785
$$ 787733383 786072083 783978424 783190460 783898926 785448608 787327271 789192123 790329361 789687576
2262.4G89687576j061783k223434k397690j047211k8228P61413J390534K085418J451416
$$ 789687576 788625793 786402359 784004669 782957458 782929230 783690643 785081177 787166595 788618011
2271.1G88618011N48249r12018j697464j794205j490936m20685R0103J425019J794967
$$ 788618011 789166260 788254242 786556778 784762573 783271637 782850952 782941055 784366074 786161041
2279.8G86161041J941986J114426j4877q05283k246628j879883k022323m36859O38809
$$ 786161041 788103027 789217453 789202576 788397293 786150665 784270782 782248459 781811600 782450409
2288.5G82450409R34601J354294J94091M95758j406173k172699k330933k178421r49554
$$ 782450409 783385010 784739304 784933395 785429153 784022980 781850281 779519348 777340927 776391373
2297.2G76391373j123581J218338K84729L52783O66122j143188r24683k367706l046112
$$ 776391373 775267792 776486130 776770859 777123642 777789764 776646576 775721893 773354187 770308075
2305.8G70308075l665695j386795l39356m30679O86340n95627K26365k132340k223587
$$ 770308075 766642380 765255585 764916229 764485550 765171890 764576263 764802628 762670288 760446701
2314.5G60446701k013473l076630j673737k915802q16879j340179j889344j743774
$$ 760446701 758433228 755356598 753682861 750767059 749950180 748610001 746720657 744976883
2322.2G44976883k058640j381607k182693j617890m343338j607360p27616L25547J808624
$$ 744976883 742918243 741536636 739353943 737736053 733392715 731785355 731057739 731383286 733191910
2330.9G33191910j426239R02099j685791j157608l215027m208526J332626K84348R99756
$$ 733191910 731765671 732667770 730981979 729824371 726609344 722400818 723733444 724017792 725017548
2339.6G25017548M30450N61600q80738O30494J13754p57675M863357O568299Q444900
$$ 725017548 725447998 726009598 725128860 725759354 725873108 725115433 729978790 736547089 744991989
2348.3G44991989J996460n007934n065079o133499o048508m550629m776230p131576
$$ 744991989 746988449 741980515 736915436 730781937 724733429 720182800 715406570 708274994
2356G08274994o455917j942139J8387J077423J115875J787796j092987J902466L035049
$$ 708274994 701819077 699876938 699895325 700972748 702088623 703876419 702783432 704685898 707720947
2364.7G07720947J159210K348099J870270M903183N520096N808639N750733N128937
$$ 707720947 708880157 711228256 713098526 718001709 723521805 729330444 735081177 740210114
2372.4G40210114M224014K363815K880402L003845K669983L153229M328994M634705
$$ 740210114 744434128 746797943 749678345 752682190 755352173 758505402 762834396 767469101
2380.1G67469101M488144L695526K351456J505737L67355K02408r7198O2790J125793
$$ 767469101 771957245 775652771 778004227 779509964 779877319 780079727 779982529 780045319 781171112
2388.8G81171112J417542J427002R90600K91290p39822j140976j298447j110077m35180
$$ 781171112 782588654 784015656 785006256 785297546 784557724 783416748 782118301 781008224 780573044
2397.4G80573044J01242R45358P79953J001892J059265L98331j45874j335220j956101
$$ 780573044 780674286 781619644 782399597 783401489 784460754 784859085 784713211 783377991 781421890
2406.1G81421890j559219n13306L3570J299743K065125J073303L44315p59278j180191
$$ 781421890 779862671 779349365 779382935 780682678 782747803 783821106 784165421 783406143 782225952
2414.8G82225952j651306j472092m23584O6910J254273J246109P26089Q17947P3548
$$ 782225952 780574646 779102554 778678970 778745880 780000153 781246262 781972351 782790298 782863846
2423.5G82863846j123200j498413j563568j190109K23617M98353R29946J578751R49173
$$ 782863846 781740646 780242233 778678665 777488556 777712173 778210526 779140472 780719223 781668396
2432.2G81668396J13525o40716r03549j449738j853256j146240L72238J278534J267166
$$ 781668396 781781921 781141205 780237656 778787918 776934662 775788422 776160660 777439194 778706360
2440.8G78706360J397629R87854K05688r61838j725616j722946j305847m2878Q74176
$$ 778706360 780103989 781091843 781297531 780335693 778610077 776887131 775581284 775538406 776412582
2449.5G76412582J324921J406250P67517J71662k76413j538468k384033j440277k42615
$$ 776412582 777737503 779143753 779911270 780082932 779806519 778268051 775884018 774443741 774201126
2458.2G74201126L30429J072922J728210Q82340L07464J0834j197662j509857j526642
$$ 774201126 774531555 775604477 777332687 778215027 778522491 778533325 777335663 775825806 774299164
2466.9G74299164j017380m8523L88870J081467J785736J068802k00348o45828j497040
$$ 774299164 773281784 773233261 773622131 774703598 776489334 777558136 777357788 776711960 775214920
2475.6G75214920j468887j191330r07212K45743O29349J533203J506348M72488j18789
$$ 775214920 773746033 772554703 771647491 771893234 772522583 774055786 775562134 776034622 775915833
2484.2G75915833j251069j944274j591721o75583k22015O23397J387711J356049Q52661
$$ 775915833 774664764 772720490 771128769 770453186 770231171 770854568 772242279 773598328 774450989
2492.9G74450989j32599o75049j375809j361694j152420q64334K19040Q35037J189194
$$ 774450989 774318390 773643341 772267532 770905838 769753418 768889084 769108124 769943161 771132355
2501.6G71132355J190490P95899l93448j121140j575164j898117q45871j54953O77337
$$ 771132355 772322845 773118744 772725296 771604156 770028992 768130875 767285004 767130051 767807388
2510.3G67807388J264038J243592O62918q2474k84805j468277j622620j131439p85446
$$ 767807388 769071426 770315018 770977936 770895462 770610657 769142380 767519760 766388321 765602875
2519G65602875L06015R48868J443023J263504L58429n09796j062775j351165j367646
$$ 765602875 765908890 766857758 768300781 769564285 769922714 769412918 768350143 766998978 765631332
2527.6G65631332j092376k88544Q40530J150818J188736Q16117j18180r49631j040115
$$ 765631332 764538956 764250412 765090942 766241760 767430496 768246613 768128433 767178802 766138687
2536.3G66138687j162338j442185m13055K88315R69009J482468R65042K36664o81687
$$ 766138687 764976349 763534164 763121109 763409424 764378433 765860901 766825943 767062607 766380920
2545G66380920q58688j305618j345749p23190j25428P92237Q80966Q09860O13937K45133
$$ 766380920 765522232 764216614 762870865 762147675 762022247 762814484 763695450 764505310 765119247 765364380
2554.6G65364380n71518j296921j410217j275940M5319M12673N33600J244049O70777
$$ 765364380 764792862 763495941 762085724 760809784 760855103 761267776 761801376 763045425 763716202
2563.3G63716202L25928l49122j442108j150360q09555q71963j98594M62952R36051
$$ 763716202 764042130 763693008 762250900 761100540 760290985 759419022 759220428 759683380 760619431
2572G60619431J128082O92367o9122j241226j376190q09479q63190m83703O45675J041794
$$ 760619431 761747513 762439880 762370758 761129532 759753342 758943863 758080673 757596970 758242645 759284439
2581.6G59284439M87290N21545M66461m76990j283950j199494r96628p23495j0681
$$ 759284439 759771729 760293274 760759735 760282745 758998795 757799301 756802673 756079178 756068497
2590.3G56068497L25546J077118J200867L61023J2435n89141j239090j223908p57675
$$ 756068497 756394043 757471161 758672028 759033051 759045486 758456345 757217255 755993347 755235672
2599G55235672o32477Q6441J088410J086197O44531l39127q47397j006622j096497
$$ 755235672 754603195 754689636 755778046 756864243 757508774 757169647 756322250 755315628 754219131
2607.7G54219131p59887n52826j10779O95190J270295R00116M15954l01971j205445
$$ 754219131 753459244 752906418 752795639 753490829 754761124 755661240 756077194 755775223 754569778
2616.4G54569778j089782q36029q44727m28772J34049K95181R49631J053085J61743
$$ 754569778 753479996 752643967 751799240 751370468 751504517 751799698 752749329 753802414 753964157
2625G53964157o38122j349411r30710r51920r49936J57624O77719R64126P47833J44120
$$ 753964157 753326035 751976624 751045914 750093994 749144058 749301682 749979401 750943527 751691360 751835480
2634.7G51835480m51050p04804r04388j354675j157151l16391O94809Q88825Q82111
$$ 751835480 751384430 750679626 749775238 748420563 747263412 746947021 747641830 748530655 749412766
2643.4G49412766N04989n09643r82972r37194p27158q99735j79519N73883L45001P62405
$$ 749412766 749917755 749408112 748425140 747487946 746760788 745861053 745681534 746255417 746600418 747362823
2653G47362823N79148k19193m46624q93021j268768r60312p15866k70691O74438J255493
$$ 747362823 747941971 747722778 747276154 746383133 745114365 744154053 743438187 743167496 743841934 745097427
2662.6G45097427R24378L35235j8768j226730j822052j255493q02918K3651P74079
$$ 745097427 746021805 746357040 746338272 745111542 743289490 742033997 741231079 741254730 742028809
2671.3G42028809J104812Q86917N13306M7455m13361q46252j240158j050186j039963
$$ 742028809 743133621 744020538 744533844 744581299 744167938 743321686 742081528 741031342 739991379
2680G39991379p9499P42798N03540O88858O50483J96380r72595j502991j135635o42319
$$ 739991379 739911880 740654678 741158218 741847076 742497559 742693939 741721344 740218353 739082718 738440399
2689.6G38440399j52130J12228P98951J074447R16214o1798q90884j120148j471252
$$ 738440399 738288269 738400497 739199448 740273895 741190109 741128311 740237427 739117279 737646027
2698.3G37646027r61686m55169J68609N73578J008835J124954L09983l09296j221848
$$ 737646027 736684341 736229172 736397781 736971359 737980194 739105148 739415131 739105835 737883987
2707G37883987j099395p27616n68542q5526M4861N82504P44629O07300J69678l87650
$$ 737883987 736784592 736056976 735488434 735402908 735447769 736030273 736774902 737382202 737551880 737164230
2716.6G37164230r68094j329193r26666m73480L37295P17621O22940M66538O14929
$$ 737164230 736196136 734866943 733940277 733466797 733804092 734521713 735144653 735611191 736226120
2725.3G36226120O3858j246490j207962j233979p54928R0255L89023O45752N58243
$$ 736226120 736289978 735043488 733835526 732601547 731846619 731936874 732325897 732971649 733529892
2734G33529892N58777k5559j79367n73501j057206o04248n36804L3875M10080P16400
$$ 733529892 734088669 734063110 733883743 733310242 732253036 731648788 731111984 731145859 731555939 732272339
2743.7G32272339J116180P08542q6059j228257j285476m50363n35889o21033L79410
$$ 732272339 733388519 734097061 734011002 732782745 731497269 731046906 730511017 729889984 730269394
2752.3G30269394P50046O45675P29828P9575o58035j129914j142044p62787l9825J48849
$$ 730269394 731019440 731665115 732394943 732474518 731816483 730686569 729544525 728781738 728741913 728890762
2762G28890762N5390P81936R03778N23987k98691j274185j269607n56565j38168k27814
$$ 728890762 728946152 729728088 730631866 731155853 730857162 729582977 728313370 727756805 727618637 727390823
2771.6G27390823J42899N62897R03778P14340q5526j048812j512375p87659n53970
$$ 727390823 727533722 728096619 729000397 729714737 729629211 728580399 727068024 726280365 725726395
2780.3G25726395m72107J1596M23890N10864L82843M13589j19095o51702j206437j001892
$$ 725726395 725254288 725265884 725689774 726200638 726583481 726997070 726877975 726226273 725019836 724017944
2789.9G24017944j23138o3858j38703K51771Q47549N72433j11770o16989j038285j580124
$$ 724017944 723894806 723830948 723692245 723944016 724791565 725363998 725252228 724635239 723596954 722016830
2799.6G22016830j391372k88391j4191M88815N02091K95639K77633o90307q24433q17184
$$ 722016830 720625458 720337067 720322876 720811691 721313782 721609421 721887054 721196747 720372314 719555130
2809.2G19555130r59015r57794m33731M00543N66483M69818j34201m30069j086426
$$ 719555130 718596115 717638321 717204590 717605133 718171616 718641434 718507233 718077164 716990738
2817.9G16990738j300278p82013q02994m90264j9226M22210p6751j75934l3188q18787
$$ 716990738 715690460 714908447 714105453 713615189 713595963 714018173 713941422 713765488 713732300 712913513
2827.6G12913513j100921r54438m07104o61011q48846p13654l31192L97873k73590
$$ 712913513 711812592 710858154 710451050 709790039 708941193 708227539 707896347 708294220 708020630
2836.2G08020630p64542j413498j596908j440430k166290j983032j495209p88803o21872
$$ 708020630 707256088 705842590 704245682 702805252 700638962 698655930 697160721 696371918 695750046
2844.9F95750046j152420j915436k782440k812042k409974j518249j323395q58307
$$ 695750046 694597626 692682190 689899750 687087708 684677734 683159485 681836090 680977783
2852.6F80977783M84009Q33359O85501J98364p2861O6605J79672J24207k53906k31629
$$ 680977783 681461792 682295151 682980652 683179016 683106155 683172760 683352432 683476639 683222733 682991104
2862.3F82991104N79453J087494P29064K18812k05994l09677o81534q83408p04269
$$ 682991104 683570557 684658051 685387115 685605927 685399933 685090256 684408722 683525314 682821045
2870.9F82821045n84259J37863N09644O14700M68140l75596q30383m82483k40860n32684
$$ 682821045 682236786 682374649 682884293 683498993 683967133 683591537 682761154 682278671 682037811 681505127
2880.6F81505127q09174j011428k42844O59408P66602K60239q76999j404877j723709
$$ 681505127 680695953 679684525 679441681 680101089 680867691 681127930 680250931 678846054 677122345
2889.3F77122345j419678q10928n97229l09219k52381J25275k48718q96759j000519
$$ 677122345 675702667 674891739 674294510 673985291 673732910 673858185 673609467 672712708 671712189
2897.9F71712189j077500r54590j156158j079407o81457j76239j28021n38941n54886
$$ 671712189 670634689 669680099 668523941 667444534 666763077 666586838 666458817 665919876 665364990
2906.6F65364990q84018j214218j106262j736069k688675j646652q02841j476364j574402
$$ 665364990 664480972 663266754 662160492 660424423 657735748 656089096 655286255 653809891 652235489
2915.3F52235489j941300j679306j418380k221985j732559q44345p77359j46180Q79135
$$ 652235489 650294189 648614883 647196503 644974518 643241959 642397614 641620255 641474075 642353210
2924F42353210O03943K94113O93741L49655K35596J039200R42612K03552Q24509J367263
$$ 642353210 642957153 643251266 643945007 644294662 644530258 645569458 646512070 646715622 647540131 648907394
2933.6F48907394J470719J375351Q04291J058197R82513N04532K94189N87082J213913
$$ 648907394 650378113 651753464 652557755 653615952 654598465 655102997 655397186 655984268 657198181
2942.3F57198181Q68149M43115N94177R66111P16018o9656n90515q51288k41013K14768
$$ 657198181 658066330 658509445 659103622 660069733 660785751 660716095 660125580 659274292 659033279 659248047
2952F59248047M0893J95237M20379P04346O49643M11224K75193m39759n7220J107254
$$ 659248047 659288940 659484177 659904556 660608902 661258545 661669769 661944962 661505203 661447983 662555237
2961.6F62555237N07355K33535J199036J276398R85641R65424K88696j47934M46701
$$ 662555237 663062592 663296127 664495163 665771561 666757202 667722626 668011322 667863388 668310089
2970.3F68310089P15408R44291J322021J114197O16989M07639O38046N95093K60009
$$ 668310089 669025497 669969788 671291809 672406006 673022995 673430634 674068680 674663773 674923782
2979F74923782o6833j13907j26877k7313N32684Q25959P00607M12597M70124l8452
$$ 674923782 674856949 674743042 674616165 674588852 675121536 675947495 676648102 677060699 677530823 677492371
2988.6F77492371p02057m63257j81122K40250Q1329J22604P61567Q43429M7684q99124
$$ 677492371 676790314 676327057 676145935 676386185 676467514 676590118 677351685 678195114 678242798 677343674
2998.2F77343674m10462k90985o68564n41153l81927J43204K49328p4005k47116J8234
$$ 677343674 676933212 676642227 675973663 675432510 675050583 675193787 675443115 675369110 675121994 675140228
3007.9F75140228J2360m10004p45849r57489p01905J35422P50885k9526l7613J43814
$$ 675140228 675152588 674742584 673996735 673039246 672337341 672472763 673223648 673194122 673156509 673300323
3017.5F73300323r16366q52509n12542q21228j172333k47727N77774K27814K49405
$$ 673300323 672383957 671531448 671018906 670197678 669025345 668777618 669355392 669583206 669832611
3026.2F69832611j83563l19061k36359k13547n34057j421280q79135o9352J58921K21176
$$ 669832611 669649048 669329987 669093628 668880081 668346024 666924744 666045609 665976257 666135178 666356354
3035.9F66356354R0332k52381n62439q76464r81598n73502n60760n82352n66635k7313
$$ 666356354 666446686 666194305 665631866 664755402 663773804 663200302 662639542 662057190 661490555 661463242
3045.5F61463242K97164j82037n64651j159745p26394n50156q61740n20477j28098
$$ 661463242 661760406 661578369 661013718 659853973 659127579 658577423 657715683 657195206 657067108
3054.2F57067108J66092k57568l28598k84806m36172p32269r82056o76956m91028k00729
$$ 657067108 657233200 656975632 656647034 656362228 655926056 655193787 654211731 653534775 653043747 652843018
3063.8F52843018m78898j5411N02091k62833o52695r40323p80716q13751q19244k60086
$$ 652843018 652364120 652348709 652850800 652587967 651935272 650994949 650214233 649400482 648581238 648321152
3073.5F48321152j2055K33307L36533J9836n34591m84391n34820q47931r41620p22427
$$ 648321152 648309097 648542404 648878937 648898773 648364182 647879791 647344971 646497040 645555420 644832993
3083.1F44832993k84424j78070J85547J64566j94779o84128m62036l93371j289521
$$ 644832993 644548569 644370499 644556046 644720612 644525833 643841705 643379669 642986298 641696777
3091.8F41696777o64596m27704l37982o2485o66771o03409j40342M95414k94952j062470
$$ 641696777 641032181 640604477 640266495 640204010 639537239 638933830 638793488 639288902 638993950 637931480
3101.4F37931480j016121q53118j66855m19350k91138q5334K34642J63917r60922r99031
$$ 637931480 636915359 636062241 635895386 635476036 635184898 635099564 635334206 635498123 634537201 633538170
3111.1F33538170j051178j042061l04375P9766m29497l25432J86768m44451l35121
$$ 633538170 632486992 631444931 631140556 631220322 630790825 630465393 630652161 630207710 629872589
3119.8F29872589j57165p84684j277351j094551m99954o7482J11885n99709l43971
$$ 629872589 629715424 628930740 627653389 626558838 626058884 625991402 626103287 625503578 625159607
3128.4F25159607J69640o43502q73451q05016q94813n16815k53907o4315K73780j87683
$$ 625159607 625329247 624685745 623812294 623007278 622112465 621595650 621341743 621277428 621551208 621363525
3138.1F21363525p83805o22788o35300r61609j082801q30880r2277L18603p81822p52754
$$ 621363525 620579720 619956932 619321632 618360023 617277222 616446342 616354065 616672668 615890846 615138092
3147.7F15138092J36375p33184r37386o26335o20842n51491n73158m42162o16226m61616
$$ 615138092 615274467 614541283 613603897 612977562 612356720 611805229 611232071 610789909 610173683 609712067
3157.4F09712067j59264l2082p34748j532441r81140m19197j32522M997l88870r77784
$$ 609712067 609552803 609520721 608785973 607253532 606272392 605853195 605720673 605725670 605336800 604359016
3167F04359016p95440j17646p6599q87794j219559o03027q02765o37360j09710n9739
$$ 604359016 603563576 603445930 603369331 602481537 601261978 600658951 599856186 599218826 599109116 599049377
3176.6E99049377j36947p19681q06694r18388o69175m95452p97005o57692p63970n98487
$$ 599049377 598912430 598192749 597386055 596467667 595798492 595303040 594506035 593848343 593084373 592485886
3186.3E92485886m08173k32582k83051n85365j022720j078186n36881p84721n99213
$$ 592485886 592077713 591845131 591562080 590976715 589953995 588875809 588338928 587554207 586954994
3195E86954994n52063j44501J85738r57146q48045p35779p67708o04820n01633l53317
$$ 586954994 586402931 586258430 586444168 585487022 584638977 583903198 583135490 582530670 582029037 581675720
3204.6E81675720o33774j22337l17154o29654n63812r39179p32727n18112m91142o92825
$$ 581675720 581041946 580919609 580602455 579972801 579408989 578469810 577737083 577218971 576727829 576035004
3214.3E76035004n70183m39797n78804m36210k89269n25017j090812o85501J04713
$$ 576035004 575464821 575025024 574446220 574010010 573720741 573195724 572104912 571419411 571524124
3222.9E71524124l15018j148338q02994o47239o48575J47018l85551r27353r42192
$$ 571524124 571209106 570060768 569257774 568610535 567961960 568108978 567723427 566796074 565853882
3231.6E65853882j132775o34727j75476k6741r8991k62833n33829m01687l68882o89048
$$ 565853882 564721107 564086380 563910904 563884163 563785172 563522339 562988510 562586823 562217941 561528893
3241.3E61528893r36127r36394m16222o93206o24504L4866J48888o69365j137085j27259
$$ 561528893 560592766 559656372 559240150 558546944 557922440 557957306 558106194 557436829 556299744 556172485
3250.9E56172485m37355l77617j25083q51632l81279j61438j93252o59027r22966q88329
$$ 556172485 555735130 555357513 555232430 554380798 553999519 553838081 553644829 552985802 552062836 551174507
3260.5E51174507o68907K17819l20587q14972q14094n90172M61044L94974m55246p02667
$$ 551174507 550505600 550723419 550402832 549587860 548773766 548183594 548644638 549039612 548584366 547881699
3270.2E47881699m96178j28555j21689p87125p61261o55556q93440k35672M19998J95427
$$ 547881699 547385521 547256966 547135277 546348152 545586891 544931335 544037895 543802223 544222221 544417648
3279.8E44417648r05761r77745m22707l97263m87327m78745J53809m13971q01086j09520
$$ 544417648 543511887 542534142 542111435 541714172 541226845 540748100 540901909 540487938 539686852 539577332
3289.5E39577332M4326j32904r08966o01043k71035m17671l15399p84416m32129m90303
$$ 539577332 539621658 539488754 538579788 537978745 537707710 537290039 536974640 536190224 535758095 535267792
3299.1E35267792o02227l28292p25861l16734l96118p00951m46014o76613o14472n68847
$$ 535267792 534665565 534337273 533611412 533294678 532898560 532197609 531751595 531074982 530460510 529891663
3308.8E29891663j33171k00844j220589o51016o8932o76765q28095n64575l54614l35846
$$ 529891663 529758492 529557648 528337059 527686043 527617111 526940346 526112251 525547676 525193062 524857216
3318.4E24857216o24085j021881o56242o54259q47587k71454n30586j029358j258278
$$ 524857216 524233131 523211250 522555008 521900749 521053162 520781708 520251122 519221764 517963486
3327.1E17963486o94962q7433p03621p60765j097717j332893o59905r05037q91075
$$ 517963486 517268524 517181091 516477470 515716705 514618988 513286095 512626190 511721153 510830078
3335.8E10830078m55856p83425q01429o35338n74303o36291j165200r48181o78177
$$ 510830078 510374222 509590797 508789368 508154030 507579727 506943436 505778236 504830055 504151878
3344.4E04151878n85060n02662r76677q26264j096763o85845R9869q62427j231155
$$ 504151878 503566818 503064156 502087479 501261215 500164452 499478607 499578476 498716049 497484894
3353.1D97484894p19757l04871p23686j103363j093254p69997K09160n58167j325302
$$ 497484894 496765137 496460266 495736580 494633217 493539963 492769966 492979126 492420959 491095657
3361.8D91095657p99141m58335q38433j177673l55301m63028q46710q10623j038285
$$ 491095657 490296516 489838181 488999748 487822075 487466774 487003746 486157036 485346413 484308128
3370.5D84308128j008300o18172k50588o76345o98510m29802l70140n63430p19796
$$ 484308128 483299828 482681656 482431068 481754723 481056213 480626411 480256271 479692841 478973045
3379.2D78973045l63121o22062r02481q34580m57458l35541m11606j62201j94550k56118
$$ 478973045 478609924 477987862 477085381 476250801 475793343 475457802 475046196 474883995 474689445 474433327
3388.8D74433327p38564o36406k60200o27938p24411k46849j06582o07796l55148m26598
$$ 474433327 473694763 473058357 472798157 472170219 471445808 471198959 471092377 470484581 470129433 469702835
3398.4D69702835n46989k05574l21656k14309o67534n38712M7035l46565l17955M19045
$$ 469702835 469155846 468950272 468628616 468414307 467746773 467208061 467255096 466908531 466590576 467009621
3408.1D67009621O4010q85658l78571m8484m21486o57234o17791l90205j40610k61726
$$ 467009621 467073631 466187973 465809402 465760918 465339432 464682198 464064407 463674202 463533592 463271866
3417.7D63271866m57153O23054K96707n80444k43645k80609M08096J32485n31693J46675
$$ 463271866 462814713 463437767 463734474 463154030 462910385 462629776 463037872 463170357 462638664 462785339
3427.4D62785339Q38242K19307l01476J68457k77862j56479M20074J92337k85720l23067
$$ 462785339 463623581 463842888 463541412 463709869 463432007 463275528 463695602 463887939 463602219 463279152
3437D63279152j07231J1787O27098O44417M86374j58272m03137k5711M03442J086579
$$ 463279152 463171921 463183708 463810806 464455223 464941597 464783325 464380188 464354477 464757919 465844498
3446.7D65844498o59294l54691J336899J157799O74820o8245J88026K94189K91977
$$ 465844498 465185204 464830513 466167412 467325211 468000031 467931786 468119812 468414001 468705978
3455.3D68705978O44837R39750L74108j34850P32003J55868R6397L10250N94978J355553
$$ 468705978 469350815 470290565 470664673 470529823 471261826 471417694 471514091 471824341 472419319 473774872
3465D73774872O26488N67169K73399K77863Q50105R51576O92520Q2207M09126M21067
$$ 473774872 474401360 474968529 475241928 475519791 476369896 477321472 478013992 478096199 478505325 478926392
3474.6D78926392N22079P04956O69136Q92487O69403K15645K55775O27556L71666J013489
$$ 478926392 479448471 480153427 480822563 481715050 482384453 482600098 482855873 483483429 483855095 484868584
3484.3D84868584O99119K57378J295586O23016J96380P95708J023979N90363M59137
$$ 484868584 485567703 485825081 487120667 487743683 487940063 488735771 489759750 490350113 490809250
3493D90809250J128235J005974N80978J87530L44429P21016J124573Q85582K64092
$$ 490809250 491937485 492943459 493524437 493711967 494056396 494777412 495901985 496787567 497051659
3501.6D97051659O3285j01280J249008J685334Q28018O70891J201019N40085P3738
$$ 497051659 497114944 497013664 498262672 499948006 500776024 501446915 502647934 503188019 503261757
3510.3E03261757J182899M61045Q43544J536560J019745O94694L29819R37309P99904
$$ 503261757 504444656 504905701 505749245 507285805 508305550 509000244 509330063 510267372 511067276
3519E11067276P20329Q83065J260414R09691m51508P42111J441307J220055K47574
$$ 511067276 511787605 512670670 513931084 514840775 514389267 515131378 516572685 517792740 518040314
3527.7E18040314K32315J247253J675377J427841K32621Q00781J332283J793594O42433
$$ 518040314 518272629 519519882 521195259 522623100 522855721 523656502 524988785 526782379 527424812
3536.4E27424812n76362J312790J219825Q89855J161232J724052Q89092Q76693J198006
$$ 527424812 526848450 528161240 529381065 530270920 531432152 533156204 534045296 534921989 536119995
3545E36119995o01082J151619N50461J406479K033119J289864J867714p51229Q26302
$$ 536119995 535518913 536670532 537220993 538627472 540660591 541950455 543818169 543066940 543893242
3553.7E43893242J548805J786575J666718l52898J867256J799088M89845K8534K048683
$$ 543893242 545442047 547228622 548895340 548542442 550409698 552208786 552698631 552727165 554775848
3562.4E54775848K096367J99662K848053r08204o66771J415482L87878L746109K045899
$$ 554775848 556872215 557071877 559919930 559011726 558344955 559760437 560148315 563894424 565940323
3571.1E65940323J200905J317596J510353J014214Q21609J857720J094627K853050
$$ 565940323 567141228 568458824 569969177 570983391 571805000 573662720 574757347 577610397
3578.8E77610397J635437O6567J059303J042404J444512J199836M010735K128792k556725
$$ 577610397 579245834 579312401 580371704 581414108 582858620 584058456 588069191 590197983 587641258
3587.5E87641258L95508N96275L315239K494774J697235N74875O09322K834511m86451
$$ 587641258 588036766 588633041 591948280 594443054 596140289 596715164 597324486 600158997 599672546
3596.1E99672546K425766K722512l0785K218056P65342J352845K653198J444855J363640
$$ 599672546 602098312 604820824 604790039 607008095 607773437 609126282 611779480 613224335 614587975
3604.8F14587975K914505K483024q18443L515549J50528n31464O611557J260834k101097
$$ 614587975 617502480 619985504 619167061 622682610 622833138 622301674 628913231 630174065 628072968
3613.5F28072968K156410j477127L716964M634552K19002J636772o17637M12979L006744
$$ 628072968 630229378 628752251 632469215 637103767 637322769 638959541 638341904 638754883 641761627
3622.2F41761627J867371J792373K667847J226349J281891O340790J243438j0588760
$$ 641761627 643628998 645421371 648089218 649315567 650597458 656938248 658181686 647592926
3629.9F47592926M154587N530853M871826J340027q74557K418289K887115K538529
$$ 647592926 651747513 657278366 662150192 663490219 662615662 665033951 667921066 670459595
3637.6F70459595J147918J149216J641007J729889R94110L70330K109986L009872M077683
$$ 670459595 671607513 672756729 674397736 676127625 677121735 677492065 679602051 682611923 686689606
3646.3F86689606k034073l719635M925766J178207k396927m90493N415802M310302
$$ 686689606 684655533 680935898 685861664 687039871 684642944 684152451 689568253 693878555
3654F93878555K833863L886642o424179J363220M982910R87625P22733K65121J915970
$$ 693878555 696712418 700599060 694174881 695538101 700521011 701508636 702231369 702496490 704412460
3662.7G04412460J114655P57217J301270P0724L112030J786728j811828m5700n607529
$$ 704412460 705527115 706284332 707585602 707656326 710768356 712555084 710743256 710697556 705090027
3671.4G05090027J964187P049790O693191j789093j5514373K682190O934051M344330
$$ 705090027 707054214 714104004 720797195 719008102 703493729 706175919 713109970 717454300
3679.1G17454300j614075M06494L089600J516647K71836o36979K01188K856521L712464
$$ 717454300 715840225 716246719 719336319 720852966 721124802 720487823 720689011 723545532 727257996
3687.8G27257996p345429k528381O355514n217132o562M625931N68924J553650r6893
$$ 727257996 719912567 717384186 723739700 718522568 718516006 723141937 723710861 725264511 725167618
3696.4G25167618l50723R68170j006699J740875L161927n097886k325592M694291J619567
$$ 725167618 724816895 725785065 724778366 726519241 729681168 724583282 722257690 726951981 728571548
3705.1G28571548j35498N54581K506943L073120p386932K715454L811798j0819931
$$ 728571548 728436050 728990631 731497574 734570694 727183762 729899216 733711014 722891083
3712.8G22891083M819793M984818L91006m54101J181564L30048m071274J088333M791565
$$ 722891083 727710876 732695694 733086700 732632599 733814163 734144211 730072937 731161270 735952835
3721.5G35952835m337006m086151M038163L60107q77533k948379J86767L627625Q06198
$$ 735952835 731615829 727529678 731567841 731927948 731050415 728102036 728288803 731916428 732722626
3730.2G32722626M701004j409378o886292P335968L33863j1636429K553863M402313
$$ 732722626 737423630 736014252 729127960 736463928 736797791 725161362 727715225 732117538
3737.9G32117538J37864L224411L688888l094787K257919R695740r688568j5424729
$$ 732117538 732255402 735479813 739168701 736073914 738331833 748027573 738339005 722914276
3745.6G22914276R582825M568939L658142k876739q643570J0351715k215271o359101
$$ 722914276 732497101 737066040 740724182 737847443 729203873 739555588 737340317 730981216
3753.3G30981216M708786M058457K554397m478225K492065M722977o883774j678543
$$ 730981216 735690002 739748459 742302856 737824631 740316696 745039673 738155899 736477356
3761G36477356L169708J448899O53610K787552k805100m093704K790909M066238Q37631
$$ 736477356 739647064 741095963 741749573 744537125 741732025 737638321 740429230 744495468 745333099
3769.7G45333099p849197J342392L284759O09894R99069o27441M62647L24554K278900
$$ 745333099 737483902 738826294 742111053 742720947 743720016 743092575 743555222 743879776 746158676
3778.4G46158676k94952p318268K264709K023774Q35647J147766l313141k02636J341552
$$ 746158676 745863724 738545456 740810165 742833939 743669586 744817352 741504211 741301575 742643127
3787.1G42643127R77326J002350k27509R2774J8386J36567o34995Q84323K241364m166336
$$ 742643127 743620453 744622803 744395294 744488068 744506454 744643021 744008026 744892349 747133713 742967377
3796.7G42967377l574906J691590L071136M568253m613495q836060K984162K775192
$$ 742967377 739392471 741084061 744155197 748723450 744109955 735273895 738258057 741033249
3804.4G41033249M544067N631714r562301m678422M255295K055435J524735O24237
$$ 741033249 745577316 751209030 741646729 736968307 741223602 743279037 744803772 745428009
3812.2G45428009j344986r537M369049k567596j1695099N906067N148697K766800n7755
$$ 745428009 744083023 744073486 748442535 745874939 734179840 740085907 745234604 748001404 747943649
3820.8G47943649j6243362K771683O119766K271347K121811j65405k544022N43213
$$ 747943649 731700287 734471970 740591736 742863083 744984894 744819489 742275467 742818680
3828.6G42818680J080856K717285J59455p860871K574845N501785n354233m29001P091294
$$ 742818680 743899536 746616821 746776276 738915405 741490250 746992035 741637802 741208801 748300095
3837.2G48300095r743729l878326P938842m099884J717301O023102k329178k920456
$$ 748300095 738556366 734678040 742616882 738516998 740234299 746257401 743928223 741007767
3844.9G41007767K294845J703644l22189J348724j065292R13543M746933o886138l19138
$$ 741007767 743302612 745006256 744684067 746032791 744967499 745881042 750627975 743741837 743422699
3853.6G43422699j0409699J448212Q884278l19367j629333J717071K234268J910706
$$ 743422699 733013000 734461212 743345490 743026123 741396790 743113861 745348129 747258835
3861.3G47258835n189057o61544N185089n208817m092102L845825M145127N554504
$$ 747258835 742069778 741408234 746593323 741384506 737292404 741138229 745283356 750837860
3869.1G50837860n961380r242706L617248N975342J680756r638291K225113M164353
$$ 750837860 744876480 735633774 739251022 745226364 746907120 737268829 739493942 743658295
3876.8G43658295K13165K854843M472427n774383p073441M894333K45438J142273N273056
$$ 743658295 743871460 746726303 751198730 745424347 738350906 743245239 743490677 744632950 749906006
3885.4G49906006j0880203r7962L767548J434860L754272j302108p421112J398391
$$ 749906006 739025803 738927841 742695389 744130249 747884521 746582413 739161301 740559692
3893.2G40559692K535553j060104J472321J254425K179565J115723q591843L365326
$$ 740559692 743095245 742035141 743507462 744761887 746941452 748057175 739465332 742830658
3900.9G42830658M43726m205780M247970l345261r65652K117767J541672K167282j61896
$$ 742830658 743274384 739068604 743316574 739971313 739005661 741123428 742665100 744832382 744670486
3909.6G44670486m23584k52304N32685P4310o97708J073837R91211l265991k309036
$$ 744670486 744246902 743994598 744527283 744601593 743903885 744977722 745968933 742702942 740393906
3918.2G40393906L749923M85459k874832J900405J142884L49960k088852k672729J794128
$$ 740393906 744143829 744629288 741754456 743654861 744797745 745147705 743058853 740386124 742180252
3926.9G42180252J258926J232758j35422q43582J146240k854309j229782K048035O714
$$ 742180252 743439178 744671936 744536514 743692932 744839172 741984863 740755081 742803116 742809830
3935.6G42809830L35846J021957m8218n50232q92944N58395R99756k847213p30362
$$ 742809830 743145676 744167633 744119415 743569183 742676239 743234634 744234390 741387177 740656815
3944.3G40656815J363983Q36029R6969k368164J052323P41729j557846J680527K47803
$$ 740656815 742020798 742856827 742953796 740585632 741637955 742379684 740821838 742502365 742750168
3953G42750168n02014R8724L4638N39703l68729K24457Q11768J595687Q0567k034378
$$ 742750168 742248154 742346878 742381516 742921219 742552490 742776947 743588715 745184402 745264969 743230591
3962.6G43230591J19629j95160p59201N70144L84369M87290N01938m53797j56784j3504
$$ 743230591 743350220 743155060 742395859 742966003 743350372 743837662 744339600 743885803 743729019 743715515
3972.2G43715515j82648j48010n22003J44730K68097M5471j67542m91485L65142O15311
$$ 743715515 743532867 743384857 742862854 743007584 743275681 743321152 743153610 742662125 743027267 743642578
3981.9G43642578k16064r04084k59628J88446O00434M60510q41904M25415O01730m14276
$$ 743642578 743426514 742522430 742262802 742451248 743051682 743512192 742670288 743095703 743697433 743283157
3991.5G43283157K44446M0894J29547l05863n50537J25122j91345O9885O06995
$$ 743283157 743527603 743568497 743698044 743392181 742841644 742966766 742775421 742845306 743452301
4000.2G43452301
$$ 743452301
##END=$$ End of the data block
