##TITLE=$$ Begin of the data block
##JCAMP-DX=5.00 $$ ACD/SpecManager v 10.08
##SPECTROMETER/DATA SYSTEM=Varian
##DATE=08 Jan 2013 16:01:18
##DATA TYPE=INFRARED SPECTRUM
##DATA CLASS=XYDATA
##ORIGIN=
##OWNER=
##NPOINTS=3735
##FIRSTX=399.26403809
##LASTX=4000.35498047
##MAXX=4000.35498047
##MINX=399.26403809
##MAXY=81.09474945
##MINY=42.91126633
##XFACTOR=1.0000000000
##YFACTOR=0.000000100000000
##FIRSTY=60.21529007
##DELTAX=0.96440572
##XUNITS=1/CM
##YUNITS=TRANSMITTANCE
##XYDATA=(X++(Y..Y))
399.3F02152901M43153m18739K010002k31209n464096J0037689J4544144m528046j3963737
407.9F04582062j300583Q364906M033928j779823p989159n162124L647842L306770
415.7F07703819k440262M90990K0710411q259048k0682450M448586Q291550j967698
423.4F08295898m061546J517677Q38738P16705K72217m59328j069908k752266O5995
432.1F03364182p7477k660980J641159M677582K615585O63872l633614k190475J281318
440.7F05681152j508636J224327L84178n46951J684646j570777O80809K110481k362862
449.4F05776367l129425k50320k67716j666565k93007O45829L499145j3656q058091
458.1E96242561M104729N664291m604187o181144L373604k203026j561623Q733254
$$ y = [602152901, 602596054, 602177315, 604187317, 603956108, 598492012, 608529701, 623073845, 618545799, 604582062, 603281479, 611646385, 615680313, 613900490, 605911331, 600749207, 604397049, 607703819, 605263557, 605754547, 626464958, 618205910, 597523460, 601972046, 610263596, 608295898, 604234352, 605752029, 606590767, 607307472, 607579689, 607120361, 606050453, 603298187, 603364182, 603286705, 600625725, 602266884, 606944466, 609560051, 610223923, 606590309, 604399834, 605681152, 604172516, 605396843, 605781021, 605234070, 606918716, 605347939, 606028748, 608139229, 605776367, 602646942, 602396622, 602128906, 600462341, 600169334, 600815163, 604314308, 604300652, 596242561, 600347290, 606011581, 601407394, 595226250, 598599854, 596396828, 594835205, 603568459]
465.8F03568459L294715k495155m255218m306603k343445r93843J903916j755333l29056
474.5E92288437L528175M27246l107032m87977K450409J968155j06201Q5945n28068
483.2E96519089k704735K89764J100464J630059R52110k421494j435623j244354j683769
491.8E91001511m07830J376725M42543j333123L125496N188942J822930k114945j664467
500.5E97437782j640396m797745n09109P97691N85480M39758j453972j844825l29552
509.2E88685112L832893K439347j830902j850968j261024j103249M2687N04303m00124
517.9E89058075J117439J413841j86958p11326n63088o57997l03345M83628k062912
526.6E87587357k321740J30463J943588J765595Q38852q73108k864151q55942l15056
$$ y = [603568459, 606863174, 604368019, 600112801, 595806198, 593462753, 592468910, 594372826, 592617493, 592288437, 595816612, 596243858, 593136826, 592648849, 595099258, 597067413, 596961212, 597047157, 596519089, 593814354, 594104118, 595204582, 596834641, 597786751, 595365257, 593929634, 592685280, 591001511, 590593681, 591970406, 592412949, 591079826, 594205322, 599394264, 601217194, 599102249, 597437782, 595797386, 590999641, 590490532, 591288223, 591873703, 592313461, 590859489, 589014664, 588685112, 592518005, 594957352, 593126450, 591275482, 590014458, 588911209, 588953896, 589458199, 589058075, 590175514, 591589355, 591402397, 590691071, 590127983, 589469986, 589166641, 589650269, 587587357, 585265617, 585396080, 587339668, 589105263, 589944115, 589071007, 586206856, 585350914, 585035858]
535.2E85035858m51012N97153L56331J418266p1907p5493M62456j740684j519509k031097
544.9E81980362j566620P18575O67686q1329J61934J347313J777572n40771k024765
553.6E82439957q75702j466942j555290j80168M51049Q70133R65996R65194M04816
562.3E82019043p25555j073266o19163j294899n37834J220093M28810Q27408Q13331
570.9E81057968K38304O71997K82326j041756j911773r60503R5368M44870K47421O84433
580.6E79808655J482734O32134o88286q79745P68623N55763p24945q86535m38958K709
590.2E79632149j167069l4027K802429J213074n99136k71607j483803q17260J83029
598.9E79457779j198425L8108N11590N47676P6217n82580J077118J18675j203804j647339
$$ y = [585035858, 584584846, 585181999, 585538330, 586956596, 586884689, 586809196, 587271652, 585530968, 584011459, 581980362, 580413742, 581132317, 581800003, 581718674, 581880608, 583227921, 585005493, 584464722, 582439957, 581564255, 580097313, 578542023, 578361855, 578812904, 579683037, 580649033, 581614227, 582019043, 581293488, 580220222, 579601059, 578306160, 577768326, 578988419, 579417229, 580244637, 581057968, 581296272, 581968269, 582250595, 581208839, 579297066, 578336563, 578431931, 578876801, 579124222, 579808655, 581291389, 581923523, 581235237, 580355492, 581124115, 581679878, 580954933, 580068398, 579629440, 579632149, 578465080, 578431053, 581233482, 582446556, 581847420, 581575813, 580092010, 579274750, 579457779, 578259354, 578297462, 578809052, 579356728, 579432945, 578850365, 579927483, 580046158, 578842354, 577195015]
608.5E77195015j457558j698761j793327J706848K347450N53818j94664j330986j415291
617.2E73912544N96962J274567N3749J8120n5008M27055J475945K602462Q84171l70331
626.9E80820236J123696j013222j18294K316818J866379J367874J02844J285592J696930
635.5E89448853N79948L82500L41224K02141j022796l39509J577187J273880O21300
644.2E93064728J914291J334152K36512L62663p2632L54958m04511P5569J364670J003227
653.9E99233627J074791M55628j48278o32515J62125o45599k313652J79977J097984
662.5E98464088M56124J037254J325455O59256k436218j1975747N181923P107048K097779
671.2F01916962q12798l5057L71628J160049J098099R50012L73764R03817K086601
$$ y = [577195015, 575737457, 574038696, 572245369, 573952217, 576299667, 576853485, 576658821, 575327835, 573912544, 574509506, 575784073, 575837822, 575855942, 575800934, 576227989, 577703934, 580306396, 581190567, 580820236, 581943932, 580930710, 580812416, 583129234, 584995613, 586363487, 586466331, 587751923, 589448853, 590028801, 590411301, 590752525, 590954666, 589931870, 589592361, 591169548, 592443428, 593064728, 594979019, 596313171, 596549683, 596912346, 596839714, 597194672, 596790161, 596865730, 598230400, 599233627, 600308418, 600764046, 600615768, 599983253, 600145378, 599499779, 597186127, 597366104, 598464088, 598920212, 599957466, 601282921, 601942177, 599505959, 587530212, 592712135, 599819183, 601916962, 601104164, 601069107, 601440735, 602600784, 603698883, 604648895, 605022659, 605926476, 608013077]
679.9F08013077J104545M3717p27463M86412J138344K13661L70331O47430J840477
688.6F13130531K148056J117020J18828o28929o37093m19197N51605J134033J534653
697.3F18049507J637077Q30689P5226J03378J339073P59926l09372r4414j945R45549
706.9F23334694J438751J475525J232796N08232K26784K10495N37986L04413o8931
715.6F29200745r5444K13356N3635k59629J728401K158394J29929L5820k55585L09677
725.2F33219299K339554M41437q86574R35173J311455J659393J338387J15661p53288
733.9F39720497k11792J019097l59116j31302J979141J651001M60282J66320P61948
742.6F45056076P38831k38495K29492P02209p96966J58768J462707R07059J591873
$$ y = [608013077, 609117622, 609161339, 608433876, 608920288, 610058632, 610272293, 610642624, 611290054, 613130531, 615278587, 616395607, 616514435, 615885506, 615248413, 614829216, 615380821, 616514854, 618049507, 619686584, 620517273, 620592499, 620695877, 622034950, 622794876, 622485504, 622391090, 622389145, 623334694, 624773445, 626248970, 627481766, 627989998, 628216782, 628427277, 628965263, 629269676, 629200745, 629105301, 629318657, 629372292, 629112663, 630841064, 632999458, 633129387, 633165207, 632909622, 633219299, 635558853, 636000290, 635113716, 636048889, 637360344, 639019737, 640358124, 640473785, 639720497, 639508705, 640527802, 640168686, 640037384, 642016525, 643667526, 644127808, 644294128, 645056076, 645794907, 645556412, 645785904, 646488113, 645691147, 645849915, 647312622, 648219681, 649811554]
751.3F49811554K197342J763611j095810j689987N18341R57489J766510R97543K49405
760F55475998J069412J378479Q54111j44730J29242J40228j33743j18637K48718N77622
769.6F59476700Q57391R57871Q43887O20193j056823k45972K55737j342086o54526
778.3F59712372K35367R39941J101151J061019J077881O47049j74484p44705N9051
787F63914642Q22144Q08716p82471k62375J259918J106263L84826p19757R54666N42450
796.6F68029022r12628l47900o68030q44193j801376o93130Q11233k3956p75223j464005
806.2F61309814j284179k45438m14505j074447p17774j474686j637191o50788q0337
814.9F53730469o25839j503373k43759l12042k50473Q22601Q88367Q80203o7825L26156
$$ y = [649811554, 652008896, 653772507, 652676697, 650986710, 651505051, 652462540, 654229050, 655226593, 655475998, 656545410, 657923889, 658778000, 658633270, 658762512, 658902740, 658768997, 658650360, 658899078, 659476700, 660334091, 661291962, 662135849, 662756042, 661699219, 661453247, 661708984, 660366898, 659712372, 659947739, 660887680, 661988831, 663049850, 664127731, 664774780, 664600296, 663855591, 663914642, 664736786, 665545502, 664763031, 664500656, 665760574, 666866837, 667251663, 666531906, 667486572, 668029022, 667116394, 666768494, 666100464, 665256271, 663454895, 662761765, 663572998, 663549042, 662773819, 661309814, 660025635, 659780197, 659365692, 658291245, 657573471, 656098785, 654461594, 653810806, 653730469, 653104630, 651601257, 651357498, 651045456, 650794983, 651617584, 652505951, 653386154, 653318329, 653644485]
824.6F53644485J349488K163315J674041J211472K993927K342605J560364K135620
832.3F69075317K577820K038574J003571K051620K437973J707230R14078N08194P02057
841F83016434R85412R19800J389618J156158N18418J734772J256637Q22907R32998
849.6F92733154P42569O45218P21893J368180L10821R53827R89990J527024K337417
858.3G02330093P00913N59463n09491Q18940R91287n48706P37610J092224J225128
867G07397461M46625n15595j606674q70666j337052k728042q92258m28620K43226K21710
876.7F99930115N645m69360p54547O47049k22931r83429j430969l54920N08500m51127
886.3F96424026q75701p71714k4566n11170l20663p79877p80411j21002j015320j026230
$$ y = [653644485, 654993973, 657157288, 658831329, 660042801, 663036728, 665379333, 666939697, 669075317, 671653137, 673691711, 674695282, 676746902, 679184875, 680892105, 681806183, 682314377, 683016434, 684001846, 684921646, 686311264, 687467422, 687985840, 689720612, 690977249, 691800156, 692733154, 693475723, 694120941, 694842834, 696211014, 696521835, 697475662, 698465652, 699992676, 702330093, 703031006, 703590469, 703080978, 703899918, 704891205, 704342499, 705080109, 706172333, 707397461, 707844086, 707328491, 705721817, 704851151, 703514099, 700786057, 699893799, 699465179, 699708405, 699930115, 699935760, 699466400, 698711853, 699358902, 699135971, 698152542, 696721573, 696366653, 696875153, 696424026, 695548325, 694776611, 694752045, 694240875, 693920212, 693140335, 692359924, 692238922, 691223602, 690197372]
895.9F90197372j95999J605835N37262q58078p23343j138153n56793j143265o17828
904.6F87107010R98688J797638J540832J531143K455063J131668k26898K72293R30557
913.3F97537994N8747p37686j396790j124573j91803n83038j192627k817841j702804
922F87849579j080322j747513j458512k727584j497422j171341k234573k403259j442414
930.7F72086639m18548j886597j744232j634369j453476q92792r02176j71890n82962
939.3F62399597p73620j223679j170120q92258j021957n94406j259385j074600o35528
948F53754044p17392J89972J068878N40924n00336p34253o86416k77176r53293j772614
957.7F49912338j608047j424866j676331k251663j298599o84128j218338j487465j758461
$$ y = [690197372, 690001373, 691607208, 692144470, 691286392, 690563049, 689424896, 688868103, 687724838, 687107010, 688105698, 689903336, 691444168, 692975311, 695430374, 696562042, 696335144, 696607437, 697537994, 697596741, 696859055, 695462265, 694337692, 694145889, 693562851, 692370224, 689552383, 687849579, 686769257, 685021744, 683563232, 680835648, 679338226, 678166885, 675932312, 673529053, 672086639, 671668091, 669781494, 668037262, 666402893, 664949417, 664056625, 663154449, 662982559, 662399597, 661625977, 660402298, 659232178, 658339920, 657317963, 656723557, 655464172, 654389572, 653754044, 653036652, 653226624, 654295502, 654836426, 654336090, 653601837, 652915421, 652638245, 651684952, 649912338, 648304291, 646879425, 645203094, 642951431, 641652832, 640968704, 639750366, 638262901, 636504440]
966.3F36504440j075096j118698j730347q81004j402740k521286j991044j367874j201934
975F23214417k344513l205529k905235k810783k655259k710914k385941k330932l224869
983.7E98640442m070206l873024l442764l467445l051835k606010k536430k885399
991.4E72707329k360764j747703k036553k457390k331810j605835j329345j709709
999.1E57128220k360611j718521j664505k101899j762848k069244j709633j469612
1006.8E42271347j500549j516533j404877j761818j843567q92791q15354r22661j936302
1015.5E29676895j573219j342278k554474k252883k119103j624832j438332j209717
1023.2E15562057j798591j991921j127472j298942j056137j534233r80339j128693
$$ y = [636504440, 635429344, 634310646, 632580299, 631699295, 630296555, 627775269, 625784225, 624416351, 623214417, 620869904, 617664375, 614759140, 611948357, 609293098, 606582184, 604196243, 601865311, 598640442, 594570236, 590697212, 587254448, 583787003, 580735168, 578129158, 575592728, 572707329, 570346565, 568598862, 566562309, 564104919, 561773109, 560167274, 558837929, 557128220, 554767609, 553049088, 551384583, 549282684, 547519836, 545450592, 543740959, 542271347, 540770798, 539254265, 537849388, 536087570, 534244003, 533351212, 532535858, 531613197, 529676895, 528103676, 526761398, 524206924, 521954041, 519834938, 518210106, 516771774, 515562057, 513763466, 511771545, 510644073, 509345131, 508288994, 506754761, 505774422, 504645729]
1031E04645729j273689o03905l22761L51028n646J417160J105232P81289J397361J486397
1040.6E08978195K072525Q9379l64495j17302O7940K37198n6534o57692j964912j295624
1050.2E06988678j067925r0637j033745j973075p47185j587181j131134k80190N71747
1058.9D99649353o7787O62117J544380J123810K308617R80987J276817K218285J664772
1067.6E11361351J245880J951981J688423O1760J032638J69831k5101K96745j69906
1076.3E17613602P8506J60217J083107L11699J034165Q01201J20926K41012l88565
1085E21055870P24106L37791R15718P79534R07402K314110J386108P76100R78012J534310
1094.6E31709061n303k59590J001320J449699J503258L46604J089820O72951k10762
$$ y = [504645729, 503372040, 502768135, 502445374, 502796402, 502790756, 504207916, 505313148, 506094437, 507491798, 508978195, 511050720, 511140099, 510775604, 510658302, 510726242, 510963440, 510906906, 510249214, 508284302, 506988678, 505920753, 505830116, 504796371, 502823296, 502076111, 500488930, 499357796, 499077606, 499649353, 499581566, 500243683, 501788063, 502911873, 505220490, 506201477, 507478294, 509696579, 511361351, 512607231, 514559212, 516247635, 516309395, 517342033, 517511864, 517486763, 517783508, 517613602, 517692108, 517852325, 518935432, 519247131, 520281296, 521082497, 521203423, 521444435, 521055870, 521779976, 522117767, 523033485, 523813019, 524720421, 527034531, 528420639, 529196739, 530174751, 531709061, 531703758, 531444168, 532445488, 533895187, 535398445, 535745049, 536834869, 537507820, 537297058]
1103.3E37297058N85365J183510O59752l79066P68547Q13026K01111P13081L66440
1112E42208824m29725K12974J400604J235771N61944m47960J61323O19316L38173L88031
1121.6E46249275l89328J86882O79054N19791N1956m94766J01929J234321K029267
1130.3E50168381K525444K792778J144981N92804J294518J496582J717224J826629
1138E63559341J888581J058540J119156J340370J234970J182060Q71888R48333M32892
1146.7E73636131k53830p98225k03857J5182n72395L5820N04226Q73299l20892p25861
1156.3E72189598L0136r29336q20885j008034j270408l56026M94614J222496R38491
1165E70490646P76940J526260K219696J875801J470490J877479K060509K126617K725640
$$ y = [537297058, 537882423, 539065933, 539725685, 539346619, 540115166, 540928192, 541129303, 541842384, 542208824, 541779099, 541992073, 543392677, 544628448, 545190392, 544742432, 544903755, 545523071, 545861244, 546249275, 545859947, 546046829, 546725883, 547245674, 547297630, 546802864, 546904793, 548139114, 550168381, 552693825, 555486603, 556631584, 557224388, 558518906, 560015488, 561732712, 563559341, 565447922, 566506462, 567625618, 568965988, 570200958, 571383018, 572254906, 573203239, 573636131, 573382301, 572584076, 572380219, 572395401, 571823006, 571858826, 572363052, 573236351, 572915459, 572189598, 572219734, 571290398, 570469513, 569461479, 568191071, 567835045, 568329659, 569552155, 570490646, 571267586, 572793846, 575013542, 576889343, 578359833, 580237312, 582297821, 584424438, 587150078]
1173.7E87150078K868194K706604K253113K376099K378349J055908J470909K029000
1181.4F04288254K350387K301865J475716J380615J408768K319603J491699K92015
1189.1F17308922K76794J89553M55780L33252N88340l4408m61426Q4877Q6708l60527
1198.8F18467865j004410m82368n65491r68323m66003q16155o92367j92299r1477M23470
1208.4F13612442L88412m82749q69637o46172o03256m44336m38118p19413j90354L79677
1218F09986496J96190n7030j75209k45438m56810p96012j062088q35343m46853o78521
1227.7F05429382k60200K87437q8310l33633p25975q02765o51551o28357j33323k01149
1237.3F01891556k38457J20239L18299N21011L27225m8371p04650q07572n36537o00739
$$ y = [587150078, 590018272, 592724876, 594977989, 597354088, 599732437, 600788345, 602259254, 604288254, 606638641, 608940506, 610416222, 611796837, 613205605, 615525208, 617016907, 617308922, 617585716, 617775269, 618231049, 618564301, 619152641, 619118233, 618656807, 618741684, 618828392, 618467865, 617463455, 616981087, 616415596, 615447273, 614981270, 614165115, 613472748, 613280449, 613188972, 613612442, 614000854, 613518105, 612648468, 612002296, 611399040, 610954704, 610516586, 609797173, 609606819, 609986496, 610182686, 610125656, 609950447, 609705009, 609248199, 608452187, 607390099, 606554756, 606107903, 605429382, 605169182, 605456619, 605368309, 605034676, 604308701, 603505936, 602854385, 602226028, 602092705, 601891556, 601653099, 601773338, 602091637, 602612648, 602939873, 602891502, 602186852, 601379280, 600842743, 600242004]
1247F00242004l03039k0332L73191O09017J26648l26958q2550k56920o27975l33748
1256.6E99399338m50287k39639J66816O44303J000557M66461M57802L53775Q1558K136
1266.3F01882820o4049L9N85861J245155R88464J286889J255226R55352R11370L13225
1275.9F09360352J75514L20968N82467Q19587O27404P92732J417198J635437J696320
1284.6F17427979J377830M52919J35345K70730N99174N88112M96674J123466J380692
1293.3F23852921J033325R61227L57857j88027K93503j22299m38080m1198N59844O00243
1302.9F26869316O0005J83068l03002k91252l23868r13849o27822n42870p95059j253205
1312.5F22061462p01942L09868J94626k81220L0098N04799j77574l10211J34086N16167
$$ y = [600242004, 599938965, 599918633, 600291824, 600900841, 601027489, 600700531, 600617981, 600361061, 599733086, 599399338, 598949051, 598709412, 598876228, 599520531, 600521088, 600987549, 601445351, 601799126, 601880684, 601882820, 601818771, 601818810, 602404671, 603649826, 604638290, 605925179, 607180405, 608135757, 609047127, 609360352, 609535866, 609856834, 610439301, 611258888, 611886292, 612679024, 614096222, 615731659, 617427979, 618805809, 619258728, 619394073, 619664803, 620263977, 620852089, 621348763, 622472229, 623852921, 624886246, 625847473, 626205330, 626017303, 626310806, 626188507, 625750427, 625709229, 626269073, 626869316, 626929321, 627112389, 626809387, 626518135, 626194267, 625280418, 624652596, 624109726, 623314667, 622061462, 621359520, 621669388, 621864014, 621582794, 621612892, 622117691, 621940117, 621629906, 621763992, 622280159]
1322.2F22280159P61986O59256P87925M96102L64418L00789m6730m51851p80525q68264
1331.8F23503265o73599l65448k39601q8539m5509J5945j99127k64778L04451O33850
1341.5F22580910O59942J90506N48516J131897P98874N39016M39339L20625r7999J55868
1351.1F27267494l25889o16913m05731p61147j03340L2806J69640J80244L52249J2360
1360.8F25801773j136475j310501j541671Q43391M20418o80618k90680o07338L01742
1369.4F21800041L80364Q6441j86310j138458j748085j47629J210022O11076O24962
1378.1F21492424K05154J97335J23787p68853j639289k255516j004448n7259M27628
1386.8F16720963k63787k39906K62794q64677p93304p96509p09305k998505l429756
$$ y = [622280159, 623042145, 623701401, 624489326, 624985428, 625349846, 625650635, 625603905, 625152054, 624371529, 623503265, 622829666, 622464218, 622224617, 622136078, 622090569, 622106514, 621907387, 621642609, 621947060, 622580910, 623240852, 623431358, 623979874, 625111771, 625910645, 626449661, 626889000, 627209625, 627111626, 627267494, 626941605, 626324692, 625918961, 625157814, 625054474, 625087280, 625256920, 625437164, 625789413, 625801773, 624665298, 623354797, 621813126, 622656517, 623076935, 622396317, 622105637, 621498299, 621800041, 622180405, 622266846, 622080536, 620942078, 619193993, 619046364, 620256386, 620867462, 621492424, 621697578, 621894913, 622018700, 621249847, 619610558, 617355042, 616350594, 616293335, 616720963, 616457176, 616217270, 616480064, 615615387, 614822083, 614025574, 613316269, 610317764, 606888008]
1395.5F06888008J49956o57501j104393l004799j198387K70843j215668j416282j862259
1404.2E96849518l034973k021675o32897q58803j282844q91037q59070q40149j002808
1412.8E85425262q69712j154023j252479j476975j405220k94113k870521J017303J730080
1421.5E78849602J38283k28081j354294Q13751P71141m14352K59628m8103Q2321Q99506
1431.2E79769402J877555Q59414R03205K091675Q30460j250229Q12569K558441J104469
1439.8E89556961J086006J891175J091575J488915P98301J279869J154404L99780L71361
1448.5E99118347J542053J972237K76871N22117J062661J580772R44366n03616q24165
1457.2F05691643J792488M456825J698227K792358J850281J277924K379837o7711J874542
$$ y = [606888008, 607037964, 606380463, 605276070, 602271271, 601072884, 601343727, 600128059, 598711777, 596849518, 593814545, 591792870, 591159973, 590301170, 589018326, 588127289, 587268219, 586428070, 585425262, 584555550, 583401527, 582149048, 580672073, 579266853, 578972740, 576102219, 577119522, 578849602, 578987885, 578759804, 577405510, 578219261, 578990402, 578576050, 578835678, 578787575, 578869896, 579769402, 581646957, 582506371, 583409576, 585501251, 586331711, 585081482, 585894051, 588452492, 589556961, 590642967, 592534142, 593625717, 595114632, 595912933, 597192802, 598347206, 598746986, 599118347, 600660400, 602632637, 602909508, 603431625, 604494286, 606075058, 607019424, 606515808, 605691643, 607484131, 611940956, 613639183, 616431541, 618281822, 619559746, 621939583, 621871872, 623746414]
1465.9F23746414K085648K169075J602821J376000K324714K13890k55546J894912M901276
1474.6F40059204L822174J681366K470703J960907J196594R09958N38712O97708J195068
1483.2F54532394J034241P08466J137466M4098L52707R51691k224884J74255J221695
1491.9F57932129N93414j14898l44086j219177n297013J807785N7679j869507N65719
1500.6F52112045j057663q21838n11017N39703o9046p177352n126648K054786K999001
1509.3F42941971Q33969J543274r54437j979371L29743j141434j010589l246689r34716
1518F36381721L118020J656341l827324m992637K464256K837219J605148k060318M23012
1526.6F37605438Q81081m97513J198387J130295O78177M86069j108094l656921J621094
$$ y = [623746414, 625832062, 628001137, 629603958, 630979958, 633304672, 633518562, 633263016, 635157928, 640059204, 643881378, 645562744, 648033447, 649994354, 651190948, 652100906, 652639618, 653337326, 654532394, 655566635, 656275101, 657412567, 657456665, 657809372, 658761063, 656536179, 656710434, 657932129, 658525543, 658410645, 658066559, 656847382, 651550369, 653358154, 653415833, 651546326, 652112045, 651054382, 650232544, 649721527, 650261230, 650192184, 643014832, 637888184, 639942970, 642941971, 643775940, 645319214, 644364777, 642385406, 642715149, 641573715, 640563126, 637316437, 636381721, 639499741, 641156082, 637328758, 632336121, 634800377, 637637596, 639242744, 637182426, 637605438, 638486519, 637989006, 639187393, 640317688, 640995865, 641481934, 640373840, 636716919, 638338013]
1535.3F38338013J248817M43535J202927k828713m469337O70128P00378M18129K616539
1544F38340416L36914j848106K123375O30149R61991l21350j255074J734505P15713
1552.7F41418533P58896k853851P15637K702866M66842q979034j1828919J0214921
1560.4F32615891M090995K900887O14776k56729k207184j942214n1995j497421j949654
1569.1F32317352p770767J044426R95255j856499j469383j130143j207275j1795616
1576.8F09127350N22880j089630l097725k334480l726082k544670l681068k041474
1584.5E91135101l253936l225213l158378m049645l036117m907761k597465l943291
1592.2E62963295k192535k561913l427925j825485m079171j901931l780403k463875
$$ y = [638338013, 639586830, 640030365, 641233292, 638404579, 633935242, 634605370, 635305748, 635723877, 638340416, 638677330, 636829224, 638952599, 639582748, 640544739, 640223389, 638968315, 640702820, 641418533, 642177429, 639323578, 640039215, 642742081, 643208923, 634229889, 622400970, 632615891, 636706886, 639607773, 640222549, 639965820, 637758636, 635816422, 635764427, 634267006, 632317352, 624546585, 625591011, 626586266, 624729767, 623260384, 622130241, 620922966, 609127350, 609650230, 608560600, 605462875, 603128395, 599402313, 596857643, 593176575, 591135101, 587881165, 584655952, 581497574, 577447929, 574411812, 569504051, 566906586, 562963295, 560770760, 558208847, 554780922, 552955437, 548876266, 546974335, 543193932, 540730057]
1599.9E40730057l327561l008423j356468l169517o73104k457122j212082k802429
1607.6E22723351j622124j704712k885208J37748k421455j24817j552963n6229j543197
1616.3E10950394p379303L802643j46027O62498j572456m0512j454430l341865K671509
1625E04152451M62036J819496j644707l0861N45578O2981M66194k76070K049408o71005
1634.6E06935501l465004m4136L474045K567406J407280J776123j60103K072601K60735
1643.3E14824448J769943J859512k201042J065178M57840M165115J893654L399162
1651E27233810K840462n570755k143135M379578N637016K315254K539559J603889J856766
1659.7E40692444K056808J639595K032891Q76197L982239K523575K336197K382202
$$ y = [540730057, 537402496, 534394073, 533037605, 529868088, 529194984, 526737862, 525525780, 522723351, 521101227, 519396515, 516511307, 516649055, 514227600, 514102783, 512549820, 512493591, 510950394, 503571091, 507373734, 507227707, 507890205, 506317749, 506277237, 504822807, 501480942, 504152451, 504614487, 506433983, 504789276, 504758415, 505303993, 505366974, 505833168, 505557098, 507606506, 506935501, 503470497, 503426361, 506900406, 509467812, 510875092, 512651215, 512491112, 514563713, 514824448, 516594391, 518453903, 516252861, 517318039, 517775879, 521940994, 523834648, 527233810, 530074272, 524503517, 522360382, 526739960, 532376976, 534692230, 537231789, 538835678, 540692444, 542749252, 544388847, 546421738, 547297935, 551280174, 553803749, 556139946, 558522148]
1667.4E58522148J798630Q23517J697426M295578J703643L712197L658371J023407
1675.1E77234917J147384L792229L872643K036628J955529J281471M449081M046822
1682.9E99816704j295662J545753L949242O080704L189964J844635K988358K595825
1690.6F20715523M318352L969383L676643M160881L385277l184242L861580N542526
1698.3F46445923M968262o61316l072205Q126373N360947K727661J262436K448044
1706F67606125J285782J936950K852478J061707J115723K246551K731018K525330l54386
1714.7F83007278M1886L288193L65829n813141M100342L340988J665192J231003N82275
1723.4F91809845J233368J991348J747666P58209N81741J047211j965409n24826L310395
$$ y = [558522148, 560320778, 561144295, 562841721, 567137299, 568840942, 572553139, 576211510, 577234917, 578382301, 582174530, 586047173, 588083801, 590039330, 591320801, 595769882, 599816704, 598521042, 600066795, 604016037, 610096741, 613286705, 615131340, 618119698, 620715523, 625033875, 629003258, 632679901, 636840782, 640226059, 637041817, 640903397, 646445923, 651414185, 650752869, 647680664, 655807037, 661167984, 663895645, 665158081, 667606125, 668891907, 670828857, 673681335, 674743042, 675858765, 678105316, 680836334, 683361664, 683007278, 683049164, 686337357, 686703186, 680890045, 684990387, 688331375, 689996567, 691227570, 691809845, 693043213, 695034561, 696782227, 697540436, 698122177, 699169388, 697203979, 696679153, 699989548]
1732F99989548K456665l458481l749390O913529M703064J319656K007904p70645j870956
1740.7G07540894L737716K465744K67639J872483L733368K774658J858597J720352
1748.4G25971451O21109L367920L25851Q36716M874649L052444K798691K433167J7547
1757.1G44299545J932373K330780K077103K428970k404403L32260L943176J864929
1764.8G56804733J424637K160034J458283k341614K245941L811493j086273l327637
1772.5G61149597k69012M436264J740799N2643K455062P03888J610337M29763j116485
1781.2G71192856R05380J600189J055908j486587M69208J978149J116028Q70209J475448
1789.9G79176788K99836p49131j786041L86810L523865O07529p07016J232681J695328
$$ y = [699989548, 702446213, 698987732, 695238342, 702151871, 706854935, 708174591, 710182495, 709411850, 707540894, 711278610, 713744354, 714011993, 715884476, 719617844, 722392502, 724251099, 725971451, 726592560, 729960480, 730286331, 731123047, 735997696, 739050140, 741848831, 744281998, 744299545, 746231918, 748562698, 750639801, 753068771, 750664368, 750996628, 754939804, 756804733, 758229370, 760389404, 761847687, 759506073, 761752014, 765563507, 764477234, 761149597, 760880585, 765316849, 767057648, 767110291, 769565353, 770269241, 771879578, 772309341, 771192856, 772098236, 773698425, 774754333, 773267746, 773736954, 775715103, 776831131, 777701340, 779176788, 779476624, 778727493, 776941452, 777328262, 780852127, 781459656, 780752640, 781985321, 783680649]
1798.6G83680649N39703p30133J974640l57132N2719J378784p8964L04260J33744O76117
1808.2G87574387J304321R52911p74154P83233J276016J83640M79813m44718L76740
1816.9G91712189l87039N17730J635132M19312J013183J10626Q97828R8571k996139
1825.6G93021393M72870J741256J372528q53118l022919J757126K945480Q80890K03629
1834.3G98519135K31704k77939p68737l66059J311493M64859O86722N01556J106415
1842.9H01409149L01209n153733K153397J892319p26624l70865J025009J366501J27335
1851.6H02023697O61774Q6975K83279n1498j52283N47256o83441n2719K25220O55365
1861.3H03543625L62778L03344N40314J61285K41929j116028m7989j187134r03778
$$ y = [783680649, 784220352, 783490219, 785464859, 785107727, 785160446, 786539230, 786460266, 786764526, 786898270, 787574387, 788878708, 789831619, 789057465, 789840698, 791116714, 791300354, 791780167, 791335449, 791712189, 791325150, 791842880, 793478012, 793897324, 794910507, 795021133, 795918961, 796017532, 793021393, 793494263, 795235519, 796608047, 795754929, 792732010, 794489136, 797434616, 798315506, 798519135, 798750839, 798472900, 797704163, 797338104, 798649597, 799114456, 799801178, 800302734, 801409149, 801710358, 796556625, 798710022, 800602341, 799875717, 799504852, 800529861, 801896362, 802023697, 802685471, 802772446, 803055725, 803004227, 802851944, 803399200, 802715759, 802663040, 802888260, 803543625, 803906403, 804209747, 804750061, 804911346, 805153275, 804037247, 803989258, 802802124, 801898346]
1869.9H01898346J759720J343307J164551L3569k12631p0953N77469J15051m14276
1878.6H06194153J4725k03553M37775l27988J94245Q3542j52436O74591R5520J170960
1888.3H08181534m91562k234573O49795R71680K7160q5601k37961p8354J284637N22461
1897.9H08509216M38385J59836q50601n23605l08152M37241j82343K41852R02176M85687
1907.6H09309692M12445q3541n20478n44815K57263m88967k0676L65677L36761R04007
1917.2H09927368k004700o86J630935L11661m37927j947861m50210R49554P52945K37885
1926.8H08968964M73632L78113o2332L3875K8762k02560j076584k62451P0877K19421
1936.5H08569717N08500K89077M83094J93100R04007j213379k363434N96008K22931
$$ y = [801898346, 803658066, 805001373, 806165924, 806199493, 805986862, 805915909, 806493378, 806608429, 806194153, 806208878, 806005325, 806443100, 806115112, 806309357, 806392899, 806240463, 806915054, 807010574, 808181534, 807689972, 805455399, 806105194, 807076874, 807104034, 807018433, 806780472, 806702118, 807986755, 808509216, 808947601, 809107437, 808256836, 807733231, 807425079, 807862320, 807679977, 807921829, 808824005, 809309692, 809722137, 809638596, 809118118, 808573303, 808830566, 808341599, 808320923, 808686600, 809023361, 809927368, 807922668, 807921982, 809552917, 809864578, 809426651, 807478790, 807028580, 807978134, 808731079, 808968964, 809442596, 809820709, 809758377, 809792252, 809821014, 809618454, 808541870, 808279419, 808350296, 808569717, 809078217, 809367294, 809850388, 810043488, 810947495, 809734116, 807370682, 807966690, 808189621]
1945.2H08189621k10190L12805J110459K51236n6763L18146j18561k53143o38657m70810
1954.8H08434143l00980K27662O5383N26429Q17413j56555J28403n14145o82526o79703
1964.5H07865524l72162L3188l61252P50657P72934O46514K13852o9885q5831n37567
1974.1H08855972n96618p04346p9346l6087N15442Q53272L04565K3804l37296p9346
1983.7H08720016n89904o22864m01993j94626o0730J98822J123658k77863j094208
1992.4H06800308L12882M91562k52839m10614j0528k60086R2239L40576L87116j49231
2002.1H07341385k94800J6403m04815k64512j69372L43704N2872j79062J4038m12521
2011.7H06043320k00959j40686K93961j54114q10623n13000J68914O06842J58997J81961
$$ y = [808189621, 807979431, 808292236, 809402695, 809653931, 809597168, 809915314, 809796753, 809543610, 808904953, 808434143, 808133163, 808360825, 808426208, 808952637, 809770050, 809613495, 809741898, 809227753, 808545227, 807865524, 807493362, 807526550, 807165298, 807915955, 808688889, 809335403, 809549255, 809479370, 809393539, 808855972, 808259354, 807555008, 807475662, 807439575, 807955017, 808808289, 809112854, 809136658, 808799362, 808720016, 808130112, 807507248, 807105255, 806910629, 806849899, 807048721, 808172379, 807894516, 806800308, 807113190, 807604752, 807351913, 806941299, 806930771, 806670685, 806762924, 807103500, 807490616, 807341385, 807046585, 807062988, 806658173, 806393661, 806224289, 806567993, 806620865, 806441803, 806455841, 806043320, 805842361, 805701675, 805995636, 805841522, 805030899, 804517899, 804686813, 805293655, 805452652, 805634613]
2021.3H05634613j74561K289j12762o72989m48761J907N36042l78724m70199p4387
2031H03842468O8436O3019m19617L3264L5782J76697n4016j95236J525l99780n07889
2041.6H02644653q6746M25110k56805j22529k67486l15933M65927N5084K78397j8082
2051.2H02801590j62048l96195m16183J16806l98789j12762J59530N44892j7243n36804
2060.9H01582794j2512j602J79519o24084o75888j99509K24381N99289J76010K25525
2070.5H01473923q011k27585n82657l99093J8539Q5525p3242l00827L23181K29874
2080.2H00539627R9487n6915n3253l52249p16324J80206l7079J45722L61786j63880
2089.8G99947128k30255o0501R1858l06015j85623m02756k05917K80609K89306K55661
$$ y = [805634613, 805460052, 805462341, 805349579, 804676590, 804227829, 804229736, 804765778, 804387054, 803916855, 803842468, 803910904, 803973923, 803554306, 803587570, 803623352, 803800049, 803746033, 803550797, 803552322, 803152542, 802644653, 802557907, 802983017, 802726212, 802603683, 802336197, 802020264, 802486191, 802541275, 802819672, 802801590, 802639542, 802243347, 801827164, 801943970, 801545181, 801432419, 801591949, 802136841, 802119598, 801582794, 801570282, 801568680, 801748199, 801124115, 800448227, 800248718, 800473099, 801072388, 801248398, 801473923, 801465912, 801238327, 800655670, 800256577, 800275116, 800360641, 800287399, 799986572, 800309753, 800539627, 800639114, 800582199, 800528946, 800176697, 799460373, 799640579, 799603500, 799749222, 800111008, 799947128, 799716873, 799656372, 799748230, 799442215, 799256592, 798853836, 798647919, 798928528, 799217834, 799473495]
2099.5G99473495n0964R7275k59476j98822j87607k89535m25949o00662K65731R6054
2109.1G97919540K21405L16773j13220n0507j9607l6774m08402r1781l90778l93219
2118.7G96953430J78452K64053K77786o7596J21078m23126l84750q927j58157L06778
2128.4G97059021K38037J42670j39923k6398L0365r4605k44064n16434J22910R8190
2138G96669769p019r4757j42059J82571K97165J72730k34604K8305j17798q5983q2169
2148.6G96586151j74103N08805J87759j27563O1264J7929k66419k07901L586m3487
2158.3G96546021j04981L0594O17828L30200q2321l36227J02844N34363l22952k90757
2167.9G97024612j30844R8954R6893J17569K12021k6093L35083l31802k46353K8762
$$ y = [799473495, 799422531, 799519806, 799260330, 799061508, 798873901, 798584366, 798158417, 797557755, 797823486, 797919540, 798140945, 798457718, 798344498, 798293991, 798274384, 798237610, 797829208, 797737427, 797346649, 796953430, 797131882, 797395935, 797673721, 797606125, 797727203, 797304077, 796919327, 796910400, 796752243, 797059021, 797297058, 797439728, 797299805, 797273407, 797303772, 797209167, 796965103, 796448669, 796571579, 796669769, 796662750, 796567993, 796425934, 796608505, 796905670, 797078400, 796843796, 796872101, 796754303, 796668320, 796586151, 796412048, 796920853, 797108612, 796981049, 797042313, 797060242, 796793823, 796585922, 796589508, 796546021, 796441040, 796471634, 797089462, 797419662, 797337341, 797001114, 797103958, 797638321, 797315369, 797024612, 796893768, 796992722, 797089615, 797207184, 797419205, 797393112, 797728195, 797396393, 797150040, 797178802]
2177.6G97178802k29034L4256n8899L42331K11105j2664J40228L30276R919n04380
2187.2G97441940k32086L1586N66101K72369j79367l06549j38397M36859M17175R2316
2196.9G98401947o05469j29928J96991j60294m959K14462L08686j37558J44271r4528
2206.5G98133621l69568M1046L81394M37775k73285j79062q1482L08151K12936q1787
2216.1G98529739R1629o47506m32816n6534N15671O21185J41221M1275j01777J02997
2225.8G98805084k79388M8294J10702R232j95770n58777J64566N722J90124j11770
2235.4G98188019k21405J06964j46866L53394J24282J57166l5172k87551j47553J76849
2245.1G98268127R0943p21970J62659K44751l8376m5319j24435M09393P9499O7062
$$ y = [797178802, 796949768, 796984024, 796925125, 797267456, 797478561, 797465897, 797606125, 797936401, 797946320, 797441940, 797209854, 797241440, 797807541, 798079910, 797900543, 797593994, 797455597, 797892456, 798309631, 798401947, 797796478, 797666550, 797863541, 797703247, 797698288, 797912750, 798221436, 798083878, 798228149, 798133621, 797764053, 797805099, 798186493, 798624268, 798350983, 798171921, 798090439, 798398590, 798611526, 798529739, 798621368, 797973862, 797541046, 797484512, 798000183, 798621368, 798762589, 798803864, 798702087, 798805084, 798525696, 798573990, 798684692, 798693924, 798498154, 797939377, 798103943, 798109665, 798299789, 798188019, 797966614, 798073578, 797926712, 798280106, 798404388, 798561554, 798526382, 798238831, 798091278, 798268127, 798359070, 797637100, 797799759, 798044510, 798006134, 797960815, 797836380, 798245773, 798325272, 798392334]
2254.7G98392334l46222n64728j33743P2403o0272j78986J09482K13318M90646j93863
2264.4G97800369k39486l3188k96173j58539l91617n341o7672L18832L65982R0866
2274G97384033K99835N7831N1728n86548l8147L5934m88052j68610K76947N68848k19193
2284.6G97174606J50833l04794n55496k43912m15191J92108k78855L74832K23618q4610
2294.3G96233139k30713q80356m09012r74807r8038P9880M5395K72293l80707l24402
2303.9G93332672r12628n45960r43450o82679n88760o08292L0594j082687m7684L23944
2313.5G88275070N83649o32706j533127l11889j482697m50210m02604p49893j100387
2322.2G82195206j075974K97775k01339j53427j511231Q9874j63498j220397o67954
$$ y = [798392334, 798046112, 797481384, 797347641, 797420044, 797359772, 797180786, 797290268, 797503586, 797994232, 797800369, 797560883, 797527695, 797231522, 797072983, 796681366, 796676025, 796608353, 796927185, 797293167, 797384033, 797683868, 797741699, 797793427, 797206879, 797168732, 797204666, 796716614, 796548004, 796824951, 797393799, 797174606, 797325439, 797020645, 796465149, 796221237, 795806046, 795998154, 795719299, 796094131, 796317749, 796233139, 796002426, 795122070, 794713058, 793738251, 793640213, 793720093, 793765488, 794037781, 793657074, 793332672, 792420044, 791874084, 790930634, 790247955, 789659195, 789050903, 789081497, 787998810, 787951126, 788275070, 788858719, 788226013, 786692886, 786380997, 784898300, 784448090, 784045486, 783295593, 782195206, 781119232, 781417007, 781215668, 781062241, 779551010, 779640884, 779477386, 778256989, 777589035]
2330.9G77589035j329575J347275Q9874K51465J35956r55734k32239j499939n63660
2339.6G74832458m23355J085968J50834j253968N13077Q69064J196823J979752L177033
2348.3G82127686O13479j735458j353684j462555k125091k429810j481857j513519
2356G70639191j116639j115722j363373J30463P06558J250229n30167l73916L31420
2364.7G68558044J65101P08923J032867J686631K018051J964569Q82873J329422J135941
2373.3G79482422O08902Q67157P45926J002960P96127R16825R32922J509018J789246
2382G88651505R40017M58679J28098J22223j31836p4844J29089o3019n2109M68521
2391.7G90576324O39191l57056l65524l82919p23190m83323r8648M37470J61972P7972
$$ y = [777589035, 776259460, 777606735, 777696609, 777948074, 778084030, 777128296, 776896057, 775396118, 774832458, 774409103, 775495071, 775645905, 774391937, 774905014, 775774078, 776970901, 778950653, 782127686, 782741165, 781005707, 779652023, 778189468, 776064377, 773634567, 772152710, 770639191, 769522552, 768406830, 767043457, 767173920, 767880478, 769130707, 768600540, 768226624, 768558044, 768723145, 769432068, 770464935, 772151566, 774169617, 776134186, 777017059, 778346481, 779482422, 780091324, 780958481, 781704407, 782707367, 783503494, 784420319, 785353241, 786862259, 788651505, 789591522, 790050201, 790178299, 790300522, 790168686, 790093842, 790222931, 790159912, 790107803, 790576324, 791215515, 790858459, 790492935, 790110016, 789386826, 788903503, 788804855, 789242325, 789404297, 789482269]
2401.3G89482269q5907o1950Q9798l63694n54962l79257Q9722j92337k24762k68097
2410.9G87530823k64282L85437N00564K91214n83038n31845l40500o97098m33350n1574
2420.6G85806351L34243J07499K37045j99814o08444n2109n4092k37961n90210k53601
2430.2G84488907k9831N8517K60468k80991k49710J4115k64054n78689j17340O4849
2439.9G83366241l66439l12958L6392l0289k76870l5935m37012l22570j0758l54614
2449.5G81255188j61896k56653k32772j90430j11847l5172J10016J34888l13950l07235
2459.2G79890137n66559m33426j95847o9274k6856j66397P3624k12937o4239k06909
2468.8G78021317l43934m16870o31180P2022K4185j73416l91693j94779j27105k79465
$$ y = [789482269, 789396362, 789334412, 789424210, 789060516, 788505554, 788126297, 788216019, 788023682, 787798920, 787530823, 787266541, 787651978, 788152542, 788443756, 787860718, 787328873, 786988373, 786291275, 785857925, 785806351, 786140594, 786248093, 786485138, 786285324, 785676880, 785624771, 785570679, 785332718, 784742508, 784488907, 784459076, 784517593, 784778061, 784497070, 784247360, 784261475, 783997421, 783418732, 783301392, 783366241, 782999802, 782686844, 782723236, 782692947, 782416077, 782380142, 781943130, 781620560, 781609802, 781255188, 781093292, 780836639, 780603867, 780413437, 780301590, 780266418, 780376434, 780511322, 780197372, 779890137, 779323578, 778890152, 778694305, 778625031, 778598175, 778431778, 778505402, 778292465, 778228226, 778021317, 777677383, 777260513, 776629333, 776701355, 776725540, 776552124, 776160431, 775965652, 775838547, 775559082]
2478.5G75559082K06604j95160k05307m27551n99442k58636j81503k75727o04706J66932
2488.1G73184586Q3236n36041m88434l27530K4796m09241p31354j70669L21655l00751
2497.7G70650253j67999J91650j84402k87323o27441j39771m51813p22961k03934l17077
2507.4G67739182j74103k24228R1553j73951k47345Q0567l94592o70777o65130o8131
2517G65293045m2114J00708K03781n8060k27051r67559n59159j35193k85644l36380
2526.7G62986374k89993o2638J40839K44903k18124K4719j83944p62482p05948o53686
2536.3G60520020k66419o6605L60566M2266m11605j65558p2174J1673n02091p04880
2546G58745193n95550k69165J74255P6447j27335j50223l3569j66092l60946q84018
$$ y = [775559082, 775765686, 775570526, 775365219, 774937668, 774338226, 774079590, 773898087, 773622360, 773017654, 773184586, 773267822, 772731781, 772243347, 771915817, 771940613, 771531372, 770800018, 770629349, 770951004, 770650253, 770482254, 770673904, 770489502, 770202179, 769574738, 769434967, 768983154, 768260193, 768056259, 767739182, 767565079, 767340851, 767432404, 767258453, 767011108, 767091675, 766697083, 766026306, 765361176, 765293045, 765250931, 765351639, 765555420, 765497360, 765270309, 764302750, 763743591, 763608398, 763322754, 762986374, 762696381, 762633743, 762774582, 763019485, 762801361, 762826080, 762642136, 761879654, 761173706, 760520020, 760253601, 760186996, 760547562, 760589828, 760178223, 760012665, 759940491, 759952164, 759450073, 758745193, 758149643, 757880478, 758054733, 758131180, 758003845, 757853622, 757820053, 757653961, 757293015, 756408997]
2555.6G56408997p63245k75574j79519K4948k07367q1024P1716K42004J54114l87573
2565.2G55007477m83628m75616j62430m23507o21186k77023p401K11258J39313M3335
2574.9G52950592n73807r23996o44760l662M5548m15116j95465j70517K29798K4566
2584.5G50323181l70712p3624m37393m06723m73175m88663j09939j47248K0371k6169
2594.2G47809906k91443l6850k53143p59964l01590j82724m61655n98221o26678j221
2603.8G44296417M63257K71988k62756k94876j03379k36587n54886p94678q28934o93512
2613.5G41262054J53046M11682J27487j14898l72544n33218r00803o41479n12314N2719
2623.1G38931732L43933l79944l48587l6544J42288n11246p59430n65719n34287j83411
$$ y = [756408997, 755645752, 755370178, 755190659, 755215607, 755008240, 754927216, 754998932, 755240936, 755395050, 755007477, 754523849, 754048233, 753885803, 753462296, 752841110, 752564087, 752556686, 752767944, 752907257, 752950592, 752376785, 751452789, 750808029, 750804367, 750849915, 750434799, 750239334, 750068817, 750298615, 750323181, 749952469, 749878845, 749441452, 749034729, 748561554, 748072891, 747962952, 747815704, 747836075, 747809906, 747518463, 747481613, 747228470, 746468506, 746166916, 745984192, 745522537, 744924316, 744297638, 744296417, 744759674, 745031662, 744768906, 744474030, 744370651, 744134064, 743579178, 742784500, 741955566, 741262054, 741415100, 741826782, 741954269, 741839371, 741466827, 740933609, 740032806, 739391327, 738879013, 738931732, 739275665, 738895721, 738547134, 738510590, 738652878, 738141632, 737382202, 736816483, 736282196, 736098785]
2632.8G36098785m11148l13110k65503K26517M50592l44620o33316q17947m78363m05426
2642.4G33106461n32914l61557k15530p6218j8768K06070l24326o94580n18341j91574
2652G30378723k26745n53742k75040l45611k04621o2484l89405n16510J46943L40423
2661.7G28291931n29175m24728o45294p51343l15018p7209M71420L50418k09732q85849
2671.3G25275421n17578k35825p38143l11966K59323L30124l00141m34799k00958l43018
2681G22782440m46701l94287k06680k83127M9057j85089n27878j01852j52817l88413
2690.6G20144653j41906K46582k47956n42907m85764m16794j77536m66232l02048j1444
2700.3G17598648q8653j56708q2245j21536k85721n10254q15659m33578j77460r5215
$$ y = [736098785, 735687637, 735374527, 735109024, 735335541, 735786133, 735441513, 734808197, 733990250, 733511887, 733106461, 732573547, 732211990, 731996460, 731920242, 731901474, 732107544, 731783218, 731088638, 730570297, 730378723, 730151978, 729598236, 729323196, 728977585, 728772964, 728710480, 728321075, 727804565, 727951508, 728291931, 727762756, 727338028, 726692734, 725941391, 725626373, 725549164, 726020584, 726371002, 726161270, 725275421, 724757843, 724522018, 723783875, 723471909, 723731232, 724061356, 723761215, 723326416, 723125458, 722782440, 722335739, 721941452, 721734772, 721451645, 721500702, 721315613, 720787735, 720685883, 720533066, 720144653, 720002747, 720249329, 720001373, 719458466, 718972702, 718555908, 718378372, 717912140, 717610092, 717598648, 717509995, 717353287, 717271042, 717149506, 716863785, 716353531, 715537872, 715104294, 714926834, 714831619]
2709.9G14831619j8234K00653K03629k45667j48239l34167k66953m57764m44412p2021
2719.5G13248444l00980N51453J60217j026764l92685L33328j70898o55975n23987
2728.2G11222153o87332j40992J50528O1493j24435l77655J40304Q393L8833l8376
2737.9G10252914l88794m62951k79694k0218n57098k09045J97753K79160L69415j24664
2747.5G09056778m56924l84217j31302o71539m58679k20032m74777J12533K68631N0431
2757.2G06690903k78702J70898O0044n30320j81274l04031m30298n26352k16446N5466
2766.8G04509888J19857J85242l26462o27899p44629k16446r0789l12043k4414p9956
2776.4G02392349j59454j53351j22452k44903l35999p99026n64957r537m74930r3002
$$ y = [714831619, 714813385, 715014038, 715217667, 714972000, 714823761, 714489594, 714222641, 713764877, 713320465, 713248444, 712947464, 713498917, 713659134, 712632370, 712239685, 712573013, 712402115, 711746140, 711222153, 710534821, 710393829, 710544357, 710605850, 710481415, 710103760, 710244064, 710252457, 710291290, 710252914, 709864120, 709401169, 709121475, 709101257, 708544159, 708335114, 708532867, 708812027, 709181442, 709056778, 708599854, 708215637, 708084335, 707412796, 706954117, 706734085, 706259308, 706371841, 706640472, 706690903, 706412201, 706583099, 706643143, 706112823, 705931549, 705627518, 705197220, 704670868, 704454422, 704509888, 704629745, 704814987, 704488525, 703860626, 703115997, 702899551, 702808762, 702496719, 702472305, 702392349, 702232895, 702079544, 701957092, 701712189, 701376190, 700577164, 700012207, 700002670, 699527740, 699434738]
2786.1F99434738J66931r9182k23007k37274l22724m86450k46734o90537o71692m26636
2795.7F96197433l63998p9880m02450n45197n25818j35269k13547m35028m88815j032715
2805.4F91974716o27212l56751l43094O4698K70919k95562r58023l09830n26200j194000
2815F87699661o74591o72378q00629l04642j78604n2032N0048o48498r23233q01468
2824.7F82693634p94754o54831p49435o06842l93219l74451n75638p24716j68686j75171
2834.3F77475891r91897j137619r38340j188202j433868r13086n76324j115265j204987
2843F67976303j161423j374740j838684k138520j863479j740189j103287j222534j359634
2851.7F54173813m35944m95758n91812m25110j40075j34049j13983J76468p1640Q3847
$$ y = [699434738, 699601669, 699502487, 699279480, 699042206, 698719482, 698233032, 697986298, 697295761, 696624069, 696197433, 695833435, 695753555, 695351105, 694805908, 694280090, 694144821, 693931274, 693496246, 693007431, 691974716, 691347504, 690990753, 690647659, 690712357, 690983276, 690687714, 689729691, 689419861, 688893661, 687699661, 687025070, 686352692, 685552063, 685247421, 685068817, 685016785, 685066833, 684418335, 683495102, 682693634, 681898880, 681244049, 680494614, 679887772, 679494553, 679120102, 678544464, 677819748, 677651062, 677475891, 676483994, 675346375, 674408035, 673219833, 671785965, 670872879, 670296555, 669181290, 667976303, 666814880, 665440140, 663601456, 661462936, 659599457, 657859268, 656755981, 655533447, 654173813, 653737869, 653242111, 652650299, 652225189, 652085114, 651951065, 651837082, 652013550, 651941910, 652025757]
2861.3F52025757j55564k24685j52512k85949k76871q29544p68128q31833o71768l04718
2870.9F47524185j27868K23083l29666n78919q11996n92957M6540l11508o52924q31146
2880.6F43556824o76651j93939k42386o69937j20545m2572p05566n13153q36182j242104
2890.2F38313789j402435r12552l26958m33845l26424o12335n75867q03375r88159
2898.9F31931839n39589o94618q74558n85823l22265o83747l29399q4610m21028n80597
2908.6F26815605q64372o79321j211586j277352j285515j326637n73959j050530j180877
2917.2F17365456r48334o42853j000595j661568p51686o22864o98089k92435K4338
2925.9F10771370J85623M69818Q32405J21155l69911l63541M9057L19901N29747J122665
$$ y = [652025757, 651870193, 651645508, 651492996, 651207047, 650930176, 650100632, 649332504, 648500671, 647828903, 647524185, 647396317, 647619400, 647289734, 646710815, 645898819, 645305862, 645352402, 645040894, 644387970, 643556824, 642880173, 642686234, 642443848, 641773911, 641653366, 641610794, 640905228, 640392075, 639555893, 638313789, 636911354, 635998802, 635671844, 635237999, 634911575, 634299240, 633723373, 632919998, 631931839, 631392250, 630697632, 629823074, 629237251, 628914986, 628231239, 627901840, 627817230, 627396202, 626815605, 625951233, 625271912, 624060326, 622782974, 621497459, 620170822, 619596863, 618546333, 617365456, 616417122, 615774269, 614773674, 613112106, 612360420, 611737556, 611039467, 610747032, 610771370, 610956993, 611426811, 612259216, 612380371, 612010460, 611646919, 611695976, 612015877, 612545624, 613668289]
2935.6F13668289Q37059K93160K27318J004447J146927J53847K83585O61888N6762
2944.2F18333282J13030O85272N90058Q10775N55687j32103M3946L09677K16560j24588
2953.9F21401596j59378O5537L92608L24898L56789N21202M8599J16920K44980L46031
2963.5F23659782K91710N21164Q31719J76696N04265P05071N79490N83191M04816R51500
2973.2F29209404M80804k10838J38359N30358N50308K82707K25525P79877J036834
2981.8F33023338J47705j2664P9422l68386l891K29187l67813p7743P53746J43013
2991.5F33545914R4070L08838k98843k5330j54457k96822j62582p68509p03430J16730
3001.1F31655579J58233J35460K50092p82357q08715k67716r15756q40836k38609k65503
$$ y = [613668289, 614505348, 614798508, 615025826, 616030273, 617177200, 617331047, 617614632, 618276520, 618333282, 618446312, 619131584, 619721642, 620532417, 621088104, 620956001, 620999947, 621309624, 621526184, 621401596, 621242218, 621307755, 621700363, 622025261, 622382050, 622903252, 622951851, 623068771, 623313751, 623659782, 623951492, 624472656, 625304375, 625481071, 625985336, 626690407, 627269897, 627853088, 628257904, 629209404, 629690208, 629479370, 629617729, 630148087, 630698395, 630981102, 631206627, 631986504, 633023338, 633171043, 633158379, 633237801, 632869415, 632865524, 633094711, 632726898, 632649155, 633402901, 633545914, 633639984, 633948822, 633649979, 633624649, 633470192, 633173370, 633010788, 632242279, 631538849, 631655579, 631813812, 631949272, 632199364, 631417007, 630608292, 630340576, 629424820, 628583984, 628345375, 628079872]
3010.8F28079872l72543q7853O447J5412j60485n75180o58760q38623q39653p04536
3020.4F23864098j66741J51787k29912k41775o40488q33206m37813n91698q51974n25437
3030.1F19496841k46048o33010k67601P1907o66695p15027l89442p06444r57070n66253
3039.7F14421158j33095n18417p01752j56174k57187q02078o06155k69051o68106j037254
3049.4F09271889r93233o25877j49384n23148q18023m31900j1482k54899q06045o74439
3059F03983459q88023m82254R9564l41416m91981j154137j055298k5711k44560o75812
3068.6E98723831o73637q59719m87480L3722p18078p98874j03112j17416j62353m75998
3078.3E94360886m15421j21460m35448o03256p04841j161461o04210N0430p59735n70068
$$ y = [628079872, 627707329, 627619476, 627625923, 627641335, 627480850, 626905670, 626246910, 625408287, 624568634, 623864098, 623697357, 623849144, 623619232, 623377457, 622736969, 621903763, 621465950, 620874252, 620022278, 619496841, 619250793, 618617783, 618350182, 618422089, 617755394, 617040367, 616650925, 615944481, 614987411, 614421158, 614288063, 613769646, 613067894, 612911720, 612654533, 611852455, 611246300, 610977249, 610309143, 609271889, 608278656, 607652779, 607503395, 606980247, 606162224, 605730324, 605718842, 605463943, 604657898, 603983459, 603095436, 602613182, 602712746, 602371330, 601879349, 600725212, 599669914, 599644203, 599399643, 598723831, 598050194, 597190475, 596702995, 596736717, 596018639, 595219765, 595116653, 594999237, 594836884, 594360886, 593945465, 593824005, 593388557, 592785301, 592080460, 590918999, 590314789, 590365219, 589605484, 589035416]
3087.9E89035416k30255o25191p76901p09343l45688q87184m90799j67313o46896L3378
3097.6E84189224k69508n70679p11288p52716n8823m69246n52368m06914o35299m36440
3107.2E79325943o42281q64372p08275l18107J6975l27415n25093m51355n59311n07164
3116.9E74439545o30722n08461l54882p27844r54666o41518k29721n14068o12107o38694
3126.5E68626862q09708o18286k81906k52762r77554p03583k98500o37360o25076p88460
3136.1E62633667n30777o30112o97174n16243n31349j45988n53246q99811n60989k08778
3145.8E57359200n35698j005669n49622m73518o48956n40314n93224q98094n81169
3154.5E51532936j27602o05964q52165p64580p54128q37555m27169k79465p63855n28221
$$ y = [589035416, 588805161, 588179970, 587403069, 586693726, 586348038, 585460854, 584970055, 584802742, 584155846, 584189224, 583919716, 583349037, 582637749, 581885033, 581826210, 581356964, 580804596, 580397682, 579762383, 579325943, 578683662, 577819290, 577111015, 576792908, 576809883, 576482468, 575957375, 575506020, 574946709, 574439545, 573808823, 573300362, 572945480, 572217636, 571262970, 570621452, 570391731, 569877663, 569265556, 568626862, 567817154, 567198868, 566916962, 566664200, 565686646, 564983063, 564684563, 564047203, 563422127, 562633667, 562102890, 561472778, 560775604, 560259361, 559728012, 559582024, 559028778, 558128967, 557567978, 557359200, 556823502, 555817833, 555268211, 554794693, 554145737, 553605423, 553012199, 552114105, 551532936, 551405334, 550799370, 549947205, 549182625, 548428497, 547590942, 547163773, 546884308, 546120453, 545592232]
3164.1E45592232o32630j090240q84895k10381j71242l78303l55072o62232l64113
3172.8E40843124q00895j258431n09834k03209n03693r59892n35011l55492p47032
3181.5E34969635p77740n89600k94380n87998o55517l60909l03459o59218j025772
3190.1E29715042o76613n07850p86972o62270m05121m55284k3575o20766j428146p18765
3199.8E23429680p14226m05426n2490m14086r88998j290626j82000j06315o80275m80194
3209.4E18115044m06189l50037m72832j055717j472130l47061K18773l17307o05316
3218.1E13307228q14171n37376n90820n13535n21507r28536o27861k42157j45759n40963
3227.8E07844543o31141l71895m26216l56445o82183q86879n28679n32455n93300l94173
$$ y = [545592232, 544959602, 543869362, 542984467, 542774086, 542602844, 542224541, 541869469, 541207237, 540843124, 540042229, 538783798, 538273964, 538070755, 537567062, 536607170, 536072159, 535716667, 534969635, 534191895, 533602295, 533307915, 532719917, 532064400, 531703491, 531400032, 530740814, 529715042, 529038429, 528530579, 527743607, 527081337, 526676216, 526220932, 526197357, 525576591, 524148445, 523429680, 522715454, 522310028, 522257538, 521843452, 520854454, 519563828, 519381828, 519275513, 518595238, 518115044, 517708855, 517358818, 516885986, 515830269, 514358139, 514011078, 514229851, 513912544, 513307228, 512493057, 511955681, 511364861, 510851326, 510329819, 509401283, 508773422, 508531265, 508385506, 507844543, 507213402, 506841507, 506415291, 506058846, 505376663, 504489784, 503961105, 503428650, 502835350, 502441177]
3237.4E02441177m68826m65126l29437p81174r36623n4817K06986p09763r87358l30200
3247D97584839o9084n31464n79986l25280o70128p28416l41225q2779l50341q06847
3256.7D93099289q34045m24347j13717k79617k31132n41954n83458l7003j42174J17760
3266.3D90029602j99623j007843n41153k34337o77986k83089P5608p11670m84352p7591
3276D85887566n11246n23033n86777p31430q53653l88184K83165q7318o97784m61655
3285.6D81329651J44691j2169m92172k94418Q4801l67508o20804l51944n22461l81966
3295.3D78515701k06604m29115p65686o58608q7432K9907q4000k37388o00090p54128
3304.9D74722557l54919k70844m61159m95147n47257l68843n21927o87980o55365N5351
$$ y = [502441177, 501972351, 501507225, 501177788, 500396614, 499459991, 499405174, 499612160, 498902397, 497915039, 497584839, 497515755, 496984291, 496404305, 496079025, 495408897, 494680481, 494339256, 494256477, 493906136, 493099289, 492265244, 491840897, 491727180, 491447563, 491216431, 490674477, 490091019, 490054016, 489911842, 490029602, 489829979, 488822136, 488280983, 488046646, 487368660, 487085571, 487161179, 486449509, 485965157, 485887566, 485376320, 484853287, 484266510, 483535080, 482681427, 482293243, 482576408, 482489090, 481791306, 481329651, 481474342, 481462173, 480970001, 480675583, 480760384, 480392876, 479772072, 479420128, 478897667, 478515701, 478309097, 477879982, 477114296, 476455688, 476368256, 476398163, 476314163, 476076775, 475476685, 474722557, 474367638, 474096794, 473635635, 473140488, 472593231, 472224388, 471702461, 471014481, 470359116, 470414467]
3314.6D70414467K07214r74083q33740m62532n25665m72184n00640k17514l42713l10173
3324.2D65982437m70276q05511j058693j243172o44722r4490k57301o94466m89120
3332.9D60224686n50347m63371j13373p22923j044884q77380n25131q97751j014824
3341.6D54014702m70200m75311k43568m98963k08931o8855n62782n17731p68509n19295
3351.2D49680557r46007q49456M39033j01471j121368r22089l56254j82801l36036
3359.9D45304108p06444m27132L1357j84212n07660r82208o22558j87684k41851k53449
3369.5D41222267l43361l31421o69250n99060m62914o18171k40555M2228k1400j11656
3379.2D37866707m46854n92499k66418l62587l31039o66848m86602L16276p16896l44353
$$ y = [470414467, 470621681, 469647598, 468813858, 468351326, 467825661, 467353477, 466852837, 466635323, 466292610, 465982437, 465512161, 464706650, 463647957, 462404785, 461760063, 461665573, 461408272, 460713806, 460224686, 459674339, 459210968, 459097595, 458374672, 457329788, 456452408, 455927277, 455029526, 454014702, 453544502, 453069191, 452825623, 452326660, 452117729, 452048874, 451486092, 450968361, 450199852, 449680557, 448734550, 447885094, 448324127, 448222656, 447101288, 446179199, 445822945, 445640144, 445304108, 444597664, 444170532, 444201889, 444017677, 443510017, 442527809, 441905251, 441717567, 441475716, 441222267, 440878906, 440547485, 439878235, 439279175, 438816261, 438198090, 437957535, 437999763, 437978363, 437866707, 437419853, 436827354, 436560936, 436198349, 435867310, 435200462, 434713860, 435030136, 434313240, 433968887]
3388.8D33968887P14264J67542l46375j311950o91147P20787L54690m89769q89320
3397.5D32197609n94139K80304P14569k01531p01637k16102N1269L2234k01759k15187
3407.1D31145630k88544o05888k89879N14908N62668k41852q07495l86658L21541J22986
3416.8D30047417n60532l74222P10335P43637q7471j49345J43089L67889k70919m87404
3426.4D30082474M50439N25017J68419L63235K69928l2272m13589n09072L45383N08728
3436.1D31758690J77956M02946M70848M54254N19982J4686r66797K632R54934J064300
3445.7D34854431Q25119r78584k38648N82848N73616J186218N83191M29116K69393
3454.4D38086700J69983K10686K85149P46307P04002N82314R2697N54962M12331j15700
$$ y = [433968887, 434683151, 434850693, 434504318, 433192368, 432501221, 433222008, 433576698, 433086929, 432197609, 431603470, 431883774, 432598343, 432396812, 431695175, 431479073, 431530342, 431562576, 431360817, 431145630, 430857086, 430251198, 429961319, 430476227, 431038895, 430797043, 429989548, 429602890, 429924431, 430047417, 429486885, 429112663, 429822998, 430566635, 430479164, 430329819, 430472908, 430840797, 430569878, 430082474, 430532913, 431057930, 431226349, 431589584, 431859512, 431827240, 431413651, 430904579, 431249962, 431758690, 431936646, 432339592, 432810440, 433264694, 433784676, 433799362, 432832565, 432835197, 433790131, 434854431, 435679550, 434700966, 434462318, 435045166, 435618782, 436805000, 437388191, 437817307, 438086700, 438256683, 438467369, 438752518, 439498825, 440202827, 440785141, 440877838, 441432800, 441845131, 441729431]
3464D41729431O44150P54929O48040K10953P21397R02977K60506Q27980R03435R71985
3473.7D48575783P21054J68800K93198q5983K20260J198883Q55332M94728N58891J84517
3483.3D53185463R79080J004639K94380K84424K47536Q38661R79919Q13675M28085
3492D59055862P48024J254082O10466N56221K13547M00886J016350M95873J67541N75447
3501.6D65094299P95327P09610J176223J199265Q42819O16722J036644J54534m43612
3510.3D71181831J647492J357155Q92944O32401L97720J397400J033325P67250L97568
3519D79705086O24084J122284J034012M14925o17638J189232J642418Q50792Q27789
3527.7D86792984L96500K96936J174736J785431J118202J170807P58362P43331O18935
$$ y = [441729431, 442373581, 443128510, 443776550, 443987503, 444708900, 445611877, 445872383, 446700363, 447603798, 448575783, 449296837, 449465637, 449758835, 449672852, 449893112, 451091995, 451947327, 452442055, 453000946, 453185463, 454164543, 455169182, 455463562, 455747986, 455995522, 456834183, 457814102, 458627777, 459055862, 459803886, 461057968, 461668434, 462224655, 462438202, 462839088, 463855438, 464351311, 464518852, 465094299, 465889626, 466599236, 467775459, 468974724, 469817543, 470434265, 471470909, 471625443, 471181831, 472829323, 474186478, 475079422, 475711823, 476109543, 477506943, 478540268, 479307518, 479705086, 480329170, 481451454, 482485466, 482900391, 482282753, 483471985, 485114403, 485965195, 486792984, 487189484, 487486420, 488661156, 490446587, 491564789, 492735596, 493493958, 494237289, 494856224]
3536.4D94856224N6038J410217J518326J126976R45702J132011J215706J392670P20596
3545E04374466q7624J077805j13144J889687K537040J495476J427689j259385J050606
3553.7E12392616J380806J366577K046662N12924K036743J535645M38766O36253K209130
3562.4E24556122J177139J64604L396111j014977Q1024J797066j35116L752975J540527
3571.1E35315475N47181J547966K020378J727409J416092J258774j73721K021331J733551
3579.7E47414436J162606K055931J617126J562081J331024L432617O36101j869507
3587.5E57342415J785927M75731L291587L212014K040863K55279Q88252K921372j100349
3596.1E71113091K180442L200188O47926K366257J091995J572075K344094J343765
$$ y = [494856224, 494912262, 496322479, 497840805, 498967781, 499913483, 501045494, 502261200, 503653870, 504374466, 504286842, 505364647, 505251503, 507141190, 509678230, 511173706, 512601395, 511342010, 512392616, 513773422, 515139999, 517186661, 517699585, 519736328, 521271973, 521710739, 522346992, 524556122, 525733261, 525897865, 529293976, 528278999, 528360023, 530157089, 530021973, 533774948, 535315475, 535862656, 537410622, 539431000, 541158409, 542574501, 543833275, 543659554, 545680885, 547414436, 548577042, 550632973, 552250099, 553812180, 555143204, 558575821, 559211922, 557342415, 559128342, 559604073, 562895660, 566107674, 568148537, 568403816, 569292068, 572213440, 571113091, 573293533, 576493721, 577141647, 579507904, 580599899, 582171974, 584516068, 585859833]
3603.9E85859833J946220L087082K032890p71484L235283l01437M92134P082977M52461
3612.5F03115959j604309L561592j6708M000816L495979L36495J483307p28798J599617
3621.2F15243950K936821K786713K912483K858429J734199J939202N286483k744331
3628.9F32953949q389893O272316O265564M749184O58646K68554L576813L373184K036286
3637.6F51764603J26800J476135L155976K660599P89794J154023L039550L361435M598084
3646.3F72126999j312103l225174M369964m80270j709519K181702N855560M112778
3654F81919937L864823M110031o567994K754212N466080J689758J126938Q9569K174988
3662.7F96628342J126251J263122J906357J221085M970398K598724j905441k371292
$$ y = [585859833, 587806053, 590893135, 592926025, 592154541, 595389824, 595088387, 595580521, 602663498, 603115959, 601511650, 605073242, 605056534, 609057350, 612553329, 612889824, 614373131, 613644333, 615243950, 618180771, 620967484, 623879967, 626738396, 628472595, 630411797, 635698280, 632953949, 624564056, 630836372, 637101936, 641851120, 642509766, 642778320, 646355133, 649728317, 651764603, 651891403, 653367538, 656523514, 659184113, 659973907, 661127930, 664167480, 667528915, 672126999, 670814896, 667589722, 671959686, 671479416, 669769897, 671951599, 677807159, 681919937, 685784760, 689894791, 683326797, 686081009, 691547089, 693236847, 694363785, 694453354, 696628342, 697754593, 699017715, 700924072, 702145157, 707115555, 709714279, 707808838, 705437546]
3670.4G05437546n554428M770736P751236O258545n475616j5075760O660156P968445
3678.1G12740860M228210j285934J274033K923202J580582O83822j08490M91791L099976
3686.8G25628052M313431r225464k072449P228622m464187J232757M541931Q65326
3694.5G28048019J569596K66189L17536J096801K11487K327195K028045n453949j090011
3703.2G29320908M815826J389160l69186j15433K748337L982467n941543L354339J617280
3711.9G40802155j2604905O473542M997787P782P72171J575623L27377l109207Q93631
3720.5G40135956M339752l780060k748031M413452L14712j173630l083038J562424
3728.3G39981537L928299n493L738022k708359m252548Q608016q54568r929123N92880
$$ y = [705437546, 699883118, 704653854, 712405090, 718663635, 713188019, 698112259, 704772415, 712740860, 716969070, 715683136, 716957169, 719880371, 721460953, 722144775, 722036285, 722528076, 725628052, 729941483, 720716019, 718643570, 725872192, 721408005, 722640762, 727182693, 728048019, 729617615, 729883804, 730201340, 731298141, 731509628, 733836823, 735864868, 730410919, 729320908, 734136734, 735525894, 735156708, 735041275, 737789612, 741772079, 735830536, 739184875, 740802155, 728197250, 734670792, 739668579, 739676361, 740448532, 742024155, 742351532, 739242325, 740135956, 744475708, 740695648, 737947617, 742361069, 742675781, 741502151, 738419113, 739981537, 743909836, 743904343, 747642365, 744934006, 740681458, 749289474, 748434906, 738505783, 739098663]
3736.9G39098663K746659J975402L206254K003326l823624K808609Q860703j2146607
3744.7G44729385j1685257J0349656O238632M923172m715882q619613Q306579o698990
3752.4G42827682k946014P211151M154740J489791m574356K889557M213410q276139
3760.1G46989822o39877M418030J312103N02014K216416l497696l179550M086608M070206
3768.8G56278076k313843q253479L139191L739395R52225J175995p7667O53076N7525
3777.4G55350494J565705n89600n755005K677841J644745Q7662Q12836k918396M10461
3786.1G53286743J928635O82907M47845q90197m77753J91498Q75168J0681P48901J411667
3795.8G58216095n091019j885376L534699L900680M481888q495483q177719N239868
$$ y = [739098663, 741845322, 743820724, 747026978, 749030304, 745206680, 748015289, 756875992, 744729385, 733044128, 743393784, 749632416, 754555588, 749839706, 741220093, 749526672, 742827682, 739881668, 747092819, 751247559, 752737350, 748162994, 751052551, 755265961, 746989822, 746349945, 750767975, 752080078, 752582092, 754798508, 751300812, 748121262, 752207870, 756278076, 753964233, 745710754, 748849945, 752589340, 753541565, 754717560, 754639893, 755292969, 755350494, 756916199, 756326599, 750571594, 753249435, 754894180, 754981842, 755794678, 752876282, 753286743, 755215378, 755898285, 756346130, 755455933, 754978180, 755169678, 756044846, 756055527, 756804428, 758216095, 753125076, 751239700, 754774399, 758675079, 763156967, 754661484, 746483765, 751723633]
3803.5G51723633L193130L954392L014831j0716095j349716O164093J687851r2163
3811.2G57579956M34036K88010J837158M205322l223190j1663895M545289N027313
3818.9G59029999L800964p30972j7155838M029922O212616K289658K163391j492081
3826.6G58147659l797073J873703K185745K199097n82428p647095M047470N774307
3834.3G62201385o298675N76858O020966j0424728k133179P592392m592743J345673
3842.1G54287949O164856l858033k944564L483734J370010K53067J200180j592789
3849.8G58364410J736069M579239o520538k580414j2178192N903930Q746949k160721
3857.5G55890732k82593L032684K285614J223374n531616M58450L781052o477967j787948
$$ y = [751723633, 754916763, 758871155, 761885986, 751169891, 749820175, 755984268, 757672119, 757579956, 758013992, 758302002, 760139160, 764344482, 761121292, 749457397, 754002686, 759029999, 762830963, 762099991, 744944153, 748974075, 755186691, 757476349, 759639740, 758147659, 754350586, 756224289, 758410034, 760609131, 760026703, 752379608, 756427078, 762201385, 755902710, 756479568, 762500534, 752075806, 749942627, 757535019, 752942276, 754287949, 760452805, 756594772, 753650208, 757133942, 758503952, 758757019, 759957199, 758364410, 760100479, 764679718, 758159180, 755578766, 743400574, 749304504, 758051453, 755890732, 755608139, 758640823, 760926437, 762149811, 756618195, 757076645, 760857697, 754379730, 752591782]
3866.2G52591782M920654M721756K443924j0195694m773712M925842N814819J800309
3873.9G62249680q436585J731186L085251m34342J450654L427124m842759n045242
3881.6G53184967N857544O03943P59201K264709j1609039K991943M108506Q00171L388137
3890.3G62350082j467743p078018J021347K151871k87018J920471J80054Q93555N5771
3898.9G59740372o812134O043091J480942m798050L564834k198486j310196k12097
3906.7G55498276J217956K298050j55334j81656n20325Q4763K08816l72390N87997
3915.3G58666153P84759l204345j735077L967056k66418k200623K149964O76116l0212
3924G58807373k358932j744538K231598J308823L32489j584244j08871J883926k580567
$$ y = [752591782, 757512436, 762234192, 764678116, 754482422, 749708710, 754634552, 760449371, 762249680, 753813095, 755544281, 758629532, 758195190, 759645844, 763072968, 758230209, 753184967, 759042511, 759646454, 760405655, 762670364, 751061325, 754053268, 758161774, 758961945, 762350082, 760882339, 753804321, 754825668, 756977539, 756690521, 758610992, 758791046, 759684601, 759740372, 752928238, 758971329, 760452271, 755654221, 759219055, 757020569, 755710373, 755498276, 756716232, 759014282, 758858948, 758677292, 758156967, 758241730, 758450546, 758078156, 758666153, 759450912, 756246567, 754511490, 758478546, 758212128, 756011505, 758161469, 758837585, 758807373, 756448441, 754703903, 756935501, 758244324, 758576813, 756992569, 756883698, 758767624, 756187057]
3932.7G56187057l34548J721496J0758N92269J33057J98898j2741o64444J227112L45154
3942.3G59404068l505783m59290J568985J614228P12738k847519o2638k93273j294098
3951G54837418K868957M00391r86862l2273l49350K46353M51279J313782q87146q93326
3960.7G56969223P52640q23136k03704K23465k71454m5853J34125J53961K54822O03637
3970.3G57747726L10288n95551l13949J50757m96903q5831k7313K78015K33155p8736
3980G57121658Q33359m17328q10852j38550J08414M46854k69852j86539j86386K2888
3989.6G56523666J34201K36206L47291k32163j28708n12695Q3313O10046M8981N9891
3999.2G57170029J23138
$$ y = [756187057, 755852509, 757574005, 757584763, 758177032, 758310089, 758508987, 758496246, 757831802, 759058914, 759404068, 755898285, 755438995, 757007980, 758622208, 759334946, 756487427, 756424789, 756131516, 754837418, 757706375, 758106766, 757119904, 757087631, 756738281, 756984634, 757435913, 758749695, 757862549, 756969223, 757721863, 756898727, 756695023, 756918488, 756647034, 756601181, 756735306, 756889267, 757144089, 757747726, 758058014, 757462463, 757148514, 757299271, 756802368, 756716537, 756689224, 756967239, 757200394, 757121658, 757955017, 757537689, 756726837, 756588287, 756696701, 757143555, 756873703, 756687164, 756500778, 756523666, 756657867, 756894073, 757241364, 757009201, 756880493, 756367798, 756451111, 757061157, 757110138, 757170029, 757293167]
4000.2G57293167
$$ y = [757293167]
##END=$$ End of the data block
