##TITLE=$$ Begin of the data block
##JCAMP-DX=5.00 $$ ACD/SpecManager v 10.08
##SPECTROMETER/DATA SYSTEM=Varian
##DATE=08 Jan 2013 16:00:56
##DATA TYPE=INFRARED SPECTRUM
##DATA CLASS=XYDATA
##ORIGIN=
##OWNER=
##NPOINTS=3735
##FIRSTX=399.26403809
##LASTX=4000.35498047
##MAXX=4000.35498047
##MINX=399.26403809
##MAXY=81.48456573
##MINY=42.34389496
##XFACTOR=1.0000000000
##YFACTOR=0.000000100000000
##FIRSTY=59.16991806
##DELTAX=0.96440572
##XUNITS=1/CM
##YUNITS=TRANSMITTANCE
##XYDATA=(X++(Y..Y))
399.3E91699181K4541092j0624390j0951576L850555r62563J0382958J1630783p415428
407F12150612j1768189k14576M510269l814049l968277K85797N643082N980720l050499
415.7F05754890m526405J213989n333862k2418365J1224174J0304108N03883K779236
423.4E99501648L003807k283363M445038Q128318m765167q843117j343155K432099
431.1F00276108K531433M00276J321793L95240n807342n924912O041298O111031j851158
439.8F03493767q14934m720535o714859J850967O604729K959633l261986K56462K706642
448.4F02359886J713371J177369j213990l228454l098984J334076J527710J828194
456.2F02399178J439552o913605j665954L827285q74862n286751K308197L686294Q02727
$$ y = [591699181, 616240273, 605615883, 594664307, 598514862, 597552299, 607935257, 619566040, 612150612, 600382423, 600167847, 604678116, 600864067, 596895790, 597181587, 602824669, 608805389, 605754890, 601228485, 602442474, 597108612, 574690247, 585914421, 596218529, 596722412, 599501648, 602505455, 600222092, 604667130, 612795448, 608030281, 599187164, 597844009, 600276108, 602807541, 603207817, 604529610, 604924850, 599117508, 593192596, 599233894, 605344925, 603493767, 602678833, 597958298, 591243439, 593094406, 599699135, 602658768, 599396782, 599653244, 602359886, 604073257, 605250626, 604036636, 600808182, 597709198, 599043274, 600570984, 602399178, 603838730, 596925125, 595259171, 599086456, 598211594, 592924843, 595233040, 598919334, 599722061]
464.8E99722061J083832K62489P98683m311790m901123M16794R9983l107796j400680
473.5E88662453O181488L547020n630036K54860M789582k546845m799957j632385K037391
482.2E90863571R2735k279624M387817J470833j801453j11847m58717J266136l84254
490.9E93045197l686715k413826K682534K412071n12581M71573Q80661J840095m82177
499.6E94236832k58179q22258o295738k199631K094688M693718R32579k120666O22940
508.2E90884285r60922j435089J121940J881371l187714k318344J595459j213951j396523
516.9E84970512J765862M904709j61553n161285j970406p85827J356849R25942j768685
525.6E84076118l755226N82085M435120R74121L00445O19126j402855j662903k242127
$$ y = [599722061, 600805893, 601068382, 601867065, 597555275, 592654152, 593070946, 593170929, 590063133, 588662453, 594843941, 598390961, 592760925, 593015785, 597805367, 595258522, 590458565, 588826180, 590863571, 590956306, 588676682, 593064499, 594535332, 592733879, 592622032, 592163315, 593429451, 593045197, 589358482, 586944656, 589627190, 592039261, 591526680, 591998253, 592878914, 594719009, 594236832, 593978653, 593156395, 586860657, 584661026, 586755714, 591449432, 592382011, 590261345, 590884285, 589923363, 588488274, 589610214, 591491585, 588303871, 585985527, 587580986, 586367035, 584970512, 586736374, 591641083, 591479530, 586318245, 584347839, 583562012, 584918861, 585844803, 584076118, 580320892, 580902977, 585338097, 586312218, 586612663, 587231789, 585828934, 584166031, 581923904]
534.3E81923904O72760K701035j030769k211762J110649K130394M96674N19562j210862
543E85101585l740730k256546n2490J209869N71518J71623N62630j895180k72483J840362
552.6E81240158l97530k204437j739578j0834j133384o37703L09524N5733J186371
561.3E76668320R60350J656723Q2741j897355j941986n54542K239723J145973P58324
570E79118271R84726k0790o17066j8615j1063j409531l92379p47986o59027O9313n8098
580.6E76237755J158485m16298j085701L79944J649628L21541j939202l20015P79534
589.3E76765671l46375Q1215J904831J440964M69513q8120r02595r00727n22499m66346
598.9E77435532j571846n83764J343842J131401J31035m00963P4654q49495j270752
$$ y = [581923904, 582596664, 585297699, 584266930, 582055168, 583165817, 585296211, 585792885, 586312447, 585101585, 581360855, 579104309, 579051819, 580261688, 580833206, 581004829, 581567459, 579672279, 579399796, 581240158, 580842628, 578638191, 576898613, 576887779, 575754395, 575116692, 575426216, 575481949, 576668320, 577628670, 579285393, 579368134, 577470779, 575528793, 574974251, 577213974, 578359947, 579118271, 580102997, 580082207, 579465141, 579446526, 579435463, 578025932, 577633553, 576885567, 576226540, 576295853, 576237755, 577396240, 576979942, 575894241, 576274185, 577923813, 578245354, 576306152, 575986137, 576765671, 576419296, 576500511, 578405342, 579846306, 580315819, 580227699, 579325104, 578424377, 577901878, 577435532, 575863686, 575279922, 576623764, 577755165, 577886200, 577485237, 577559891, 576710396, 575439644]
607.6E75439644j068001o71043k43988j197014J006126K388306M21409k42919j086922
616.3E74745598j642952R44786J616821j082115p80029M42467M64286J105995J692658
624.9E77507515J918068J352157K89231q41217k47689M52805J363373K236824J162453
633.6E85193520J776313K562180J347198J82190Q5144K89612p90519j96457J435775
642.3E91884956J212654Q91839J217117J316337P80220J24779J51634K98272K04963
651E98082771j15661L41224J151238O33697K36550O78749L63846o21834j233406j019364
660.6E98497810O33393P41653l98140J429405J599732j4763l279495j3487282P857284
669.3E93579597O045647J035347K32620R96857J218720K82211O34651J467590N27420
$$ y = [575439644, 574371643, 573700600, 573456612, 572259598, 573265724, 575654030, 576075439, 575832520, 574745598, 573102646, 574047432, 575664253, 574582138, 573802109, 574244576, 574708862, 575814857, 577507515, 579425583, 580777740, 581066971, 580225754, 579978065, 580430870, 581794243, 584031067, 585193520, 586969833, 589532013, 590879211, 591061401, 591146545, 591436157, 590645638, 590449181, 591884956, 593097610, 593989449, 595206566, 596522903, 597303123, 597427902, 597579536, 597877808, 598082771, 597967110, 598308334, 599459572, 600093269, 600329819, 601008568, 601372414, 600750580, 599517174, 598497810, 599131203, 599872856, 599474716, 600904121, 602503853, 602489090, 599209595, 585722313, 593579597, 599625244, 600660591, 600893211, 601890068, 603108788, 603390999, 604025650, 605493240, 606020660]
678F06020660J462174K600326l8261j551666M59404L18756M9362J950340K375565R48791
687.6F14595451k10456N12199R47227J882096J616211j022797m02260P90329l3760
696.3F18674240O86302J766434J266327K89001r53788o18973J121254J205940J367340
705F24804077O62651j74866J109276Q89664O41632J134720N61943J69563J75591K91519
714.6F30265770J65329L66211Q29773N25436k62069L86161K110901J590691k2164q05702
724.3F35150337j02234Q44117P19299J082916J231270J112366R05533P97195Q62122
733F42602921l11356O4316P41195l56979l68042Q77075J775971J375580R82971J99280
742.6F47582932m01536q19778o50406J318207J265793P93838K40860P75605K238922
$$ y = [606020660, 607482834, 610083160, 610044899, 608493233, 608952637, 609271393, 609320755, 611271095, 613646660, 614595451, 614384995, 614897194, 615844421, 617726517, 619342728, 618319931, 617917671, 618708000, 618674240, 619360542, 621126976, 622393303, 622682304, 621728516, 621109543, 622230797, 623436737, 624804077, 625466728, 625291862, 626401138, 627290802, 627932434, 629067154, 629629097, 629798660, 629974251, 630265770, 630431099, 630797310, 631627083, 632152519, 631890450, 632276611, 634387512, 635978203, 635956039, 635150337, 635048103, 635892220, 636611519, 637694435, 638925705, 640038071, 640943604, 641740799, 642602921, 642291565, 642355881, 643097076, 642740097, 642372055, 643249130, 645025101, 646400681, 647383652, 647582932, 647181396, 646361618, 645711212, 647029419, 648295212, 649089050, 649329910, 650105515, 652344437]
751.3F52344437J124878R41619J07727j16653j99737m59443J606369J407090J225967
760F57982254Q61435M58603K60773k82822Q13141N38711K82898k01950Q91800J567001
769.6F63171844o0424J28097l08761M00619M97208q29773j325150o94656Q66394O79398
779.2F62524796Q98666P12509L80707L82156P21817N96543p97348O83975J040191K73819
788.9F67417831n95245q15659J280137O22787j4267k4032j81199J158829J011963r60007
798.5F68901138j555710r87014p19757N17654n61066j887054l52860P6600k56882l33405
808.2F62841644j178894j158294m6769j404266k272186q41065q2397n77240j088638
816.9F54191895J57470n04150j050263K47574P6370Q14209O84739M19387K270279K803345
$$ y = [652344437, 653469315, 654410934, 654518661, 654402008, 654202271, 653742828, 655349197, 656756287, 657982254, 658843689, 659302292, 659563065, 659280243, 660093384, 660632095, 660914993, 660713043, 661604843, 663171844, 663111420, 663239517, 662930756, 663331375, 663828583, 662998810, 661673660, 660979004, 661845398, 662524796, 663423462, 664135971, 664516678, 664898834, 665620651, 666217194, 665419846, 666103821, 667144012, 667417831, 666822586, 666006927, 667287064, 667909851, 667895584, 667871552, 667690353, 668849182, 669861145, 668901138, 667345428, 666358414, 665638657, 666156311, 665595245, 663708191, 663355331, 663431931, 663175049, 662841644, 661662750, 660504456, 660457687, 659053421, 656781235, 655940170, 655857773, 655280533, 654191895, 654349365, 653845215, 652794952, 653042526, 653118896, 653933105, 654617844, 655037231, 657307510, 660110855]
826.5F60110855J919327J505432J413574J056442J895600K609176J733552J599731
834.2F73843689L009033L028488J447831N84259J000824J616058M58374O34308J251297
842.9F86874161J126022K66800L5782K808227K223664J085586P27082L47824J311569
851.6F96806717J05896j1597R81522J868286Q52432R52683K016220N80063P79113j19705
861.2G04811630O33545J388169k39182j00555K49404J107483P60422n80826j346893
869.9G06683197o96335j242523j581039J2359j56174n43518j317138l16468l81p18918
879.5G00123062L44620l64151j097717j110459n43518o50558n07813m09012j98517
888.2F95585937R68705m10157m67834R6817k76566j229934k111283o59256P70264J121140
$$ y = [660110855, 662030182, 663535614, 664949188, 666005630, 667901230, 670510406, 672243958, 673843689, 676852722, 679881210, 681329041, 681913300, 682914124, 684530182, 684988556, 685622864, 686874161, 688000183, 688266983, 688302765, 691110992, 693334656, 694420242, 695147324, 695495148, 696806717, 696912613, 696901016, 697882538, 699750824, 700603256, 701555939, 703572159, 704152222, 704931335, 704811630, 705445175, 706833344, 706594162, 706493607, 706743011, 707850494, 708610916, 708030090, 706683197, 705986862, 704744339, 703163300, 703175659, 703019485, 702475967, 701158829, 700842361, 700841980, 700123062, 700467682, 700103531, 699005814, 697895355, 697351837, 696701279, 696193466, 695784454, 695585937, 696554642, 696144485, 695676651, 695773468, 695496902, 694266968, 692155685, 691496429, 692266693, 693387833]
897.9F93387833l16010o20880j167679j582718p61718j050873N20477J136322J273193
906.5F90817947J803437J685791J392288O41785P33795J80816M46396j50680p44400
915.2F96807175r41620j047821J09100j052627j510621j593093j213379j143189k326202
923.9F86087723k200012k217026j337891j773376k165528j692657j825790j630173
931.6F71245270j554108m67453j035385j898270j289901p07474q68225j196137k22931
940.3F62005386m71496n93567q41828j373367r77402j492919j121750o31638l48663
949F54152756O61850M73938n10330m47693j50834l9367k49787k120590k666702j291885
958.6F47811356p56836j599961j792907j186982j084976r90829j925659j764946j383095
$$ y = [693387833, 693071823, 692450943, 691283264, 689700546, 688938828, 687887955, 688408432, 689544754, 690817947, 692621384, 694307175, 695699463, 696341248, 697075043, 697255859, 697702255, 697551575, 696807175, 695865555, 694817734, 694926834, 693874207, 692363586, 690770493, 689557114, 688413925, 686087723, 683887711, 681670685, 680332794, 678559418, 676393890, 674701233, 672875443, 671245270, 669691162, 669223709, 668188324, 666290054, 665000153, 664292679, 663424454, 662228317, 662005386, 661533890, 660940323, 660098495, 658725128, 657747726, 656254807, 655133057, 654501419, 654152756, 654814606, 655288544, 654778214, 654330521, 654179687, 654140320, 653890533, 651769943, 649103241, 647811356, 647054520, 645454559, 643661652, 642474670, 641389694, 640398865, 638473206, 636708260, 635325165]
967.3F35325165j821175r69887r91897j281853j611252j951141j895828k557679k524795
976F19719658j722756j935272l129997l413887k605553k147636k963982l771667l919564
984.7E94109344l608970l133850l406563l103371k720298k606698k430458k936859
992.4E70162277k465782j233025j162986j646576k228585k271461k342529k580185
1000.1E54231148j924782k004509k068024j598358q28056r78127k326355j858444j564369
1008.8E39080124j334801j442833j646042j037597j271859j147041j923790j176529
1016.5E28099632r82628k469978j748695j894989k080498j748734j596794j764831
1024.2E13812485j216049j004715j822930j318207j247863n85366j069488j230164
$$ y = [635325165, 633503990, 632534103, 631542206, 630260353, 628649101, 626697960, 624802132, 622244453, 619719658, 617996902, 616061630, 612931633, 609517746, 606912193, 604764557, 601800575, 598028908, 594109344, 590500374, 587366524, 583959961, 580856590, 578136292, 575529594, 573099136, 570162277, 567696495, 566463470, 565300484, 563653908, 561425323, 559153862, 556811333, 554231148, 552306366, 550301857, 548233833, 546635475, 545807419, 544829292, 542502937, 540644493, 539080124, 537745323, 536302490, 534656448, 533618851, 532346992, 531199951, 529276161, 528099632, 527117004, 524647026, 522898331, 521003342, 518922844, 517174110, 515577316, 513812485, 512596436, 511591721, 509768791, 508450584, 507202721, 506617355, 505547867, 504317703]
1031.9E04317703k84881k90146j24397m25454N21088O78406J410789J821213J198997
1040.6E08823318J186371N92041N81055l17459J94435K41470k58026l57170j097984
1049.3E09588051o33392j336747j394043j990928q76961L33328j277351j274224j418495
1058D99719238l62701J29585J552582J919975J108818J921501J001664J699409J572914
1066.6E10262985J943054K277642J752166J419602K05154K02217l55186P80945n9929
1075.3E18428650n76668N55840k9145J021614M02642J202659J498299P50389K84271
1084E23538551q21724K1210n6686J082382J300621J276779J735039R89342J038246
1092.7E30103760N62820Q52089N46951N2414r9525J040993J844940J157493J391907
$$ y = [504317703, 504032822, 503742676, 503618279, 503192825, 503713913, 504392319, 505803108, 507624321, 508823318, 510009689, 510601730, 511182785, 510865326, 511059761, 511301231, 511043205, 510686035, 509588051, 508954659, 507617912, 506223869, 504232941, 503355980, 503689308, 502411957, 501137733, 499719238, 499356537, 499486122, 501038704, 502958679, 504067497, 505988998, 506990662, 508690071, 510262985, 512206039, 514483681, 516235847, 517655449, 517860603, 518062820, 517707634, 518488579, 518428650, 517851982, 518407822, 518378677, 519400291, 519802933, 521005592, 522503891, 523254280, 523538551, 522716827, 522738037, 522681351, 523763733, 525064354, 526341133, 528076172, 529065514, 530103760, 530666580, 531518669, 532065620, 532118034, 532018509, 533059502, 534904442, 536061935, 537453842]
1101.4E37453842K75765J76506K42195P12623O46744k74658J008377J049118R81941
1110E42272453M63219O37970P88498J90201Q46443P32384K75268q58078M14047N22652
1119.7E46285057o93588Q58154M53758K88773O41212O48690J49917m70772j05247O26297
1129.3E48682251K279205K299843J952553J807327J618767J220283P78046J527214
1137E62165489K076950J681481P62252J707726J647720M04587R36813J312333R62104
1145.7E73657455k03819k55279j50910k47078M18511J60598M6769r5749J03111k16331
1155.4E73217278o43883m56619r70574q63457r34143n35392K04582O03409O62689M83703
1165E70767593J407586J561203J467399J838722J685295J603508K209549K703019K541542
$$ y = [537453842, 537729607, 537906113, 538148308, 538860931, 539507675, 539233017, 540241394, 541290512, 542272453, 542735672, 543373642, 544162140, 544352341, 545198784, 545931168, 546206436, 545348358, 545762405, 546285057, 545591469, 546449623, 546903381, 547192154, 547833366, 548482056, 548631973, 548161201, 548055954, 548682251, 550961456, 553261299, 555213852, 557021179, 558639946, 559860229, 560638275, 562165489, 564242439, 565923920, 566686172, 568393898, 570041618, 570446205, 571383018, 572695351, 573657455, 573453636, 573198357, 573047447, 572800369, 573218880, 573379478, 573426247, 573330498, 573433609, 573217278, 572573395, 572116776, 571146202, 570282745, 569348602, 568813210, 569017792, 569621201, 570283890, 570767593, 572175179, 573736382, 575203781, 577042503, 578727798, 580331306, 582540855, 585243874, 587785416]
1173.7E87785416K634735K427406J860848K585907K395629J355668J868820J514549
1181.4F04428978K182693K649994J437569J530914J671601J851730R60655N60951Q85888
1190.1F18160973K03018P7705J56326Q41103R58519j06506o38390k40593l43857j118545
1199.7F17949753q47130n09071l70217k62680p04345q55828o47392j97640K14005K62260
1209.4F14031715o7215n84678m36058M692o46362q91991M3259K02178l5057m82406
1219F11138077m65813J2550o49719o94771n42488j023254o28586k03247n00603m93736
1228.6F05948410K29607J61094m77676q09364p06902m42581q64296o08330j21040P3318
1238.3F02382240M56238N30739M83169O7292J02577m02222j003875o05278p34292n09834
$$ y = [587785416, 590420151, 592847557, 594708405, 597294312, 599689941, 601045609, 602914429, 604428978, 606611671, 609261665, 610699234, 612230148, 613901749, 615753479, 616714134, 617275085, 618160973, 618363991, 618441696, 618598022, 619439125, 620397644, 620291138, 619652748, 619412155, 619068298, 617949753, 617102623, 616593552, 616223335, 615960655, 615256310, 614400482, 613753090, 613555450, 613769455, 614031715, 613964500, 613379822, 612943764, 612948456, 612302094, 611410103, 611453362, 611655540, 611620483, 611138077, 610672264, 610684814, 610035095, 609340324, 608797836, 607774582, 607145996, 606942749, 606442146, 605948410, 606178017, 606339111, 605861435, 605052071, 604345169, 603902588, 603038292, 602429962, 602308922, 602382240, 602838478, 603369217, 603852386, 603919678, 604022255, 603620033, 602616158, 602010880, 601276588, 600766754]
1247.9F00766754o142K57683N04151O70509M37622p248m51240j146660p95174k02904
1257.6F00027351k9411J09520K89993Q02117P36007N19829R8915L70827N78613l09715
1267.2F03194046k88353M45900J022949R62258R22813J213646J237221J169815P74917
1275.9F10655212J78414N7182K87895N97191J099892J254310J397133J580811J333008
1284.6F18441048Q71277M37812L42369L66936P54051R99298Q27523R24606J176872
1293.3F25141792J081963Q85696N36461k022j01509m23546j45263L67851M22173L86161
1302.9F28149757L2998J1062j49879j86158n41610j064492p24182l41758j33133o85349
1312.5F24367256j094971R3956O79856k93274m79164k3003j85509K8840K08206N47371
$$ y = [600766754, 600760612, 601018295, 601522446, 602192955, 602630577, 602623329, 602172089, 601025429, 600230255, 600027351, 599997940, 600107460, 600397453, 601199570, 601935577, 602455406, 602554321, 602925148, 603503761, 603194046, 602905693, 603351593, 604374542, 605336800, 606259613, 607473259, 608710480, 609880295, 610655212, 610833626, 610890808, 611178703, 611775894, 612875786, 614130096, 615527229, 617108040, 618441048, 619312325, 619750137, 620092506, 620459442, 621213493, 622212791, 623040314, 623964920, 625141792, 626223755, 627109451, 627645912, 627643890, 627542381, 627118835, 626973572, 627341423, 627763596, 628149757, 628182755, 628193817, 628043938, 627857780, 627316170, 626251678, 625527496, 625185738, 625052605, 624367256, 623272285, 623366241, 624046097, 623752823, 623273659, 623250656, 623065147, 623093987, 623302193, 623849564]
1322.2F23849564J124229O73409j42289O77224J295127K7047m58146m25262n28412
1330.9F26092491r84917p98797P2327j69335m1046m5280q4305N264o75659j11351Q90503
1341.5F24149895O25801p5836N26771J018295Q10013Q77610M48074K85034m2801J00556
1351.1F28723412m95263o13441n0087q11615j14937L43399K22817j42479j45035L7956
1360.8F26954727o75812q14704j551400M05007M14390o38847o5079l71399j3313K9335
1370.4F23672905j07918j37596p40890r87664m16069N98374O19812P70263K32239p9460
1380.1F23423996L49770q3771j055489j642837r32541o04973m50859q56018l02391
1388.7F17844887K61345l19023o74706j140175p84225k813797l416558m71649r09347
$$ y = [623849564, 624973793, 625647202, 625504913, 626182137, 627477264, 627504311, 627046165, 626620903, 626092491, 625107574, 624308777, 624381104, 624211769, 624170723, 624125443, 624041138, 624046402, 623370743, 623259392, 624149895, 624775696, 624699860, 625226631, 626244926, 627054939, 627932549, 628380623, 628665657, 628622856, 628723412, 628228149, 627614708, 627564621, 626753006, 626638069, 626981468, 627204285, 627061806, 626916771, 626954727, 626278915, 625464211, 623912811, 624317818, 624732208, 624093361, 624028282, 623656883, 623643570, 623672905, 623564987, 623427391, 622686501, 621698837, 621282768, 621881142, 622500954, 623271217, 623503456, 623423996, 623773766, 623689995, 622634506, 620991669, 620059128, 619454155, 619003296, 618147278, 617844887, 618106232, 617787209, 617112503, 615972328, 615188103, 612374306, 608957748, 608486099, 607576752]
1397.4F07576752q01506k637825j431237J5412r76715q38013j215401l158798k574539
1406.1E93958130n33180p07932j342926j513863j393089o25191q56475p72858j073875
1414.8E85138741j422234j459465j227570L41301k613372r1782J722488M22821r1400
1423.4E80719528j202888P53441Q25958l23868J35193k60086P4882P02591J549111
1432.1E82973862R70840J126862K280464J018867j534538Q03452K948341J529541Q02650
1440.8E92920341J275406R23539J548767Q51364J391907J380729O16455J94321J135445
1449.5F02238274J895485O76269P81212R90677J757889J308326K25945m30222n68962
1458.2F08874893M128113K107735K866630K254372J411476K053261n19943J944122
$$ y = [607576752, 606775246, 604137421, 602706184, 602721596, 601744881, 600906868, 599691467, 596532669, 593958130, 593424950, 592717018, 591374092, 589860229, 588467140, 587841949, 586985474, 586212616, 585138741, 583716507, 582257042, 581029472, 581370773, 578757401, 578665619, 580388107, 580810928, 580719528, 579516640, 580270081, 581096039, 580772171, 580907364, 580647278, 580722160, 581424751, 582973862, 583944702, 585071564, 587352028, 588370895, 586836357, 587639809, 590588150, 592117691, 592920341, 594195747, 595119286, 596668053, 597519417, 598911324, 600292053, 600908508, 601102829, 602238274, 604133759, 604810028, 605591240, 606581917, 608339806, 609648132, 609874077, 609443855, 608874893, 613003006, 615110741, 617977371, 620231743, 621643219, 623696480, 623176537, 625120659]
1465.9F25120659K444458K370186J834945J519051K415733M97208l91197J937256M936485
1474.6F42684784L493881Q96301K548676K330399J298980R38111N09719N18342J014785
1483.2F56233978J284714J003342J209182o790j65710J535721j662369j037979J462707
1491.9F59856796P68662k55661l12042n23224n280533P18841k70919j899262J142807
1500.6F53945465m91104j276474p08466O02494J59454n991364p083740J712342L369598
1509.3F44238205J284943J703491j219712j650009Q83408j198578j350174l290253
1517F39401321j416778L069000J875305k901535n062256K626419L683472J838074k065582
1525.7F41047440J51214K39411o09742J432114R86710J63116L79562K44980l089370
$$ y = [625120659, 627565117, 629935303, 631770248, 633289299, 635705032, 636202240, 635811043, 637748299, 642684784, 646178665, 647074966, 649623642, 651954041, 653253021, 654191132, 654700851, 655219193, 656233978, 657518692, 658522034, 659731216, 659724426, 659558716, 661094437, 659432068, 658394089, 659856796, 660625458, 660369797, 660057755, 659534531, 654253998, 654972839, 654701920, 652802658, 653945465, 653454361, 652177887, 651469421, 652071915, 652231369, 646240005, 639156265, 640868607, 644238205, 645523148, 647226639, 646006927, 644356918, 645240326, 644041748, 642691574, 639401321, 637984543, 641053543, 642928848, 640027313, 634965057, 637591476, 641274948, 643113022, 641047440, 641198654, 641438065, 640828323, 642260437, 643247147, 643410263, 643789825, 644034805, 640945435]
1534.3F40945435P07779O76803N95474J861878l285446m393654K203216P48177j0605
1543F40049057K372360R7275j989365K315369N94330M72565r15299j539764K091522
1551.7F43548050J379700J160888k936325O47354K846680J056671p861175j5493775
1559.4F24348068J0668564N109406K801818M35486n11245k541657j577072Q4648j528969
1568.1F37289047j178970o733246q4610Q5144j886101j066208j168937j453667j1961708
1576.8F11840744P7248j016655k827340k673339l648186k038040l616791k220001l647919
1585.5E90229721l328628l236657m559517l255577m530258k258453m032288k365303
1593.2E62663040k993545l602982j690865m469566k183494l849030k557526l385391
$$ y = [640945435, 641653214, 642330017, 642925491, 644787369, 641501923, 637108269, 639311485, 640059662, 640049057, 642421417, 642518692, 640529327, 642844696, 643439026, 643911591, 642996292, 641456528, 643548050, 644927750, 646088638, 643152313, 643799667, 646646347, 647703018, 639841843, 624348068, 635016632, 640126038, 642927856, 643363342, 642852097, 640310440, 638733368, 638818016, 637289047, 636110077, 629376831, 629292221, 629377365, 627491264, 626425056, 625256119, 623802452, 611840744, 611917992, 610901337, 608073997, 605400658, 601752472, 599714432, 596097641, 593877640, 590229721, 586901093, 583664436, 579104919, 575849342, 571319084, 569060631, 565028343, 562663040, 559669495, 556066513, 554375648, 549906082, 547722588, 543873558, 541316032, 537930641]
1600.9E37930641k786941j306305l476906o82640k799492j538010k662239j735077
1608.6E20943031j810722l110848l98826k758026O4430j269112K61193n30587p691574
1617.3E03698959K414627n55687N55802j670952K41165n69267k962914J557656j11199
1626E02598190J918145j864434p477Q10433K30827N06172l06282K421265N52063k811394
1635.6E04047508j651382L589134K515411J046486J598664J43852K159653M08134K243500
1644.3E16100960J714935j803055K096176L03116L805847J859475L714370K465592
1652E30257416n780030J185570K875061M893341K154084K845840J792717J967163K324257
1660.7E44515419J880035J682969P08847M296455K340775K248077L038254K643585
$$ y = [537930641, 535143700, 533837395, 530360489, 529677849, 526878357, 525340347, 522678108, 520943031, 519132309, 516021461, 515622635, 512864609, 512929039, 511659927, 511921120, 511390533, 503698959, 506113586, 505557899, 506113701, 504442749, 504683914, 504114647, 501151733, 502709389, 502598190, 504516335, 502651901, 502644424, 503454857, 503685684, 504191856, 503885574, 506306839, 506858902, 504047508, 502396126, 505985260, 508500671, 509547157, 511145821, 511289673, 513449326, 513857460, 516100960, 517815895, 516012840, 518109016, 518412132, 522217979, 524077454, 527791824, 530257416, 524477386, 525662956, 528538017, 533431358, 535585442, 538431282, 540223999, 542191162, 544515419, 546395454, 548078423, 548787270, 553083725, 555424500, 557672577, 560710831, 563354416]
1668.4E63354416K14004J522980M580307J792374M031067L563080J407585J250419
1676.1E81716232L097229L945771K771835L015785J096459L484535L764801q36411
1683.8F02056236J693459L834495N813141L221321J930199K639503K674561M133720
1691.5F27996635L588982L769112M430389L600731l437424M259339N686340N193558
1699.3F55087662J036072m303055P346039N227813L008728J225663K411499J232910
1707F72273331J760482K960892J027222J228638K356033K762070K276458q57544O17218
1715.6F86404800L946915J186981o384964L728104L155212J286316J456986R44900
1723.4F95725250J088333J653595J620636P75681M70428J050492j461945p3776L272858
$$ y = [563354416, 563568420, 565091400, 569671707, 571464081, 575495148, 579058228, 580465813, 581716232, 584813461, 588759232, 591531067, 594546852, 595643311, 599127846, 602892647, 602056236, 603749695, 607584190, 613397331, 616618652, 618548851, 621188354, 623862915, 627996635, 631585617, 635354729, 639785118, 643385849, 639948425, 644207764, 649894104, 655087662, 656123734, 651820679, 659166718, 664394531, 667403259, 668628922, 671040421, 672273331, 674033813, 676994705, 678021927, 679250565, 681606598, 684368668, 686645126, 685787582, 686404800, 690351715, 691538696, 685153732, 688881836, 692037048, 693323364, 694780350, 695725250, 696813583, 698467178, 700087814, 700863495, 701333923, 702384415, 700922470, 700848694, 704121552]
1732G04121552K679214j438293l838425M640961M107513J768723J889877j139527j565017
1740.7G11226578M001312K523270M40673K162705L242340K102280J584778K182922
1748.4G29466858J399918L910446J01089n02853M960479L196488K697983K446670n2337
1757.1G47624741K125015K535553K130737K387009j872025K02561L323135J875229
1764.8G60331955J777039K171173J422271j820678J761322L149795o44302k051926
1772.5G66096649k13928L724594J494522l07922K353592J195144J622086L63693r70077
1781.2G75358353J235275J581268N34973j478653P59659K019501J044922P92999J407089
1789.9G83255386O81000k65732k149048p0343L199082P53326j46026J497268J403504
$$ y = [704121552, 706800766, 705362473, 701524048, 706165009, 710272522, 712041245, 713931122, 712791595, 711226578, 715227890, 717751160, 718191833, 720354538, 723596878, 725699158, 727283936, 729466858, 730866776, 734777222, 734878311, 734375458, 739335937, 742532425, 745230408, 747677078, 747624741, 749749756, 752285309, 754416046, 756803055, 754931030, 755133591, 758456726, 760331955, 762108994, 764280167, 765702438, 763881760, 765643082, 768792877, 768148575, 766096649, 765882721, 769607315, 771101837, 770793915, 773147507, 774342651, 775964737, 776328430, 775358353, 776593628, 778174896, 778709869, 777231216, 777990875, 780010376, 781055298, 781848297, 783255386, 783936386, 783670654, 781521606, 781451263, 784650345, 785403671, 785257645, 786754913, 788158417]
1798.6G88158417j87149q38929K161713j38245o6375J464767J35041K96936M62112
1807.3G91448288N05218J146088J552811p36771J23444J222534L12958J80816n34820
1815.9G95220566M89197j95923N67932J229553K60010J188583K5940P34177L11432
1824.6G99831467k588883N08957J666336J416702j069717l125610K466507K944030
1832.3H02049789O60477K14539m8905k51007l91311m33655P94983M25720Q43735L23791
1842H04188156J066666L01285m469758K296372J810455m99878o61621N83191J430435
1850.7H06045303K01035L62091K30102O68412J53198j87683J8997n75180L41034J44806
1860.3H07402115N55801K32849M59519N01938j14212L62854q34580J82343j234436
$$ y = [788158417, 787971268, 787132339, 789294052, 789155807, 789089432, 790554199, 790689240, 790986176, 791448288, 791953506, 793099594, 794652405, 793915634, 794039078, 795261612, 795574570, 795755386, 795220566, 795709763, 795513840, 796081772, 797311325, 797571335, 798759918, 798785858, 799520035, 799831467, 797242584, 797751541, 799417877, 800834579, 799764862, 796639252, 799105759, 802049789, 802710266, 802924805, 802875900, 802624893, 802233582, 801799927, 802594910, 803020630, 803864365, 804188156, 805254822, 805556107, 801086349, 803382721, 805193176, 804693298, 804031677, 804614868, 806045303, 806246338, 806608429, 806838531, 807506943, 807660141, 807472458, 807491455, 806916275, 807257309, 807402115, 807957916, 808190765, 808650284, 809152222, 809038010, 809400864, 808566284, 808748627, 807514191]
1869H07514191j293640J435852J266937J469803M00924J5488r6130L76053J6174o32553
1878.6H10473099j51520k24381M56467j66244M6005M2572K63367J010360l4485M90036
1888.3H12205276m38766j419220N81360O72302j75018K00882K10190m36707Q17871
1896.9H12218170L91541M38156L75442o64978n05218k05155M96750j25732K04925N49469
1906.6H13173370l8757M9820r1934l33557k44294M85001m80194j84403M47922P11518
1916.2H13494492J038360j781845N3482J222000K33231L8071j796341r71299P45469
1924.9H12275620P78503K22626M88357N33905K85187j3428m45251k69394p90253l46145
1934.6H12719727j42899L67126N78614L72314R25217m8065P3623j225814k044526M85611
$$ y = [807514191, 806220551, 807656403, 808923340, 810393143, 810794067, 810809555, 810713425, 811089478, 811105652, 810473099, 810321579, 810097198, 810553665, 810387421, 810433426, 810475998, 810739365, 811749725, 811715240, 812205276, 811766510, 810347290, 810928650, 811600952, 811425934, 811626816, 811837006, 811400299, 812218170, 812609711, 813047867, 813423309, 812758331, 812253113, 812047958, 812544708, 812418976, 812623901, 813173370, 813134613, 813184433, 813092499, 812758942, 812514648, 812999649, 812519455, 812335052, 812782974, 813494492, 814532852, 812751007, 812804489, 814026489, 814259720, 814297791, 812501450, 811530151, 812275620, 813054123, 813276749, 813765106, 814299011, 814584198, 814570770, 814125519, 813856125, 813065872, 812719727, 812576828, 812943954, 813522568, 813894882, 814820099, 814772034, 814845657, 813619843, 811575317, 812060928]
1944.2H12060928L00370r3232J67694Q14133N82504M57077o7977k68097Q8501p46994
1953.8H13294907o22178n13076Q5678L60565M59442O01578j76163J54419l1052l33480
1963.5H13280640q31757m54864J79519n88608L21808J102066R90372K1057l40500k90146
1973.1H13389587n61905l15780l95737k5329l5553K57415N01252K42080J59226l6698
1982.8H13178558j57165r18122o58721p6142J47095l9520K00958R92889k38723r87778
1992.4H11443329j84250J94168j16959j13601J31378j83182K26898M273K15835J65253
2002.1H11783142k01721J8692m60663k33612k95029k83355M1046K50091Q7815m33655
2011.7H10272751j06125J43127L39356k89459r40552n51987K50550N04608K87323K35061
$$ y = [812060928, 812361298, 812268066, 812435760, 813249893, 813832397, 814289474, 814221497, 813953400, 814041901, 813294907, 812672729, 812159653, 812245331, 812605896, 813065338, 813666916, 813490753, 813645172, 813614120, 813280640, 812448883, 811994019, 812173538, 811584930, 811906738, 813008804, 813999176, 814020233, 813679733, 813389587, 812827682, 812511902, 812116165, 812090836, 812055283, 812312698, 812813950, 813056030, 813215256, 813178558, 813021393, 812103271, 811444550, 811368408, 811515503, 811475983, 811676941, 812669830, 812431107, 811443329, 811259079, 811453247, 811336288, 811222687, 811354065, 811170883, 811397781, 811402054, 811617889, 811783142, 811581421, 811600113, 811139450, 810905838, 810610809, 810327454, 810368500, 810618591, 810706406, 810272751, 810166626, 810309753, 810649109, 810359650, 809419098, 808867111, 809117661, 809622269, 809909592, 810144653]
2021.3H10144653n32684j90506M8141l83987k15225q7662O3858k01034J53122N569
2031H08804245l2959o4011n63964k18583k61840k5177j01242P2250K17438j3428j70059
2041.6H07642670l53012L19290m04206o03180j79595J61514N14068j36566Q8654j68762
2051.2H06880875L1814k17819n25970K81524r6741K823k21328N874J71814k10342K49557
2061.9H06352081m1275o4850l75442o22559k7313L23944J58386p6446L53622R919n28718
2072.5H05461349k36587m2801n7068k2812l73611j87760L09067J31302L80783K98996
2082.1H05660858j74255n93643m92783p6981j51367r4986J92566M02603k70614m2572
2091.7H04358826M4861k97471J40839m37927j88141J50299J11923L2044M6768K96326
$$ y = [810144653, 809611969, 809421463, 809469604, 809085617, 808870392, 808782730, 808846588, 808645554, 808798676, 808804245, 808771286, 808707275, 808143311, 807924728, 807662888, 807637711, 807536469, 807608719, 807826157, 807812729, 807642670, 807289658, 807608948, 807204742, 806601562, 806421967, 806583481, 807097549, 806960983, 807049637, 806880875, 806912689, 806694870, 806168900, 806450424, 806353683, 806356506, 806135178, 806141052, 806312866, 806102524, 806352081, 806310806, 806245956, 805870514, 805247955, 805220642, 805544586, 805702972, 805626526, 805980148, 805990067, 805461349, 805224762, 805181961, 805124893, 805102081, 804728470, 804540710, 804849777, 804981079, 805361862, 805660858, 805486603, 804892960, 804400177, 804323196, 804171829, 804076843, 804269409, 804672012, 804401398, 804358826, 804403687, 804106216, 804247055, 803809128, 803620987, 803771286, 803883209, 803915253, 803962021, 804258347]
2101.4H04258347k89231k77939o55517q8806L72924m4403P4158l78189K08511L3646
2111H03213501k92435p6065J8540K9144m61121J99433O0501K9678R2316k70310j61666
2121.6H02381516j5030J86767n22156m9972J297j14594M98658P9498j05209l50419
2131.3H01990356k6016j81808K6779K83585j47858K13699p9040k08207l97872l205
2140.9H01470413L27378L44924K82441l53775Q4457l42102q7967J95465j78070L05405
2150.6H02048569O2179J11542o3400J82037L2730m21905J2817L9597j7243k34756J71890
2161.2H01924057K33612J04141n6305J00708N01328k40784k18963o8589K53678j04904
2170.8H02427979k69700L64304j07880K00119l6850j40457J67847R0256J2130l07235
$$ y = [804258347, 803969116, 803691177, 803035660, 802946854, 803319778, 803275375, 803349533, 802971344, 803179855, 803213501, 802921066, 802845001, 802863541, 802892685, 802431564, 802630997, 802691498, 802721176, 802813492, 802543182, 802381516, 802366486, 802553253, 802031097, 801981125, 801982422, 801867828, 802366486, 802445984, 802340775, 801990356, 801964340, 801782532, 801809311, 802092896, 801945038, 802158737, 802079697, 801871490, 801473618, 801470413, 801797791, 802142715, 802425156, 802071381, 802155838, 801813736, 801725769, 801921234, 801743164, 802048569, 802110748, 802222290, 802158890, 802340927, 802373657, 801951752, 801964569, 802004166, 801986923, 801752167, 801924057, 802157669, 802261810, 802205505, 802306213, 802807541, 802566757, 802347794, 802279205, 802532883, 802427979, 802158279, 802522583, 802414703, 802614822, 802577972, 802437515, 802605362, 802695618, 802707748, 802400513]
2180.5H02400513L05786M08325J70746j69525N951L3188k62299J91650j24664K39563
2190.1H03199234J19019k69471r5291m3106M26026L9291k20947k30332K37198L05100
2199.8H03466721l69797m05045J69068O37664p4005J71280K21253l66059j93786R1171
2209.4H03348465M29993r308O943J26419J39007j82648m17785J04751j16424j30005
2219H03299408P1716N16281K68326N0430J58616n26657l68729j60523K46735K17133
2228.7H03772736J02920Q5907m2877L04718k73590P2174J13296k76336j71128k27432
2238.3H03460388J35727q5144K28958L22190R7885j18180j47857n1346l70636K95791
2248H03767776J10627k12632j08642o10J1673k73285J25351k55738l01513R384K25067
$$ y = [802400513, 802706299, 803114624, 803285370, 803115845, 803121796, 803154984, 802892685, 803084335, 802959671, 803199234, 803318253, 803048782, 802953491, 802910385, 803336411, 803375702, 803154755, 802924423, 803161621, 803466721, 803096924, 802691879, 802860947, 803498611, 803424606, 803595886, 803817139, 803451080, 803257294, 803348465, 803778458, 803769150, 803776093, 803902512, 804041519, 803858871, 803441086, 803545837, 803429413, 803299408, 803371124, 803887405, 804155731, 804206161, 804364777, 803838120, 803469391, 803308868, 803555603, 803772736, 803875656, 803961563, 803918686, 804223404, 803949814, 804021988, 804135284, 803858948, 803687820, 803460388, 803596115, 803510971, 803739929, 804062119, 804160004, 804041824, 803893967, 803842621, 803471985, 803767776, 803878403, 803665771, 803557129, 803556519, 803568192, 803294907, 803420258, 803164520, 802863007, 802872391, 803097458]
2258.6H03097458O3934j62201K15454J39542K57950n44815m27933J77612J43891K00729
2268.2H03161621l56674J19018r8953j04370K12326P9727J76239j95465j61438m23889
2277.9H02408142K31323L46146j29318L1357J2130K14157r6969j22757n91126j75705
2287.5H02127380o1416m62265l6545l37830M31824r2010k42539j20926n51452k80152
2297.2H00374069j039581j02005j12839k9907O6147k19498K91443j037903q74176r06601
2306.8G96409149n02319m40674o16989l1281r14459L21732j76316j03988n68161j401520
2316.4G91975174K70309j342849j263657j054764q80432n4169n42907q94699j568299
2325.1G84643707k48108m24118J95999o71615j179962J63650o99081J85318j43128
$$ y = [803097458, 803161392, 802999191, 803214645, 803354187, 803612137, 803067322, 802639389, 802817001, 802960892, 803161621, 802804947, 802923965, 802825012, 802720642, 802932968, 803012695, 803188934, 802993469, 802832031, 802408142, 802639465, 802985611, 802856293, 802887650, 802899780, 803113937, 803016968, 802894211, 802303085, 802127380, 802065964, 801603699, 801567154, 801229324, 801661148, 801569138, 801326599, 801205673, 800654221, 800374069, 799334488, 799232483, 799119644, 799089737, 799155884, 798936386, 799227829, 798189926, 797315750, 796409149, 795906830, 795466156, 794849167, 794817886, 793903427, 794225159, 794048843, 793944855, 793376694, 791975174, 792245483, 790902634, 789638977, 788584213, 787703781, 787649612, 787106705, 786212006, 784643707, 784395599, 783971481, 784167480, 783495865, 782315903, 782479553, 781780472, 781965790, 781822662]
2333.8G81822662N77164l56293r43145j20469q22982l8605m16489P50580r99908j358796
2343.4G78093719N86625O67495K327195K378845K801819Q42971j482238j424637k180252
2352.1G82611542k433319j653672j578369j566086j915817k307586n75486M37088K86866
2360.8G71305161P33718j231460j288376O12869J636276J252976J738586K149811K121964
2369.5G79031525K475128J088333R28040O32858P06253J056366J134872J203766O13022
2378.2G88870163J391220J612549J530380J231003O28204N44892K04239K13928j56403
2386.8G96070175j5640L62167J15280j63955j25885K69546Q5678N570p07932q54873
2396.5G95040131J9378K18735J57013K212J63117m06036n25132J14823K79541r8801
$$ y = [781822662, 782399826, 782043533, 781100388, 780979919, 780156937, 780118332, 779701843, 780452423, 779452515, 778093719, 778680344, 779347839, 781675034, 784053879, 786855698, 787698669, 786216431, 784791794, 782611542, 780178223, 778524551, 776946182, 775380096, 773464279, 771156693, 770581207, 771018295, 771305161, 772038879, 770807419, 769519043, 770131912, 771768188, 773021164, 774759750, 776909561, 779031525, 781506653, 782594986, 783523026, 784155884, 784862137, 785918503, 787053375, 788257141, 788870163, 790261383, 791873932, 793404312, 794635315, 795263519, 795808411, 796012650, 796226578, 796070175, 796054535, 796416702, 796531982, 796368027, 796242142, 796511688, 796597366, 796602936, 795895004, 795040131, 795059509, 795278244, 795435257, 795437469, 795600586, 795194550, 794669418, 794784241, 795063782, 794964981]
2406.1G94964981p33185k93960r6894j2054r3994J3809K93198l22190k31323k85950
2415.8G93202438k66342k41623l68194q9264J8768K35443n9128j85012l34015l37906
2425.4G91575165j50604k19803j76316m92324k84119K1362L45078J51596m96216j70898
2435.1G90102921K2735j21918j77612l30048o65054l85055j66169j10550J82801j45951
2444.7G88206100l03878l65448K9525K19269L5782m66690q61053P6141o4926j95160
2454.3G86309662o6605k40402q4000l21121Q3542k15301m17405J07727O87k93732k82516
2465G84580536l00217n73730j30158j22452M3259q7356n46875N3176q5830k50092m54101
2475.6G82126160l96195q1634o6529p2403l73153k96707n26886j79062P4997q4305
$$ y = [794964981, 794231796, 793937836, 793840942, 793828888, 793734894, 793748703, 794041901, 793719711, 793488388, 793202438, 792936096, 792694473, 792326279, 792237015, 792255783, 792491226, 792432098, 792247086, 791913071, 791575165, 791424561, 791204758, 791028442, 790536118, 790251999, 790273361, 790618439, 790770035, 790273819, 790102921, 790125656, 790003738, 789826126, 789496078, 788831024, 788445969, 788279800, 788169250, 788352051, 788206100, 787902222, 787536774, 787566299, 787785568, 787821350, 787354660, 786493607, 786569748, 786504822, 786309662, 786243057, 786002655, 785918655, 785597534, 785681076, 785465775, 785048370, 785156097, 785156784, 784863052, 784580536, 784280319, 783706589, 783576431, 783453979, 783497238, 783409882, 782863007, 782916183, 782830353, 782580261, 782126160, 781729965, 781648331, 781581802, 781509399, 781136246, 780839539, 780312653, 780133591, 780208588, 780124283]
2485.2G80124283l91236q29315k3117Q9646j78223m19617k99301j23138m61350k84729
2494.8G77203903o65054k26441J54953j17645j67312k62375q1940n92117o51245j52512
2504.5G74442215J61667l74222m73022J29318k79083j33362j66626j66092k5559m75921
2514.1G72639313p61719l99170J05972m15268j96151J09787K86865J32599o90842p41959
2523.8G70069427p61413p8888o5002m40903k77786O6833K59094m63104l3340o0578
2533.4G68214340l30505m29764p52563J36337P6370l59344l08457p095j15357m47921
2543.1G65676041k52533m11682l65601m18243p5837N5313m35180l36991N5695K16980
2552.7G63707962o8130l36533o23398m49371m27628o0653J21002o21949l02124j06048
$$ y = [780124283, 779733047, 778903732, 778880615, 778970261, 778792038, 778372421, 778073120, 777949982, 777488632, 777203903, 776538849, 776312408, 776467361, 776349716, 776182404, 775920029, 775838089, 775245972, 774594727, 774442215, 774603882, 774229660, 773756638, 773885956, 773606873, 773473511, 773306885, 773140793, 773115234, 772639313, 771877594, 771478424, 771584396, 771169128, 770972977, 771082764, 771369629, 771502228, 770811386, 770069427, 769308014, 769229126, 769164124, 768723221, 768445435, 768512268, 768771362, 768308258, 768274918, 768214340, 767883835, 767454071, 766701508, 766837845, 766914215, 766554871, 766246414, 766239319, 766123962, 765676041, 765423508, 765011826, 764646225, 764227982, 764152145, 764207458, 763772278, 763435287, 763490982, 763707962, 763639832, 763303299, 762679901, 762230530, 761802902, 761742249, 761863251, 761241302, 760939178, 760833130]
2562.4G60833130J10168M7379n3101k05383r18961l40881m98733o04172k13547k69928
2572G57885971J38779L71475J69983n82428p19681o16836j71509Q5373j9303M8294
2581.6G56590118n45654q6594L8071R384L4714p33719n02929m55475n03083j82876
2591.3G53661957K82440J45187k48794j56403k21863m16412q93402k54974r1172n78155
2600.9G51228409m61807m30680J6861p5149J63726K44523j44272k88468m51126k38037
2610.6G49563980q25577j214065n86701L27835N23072K34756j21765p09381n27802
2619.3G46664352o13937p53403m40521K34528L26767l54843n08271l13873L09753l83224
2628.9G44167328q73642n66101n97000k99912p10907k30026K16446K22549J34125k87170
$$ y = [760833130, 760943298, 760990677, 760937576, 760732193, 759813232, 759472351, 758973618, 758369446, 758155899, 757885971, 758024750, 758396225, 758566208, 757983780, 757264099, 756647263, 756475754, 756561127, 756541824, 756590118, 756044464, 755957870, 755995941, 756005325, 756040039, 755306320, 754803391, 754347916, 753844833, 753661957, 753944397, 754089584, 753840790, 753684387, 753462524, 753046112, 752152710, 751897736, 751806564, 751228409, 750766602, 750335922, 750352783, 750277634, 750441360, 750685883, 750541611, 750253143, 749802017, 749563980, 748738403, 747524338, 746937637, 747265472, 747788544, 748023300, 747901535, 747192154, 746664352, 746050415, 745297012, 744856491, 745091019, 745417786, 745062943, 744554672, 744240799, 744550552, 744167328, 743293686, 742727585, 742130585, 741830673, 741119766, 740889740, 741106186, 741328735, 741462860, 741175690]
2638.5G41175690k98920q74176n68924m88281n07584l59649m18549L20358k23923m01077
2648.2G37354965k20260k72370J11237l46375l39431k80533q36487p35321N1880K25830
2657.8G34713135k5177r1477k77023m60739m58298k28577l89709m89578n68085n5237
2667.5G31669235M81949k19269n41000l40576L98559J41678q66852o63223r6207J80054
2677.1G30144348l67050k14462m0818p68280q88290l5858O67801r3079m51736o59409
2686.8G27293167r11026k90680J98517Q2932n04303l45688j4344k4261l80554m70963
2696.4G24632797k92740n70449j15509J48239R0027q1101k49557j24665l98941n88455
2706G22449646m04816j7395m15497k63595r4223n96085L5858J32752o5613j11923m15344
$$ y = [741175690, 740876770, 740002594, 739433670, 738945389, 738437805, 738078156, 737659607, 737979965, 737756042, 737354965, 737134705, 736862335, 736973572, 736627197, 736287766, 736007233, 735170746, 734435425, 734487305, 734713135, 734687958, 734596481, 734319458, 733858719, 733400421, 733171844, 732782135, 732292557, 731724472, 731669235, 732151184, 731931915, 731390915, 731050339, 731448898, 731590576, 730723724, 730060501, 729964294, 730144348, 729777298, 729562836, 729522018, 728753738, 727865448, 727829590, 728497391, 728404312, 727952576, 727293167, 726382141, 726091461, 726289978, 726372910, 725868607, 725522919, 725508575, 725484314, 725103760, 724632797, 724340057, 723769608, 723654099, 723802338, 723892365, 723811264, 723561707, 723437042, 723038101, 722449646, 722044830, 722027435, 721611938, 721348343, 721254120, 720658035, 720693893, 720826645, 720761032, 720649109, 720233765]
2716.6G20233765o62766l63846O7368k58255J84631K17743m52041l71018L06244J46255
2726.3G19048080q61129q13217o62537j46332J11694k09503j19095O9657N76477L24402
2735.9G17318497j23139p86133q62655j48850k93960k68708l41873k06070K11563L58277
2745.6G14856949J98898N5542L967l49197j93863n86777p15637l78647j02539N50232
2755.2G13338928O0044k66877j28479k25067k20718k68326n89981o56586P7057K4796
2764.9G11144791q8959p7973j68228K00425r0104m98275o12564m35410k51007j62354
2774.5G08960342J4496O9962r1553m94842k45057J04523l15323q92105n15060m0894
2784.2G06554489n91812o32019J78528N26886k25373p10983l75290k23007o42319o41327
$$ y = [720233765, 719570999, 719207153, 719274521, 719016266, 719200897, 719418640, 718966599, 718595581, 718901825, 719048080, 718186951, 717373734, 716711197, 716564865, 716676559, 716467056, 716347961, 716417618, 716994095, 717318497, 717195358, 716409225, 715546570, 715397720, 715103760, 714835052, 714493179, 714287109, 714498672, 714856949, 715055847, 715111389, 715115356, 714766159, 714572296, 713985519, 713269882, 712891235, 712788696, 713338928, 713398972, 713132095, 713003616, 712778549, 712557831, 712289505, 711699524, 711042938, 711119995, 711144791, 711055832, 710977859, 710809631, 711010056, 710919952, 710421677, 709809113, 709373703, 709122696, 708960342, 708974838, 709044800, 708953247, 708458405, 708213348, 708317871, 708002548, 707110443, 706595383, 706554489, 705962677, 705330658, 705509186, 706036072, 705810699, 705099716, 704724426, 704501419, 703859100, 703217773]
2793.8G03217773K7390n23682p84378j28097j00632k45819l26080m69819o38732l78571
2803.4F99649353o11420p99942o74972n18189L82920K88849l24708q22982p56150n3100
2813.1F95759659n61676j216507p73621k55432p47223o10122r5673p3242K30713m48685
2822.7F91208191j171951j119919q05512p47146p52869m22134m04206l51028n44739
2831.4F84888687n00183q69369j120148m77371r19800q09326n81971j308136j249923
2840.1F77052460q54264q75396j391526j647186j411896j148452j336365k162628k301560
2848.8F63923187j520080j289139j152115k84195p7362o73218o54068p4310l2959j25732
2858.4F58040009q8273o2713K38037r2239m12903j95694J9989k53983o92901n38102
$$ y = [703217773, 703245163, 702721481, 701937103, 701809006, 701708374, 701462555, 701136475, 700666656, 700027924, 699649353, 699037933, 698237991, 697563019, 697044830, 697427750, 697716599, 697391891, 696568909, 695812759, 695759659, 695197983, 693981476, 693207855, 692952423, 692205200, 691595078, 691499405, 691426163, 691656876, 691208191, 690036240, 688916321, 688110809, 687363663, 686610794, 686188660, 685784454, 685433426, 684888687, 684388504, 683519135, 682398987, 681921616, 681001816, 680192490, 679610519, 678302383, 677052460, 676198196, 675322800, 673931274, 672284088, 670872192, 669723740, 668387375, 666224747, 663923187, 662403107, 661113968, 659961853, 659677658, 659600296, 658927078, 658273010, 658198700, 658165741, 658040009, 657951736, 657889023, 658127060, 658034821, 657621918, 657426224, 657446213, 657192230, 656499329, 655961227]
2868.1F55961227r39941p93915j52588l68347k77710p4310m60281q96683l76740l6773
2877.7F51583939l62168m31137n86166o29425l26309k40555n31235l59802p99866j460495
2887.3F45856781r70993m85306l40500q21151r47495n79987j71203j44196r27047r38378
2897F39530525p95212o06536l45383m94003r06182r76410k06566m09278q32978n59272
2906.6F33398705j55068n01938q44307o49490j421089j108704q60519j168061r47456
2915.3F25742073j103630q45490j063194j104851j679801j570130j21765n70946o01539
2924F17080727j1864J03607J54724R5520M24500O79435O52199K7390l23639k44866
2933.6F18637733J85853P86132O49872L09029P44743J324730P66182L09067K66380
$$ y = [655961227, 655021286, 654227371, 654074783, 653706436, 653428726, 653354416, 652894135, 651997452, 651620712, 651583939, 651221771, 650790634, 650204468, 649575043, 649248734, 649008179, 648476944, 648117142, 647317276, 645856781, 644885788, 644400482, 644059982, 643238831, 642291336, 641711349, 641540146, 641395950, 640468903, 639530525, 638735313, 638128777, 637783394, 637289391, 636383209, 635406799, 635200233, 634790955, 633957977, 633398705, 633243637, 632741699, 631897392, 631247902, 629826813, 628718109, 627857590, 626689529, 625742073, 624638443, 623792953, 622729759, 621624908, 619945107, 618374977, 618253212, 617682266, 617080727, 617068863, 617172470, 617327194, 617422714, 617847214, 618526649, 619178848, 619206238, 618882599, 618637733, 618823586, 619609718, 620259590, 620568619, 621313362, 622638092, 623404274, 623713341, 623979721]
2942.3F23979721N01900N22384J26458M95720N52864M84771Q8158O6490R28192L23754
2952F28070412m09928j31378J58997K18773K69088L18413K67296L08533L91807K68097
2961.6F29730110J95160K95563P8964O43005O62766J58768N52024J56670Q07457J503639
2971.2F34784126O97060M38728J92147L5514L31536O59637P30972O26755L53813M09050
2980.9F39259338M63486R0408K13089L05634J96075k98767k58217n4321j62544N08041
2990.5F40262222M97971L82080K0599k75116p6446k88315k53143o08597k52075J22184
3000.2F39531364p8201k11944m34456k82440p65076l75633j41221p65037n02739n39513
3009.8F35435104l39431n3711l47367m08439k02294k39334k39754l08570l39814l96499
$$ y = [623979721, 624481621, 625004005, 625130463, 625626183, 626179047, 626663818, 626751976, 626818466, 627746658, 628070412, 627660484, 627529106, 627688103, 627906876, 628175964, 628494377, 628761673, 629070206, 629462013, 629730110, 629925270, 630220833, 630299797, 630942802, 631605568, 631764336, 632316360, 632473030, 633280487, 634784126, 635481186, 635919914, 636112061, 636147575, 636479111, 637138748, 637869720, 638496475, 638850288, 639259338, 639722824, 639813232, 640026321, 640331955, 640528030, 640229263, 639971046, 639916725, 639754181, 640262222, 640760193, 641142273, 641162872, 640887756, 640811310, 640522995, 640269852, 639661255, 639409180, 639531364, 639453163, 639241219, 638806763, 638524323, 637759247, 637383614, 637242393, 636477356, 635974617, 635435104, 635095673, 635041962, 634694595, 634286156, 634083862, 633844528, 633604774, 633296204, 632956390, 632559891]
3019.5F32559891r26819k16675o2370p16286k75421k84576n27306o71005n27993n61561
3029.1F27789879n02930n17006r68361j98135P9727m77257p41348l66325l23906q84361
3038.7F22889977m50058p01828j049614m92402j00326k58904r85908o11534j87187
3047.4F18052216o02265p83081r07898o53534k29606j98632n11245r59168p88574l59078
3057.1F12059135j75781k33993j052170p61147r3269q52470q79631k80686R537r6665
3066.7F07642860k64930n11551r69582q98514n26046k69280j197395r58977M07906
3075.4F02454491p9079j71242j61781m81415m20799p61604o59790n46914q52279n80597
3085E97738991j36910l29170j79367n32112q15125k12745l86658l98560q76960r12590
$$ y = [632559891, 631633072, 631416397, 631354027, 630637741, 630362320, 630077744, 629550438, 628879433, 628351440, 627789879, 627286949, 626769943, 625801582, 625603447, 625683174, 625205917, 624464569, 624098244, 623774338, 622889977, 622439919, 621738091, 620688477, 620196075, 620095749, 619836845, 618850937, 618239403, 618052216, 617449951, 616666870, 615758972, 615105438, 614875832, 614677200, 614165955, 613206787, 612418213, 612059135, 611883354, 611649361, 610597191, 609836044, 609742775, 608890305, 608010674, 607729988, 607739525, 607642860, 607377930, 606866379, 605896797, 604998283, 604472237, 604202957, 603005562, 602046585, 602454491, 602375412, 602204170, 602042389, 601560974, 601140175, 600378571, 599718781, 599171867, 598319588, 597738991, 597602081, 597272911, 597093544, 596561432, 595746307, 595533562, 595146904, 594748344, 593871384, 592958794]
3094.7E92958794m14238q64220j96686k27241o56319l5362k13433n81321p62635o92329
3104.3E88315010n22880n91240m37165o22291n42069o8092n68161o97479j44806l05405
3114E83815422j075516j342659j20964J38855o82297p39631n79605n56450q91190o64787
3123.6E77301178l81393m10271k84348o97441r57413o20079l36685n17235k38189n18990
3133.3E72339134j037330l63274m54063n52483o81229j020546q45642n52711K2087
3141.9E66853943k84691p60231p74727m95911n50804r72252m59823m10576m61350m66461
3151.6E61217117q91227p58362o11725n27802n07583m46854p40394j156311o25535
3160.3E54951324k38380n72205o99806o63986p93571o50406n51758o16646l82462l87039
$$ y = [592958794, 592544556, 591680336, 591483650, 591256409, 590600090, 590564728, 590351295, 589769974, 589007339, 588315010, 587792130, 587200890, 586763725, 586141434, 585599365, 585531273, 584963112, 584265633, 584120827, 583815422, 582739906, 581397247, 581276283, 581415138, 580732841, 579993210, 579413605, 578857155, 577965965, 577301178, 576919785, 576509514, 576225166, 575527725, 574570312, 573950233, 573613548, 573096313, 572858124, 572339134, 571301804, 570938530, 570484467, 569931984, 569250755, 568230209, 567384567, 566831856, 566853943, 566569252, 565809021, 565034294, 564538383, 563987579, 563015327, 562555504, 562144928, 561683578, 561217117, 560325890, 559567528, 558955803, 558428001, 557920418, 557473564, 556733170, 555576859, 554951324, 554712944, 554140739, 553440933, 552776947, 551983376, 551332970, 550781212, 550164566, 549782104, 549395065]
3169.9E49395065q80432q84056m78783k87857k41394p28225q25539q58803q97598o8817
3179.5E43243561m25644r82323n79948m81873n80177l99819l21426p43866p46651p72895
3189.2E37208939r84841p90138n02739n28946q60824n23758L7956M6196p71141j242981
3198.8E31087723q85926p98873m46015m72374n97725o03828r98459q55675j41449J59493
3208.5E25446892n64728r92126q49114m23393k68402r60198r05571l77044j61667l08190
3218.1E19636459q17642q59108j86500o21643j451073p92084m05578l22381l91731
3226.8E13788719k95868l08037p75299k67601l35350o94465j111145r78508m70391
3235.5E08552055o69670j10550n87616q03108l01933k87819l46069p98149Q2283p0496
$$ y = [549395065, 548514633, 547630577, 547151794, 546863937, 546622543, 545894318, 545068779, 544209976, 543312378, 543243561, 542817917, 541835594, 541255646, 540773773, 540193596, 539793777, 539472351, 538728485, 537981834, 537208939, 536224098, 535433960, 534931221, 534402275, 533541451, 533017693, 533055649, 533101845, 532330704, 531087723, 530201797, 529402924, 528956909, 528484535, 527886810, 527282982, 526284523, 525428848, 525287399, 525446892, 524882164, 523890038, 523040924, 522617531, 522349129, 521388931, 520483360, 520106316, 519944649, 519636459, 518818817, 517959709, 517773209, 517151566, 515700493, 514908409, 514502831, 514180450, 513788719, 513492851, 513184814, 512409515, 512141914, 511806564, 511112099, 510000954, 509022446, 508552055, 507882385, 507771835, 507184219, 506381111, 506079178, 505791359, 505445290, 504647141, 504729424, 504658928]
3245.1E04658928p22771k77405p05375q14057o09703l95965n73960q59832n86319j82648
3254.8D98930893l48587m98314j69334p10526o76460o0311J79596k22015r15794p17774
3264.4D94791374n71594j38245k93007m96673J15661r4795n90019p51915n09300o69327
3274D90792160n39741k97356l24593l05557q95157m94346l46680m03748J16692k77786
3283.7D87023888p12204r54857l43209N43938J28975o91719l43246j54953o98891j03417
3293.3D83694305N4589p13387r47304l06167k56844p90367m96826o57578l93791n2757
3303D79133873j77269j35612l18680k14234p81898r38339n68505o46286l39355m18930
3312.6D74594765q22678p04193j17226m14848o38885j97068o18858p04231m39721q08143
$$ y = [504658928, 503936157, 503658752, 502953377, 502139320, 501529617, 501133652, 500559692, 499699860, 499113541, 498930893, 498582306, 498083992, 497914658, 497204132, 496527672, 496467361, 496646957, 496424942, 495509148, 494791374, 494219780, 494081535, 493788528, 493291855, 493407516, 493312721, 492722702, 491970787, 491461487, 490792160, 490252419, 489955063, 489630470, 489324913, 488429756, 487935410, 487588730, 487184982, 487301674, 487023888, 486311684, 485356827, 485013618, 485557556, 485686531, 484994812, 484651566, 484496613, 483797722, 483694305, 483748894, 483035507, 482088203, 481782036, 481525192, 480734825, 480237999, 479580421, 479186630, 479133873, 478956604, 478820992, 478502312, 478288078, 477506180, 476567841, 475999336, 475353050, 475013695, 474594765, 473772087, 473067894, 472950668, 472535820, 471896935, 471699867, 471081009, 470376778, 469937057, 469128914]
3322.3D69128914p67479J17378m1275j024666j404800j338921o51130o49872q84438
3330.9D62483711m10690m8027k84805r17206n87502m84962r29070o99157p76749q32977
3340.6D56512566m57726r03282j350861m60624k16637p08885n92728l18336j72005
3349.3D51331482m83360p36313q95272p92236n33600p98683o34804l81660p26013p41082
3358.9D44608459k80456k87132p64695j099739p48710L5171j59225p20787n01328k70500
3368.6D39811058n73616q11577n32074m74701r45320q84514n10254p14264l60374J9569
3378.2D34023933l89099n99899l55644L6621j46713j02501l08342n51415k07367o88362
3387.8D30711212k99721K39258l02009o55785n47752k14463o44569m83055K11983j46828
$$ y = [469128914, 468361435, 468478813, 468437538, 467412872, 466008072, 464669151, 464018021, 463368149, 462483711, 462073021, 462024994, 461740189, 460822983, 460235481, 459750519, 458821449, 458122292, 457345543, 456512566, 456054840, 455151558, 453800697, 453340073, 453123436, 452414551, 451821823, 451503487, 451331482, 450848122, 450111809, 449216537, 448424301, 447890701, 447092018, 446457214, 446075554, 445349541, 444608459, 444328003, 444040871, 443276176, 442176437, 441427727, 441462898, 441303673, 440582886, 440081558, 439811058, 439237442, 438425865, 437893791, 437419090, 436473770, 435589256, 435079002, 434364738, 434004364, 434023933, 433634834, 433034935, 432679291, 432715912, 432569199, 432466698, 432158356, 431606941, 431399574, 430711212, 430411491, 430650749, 430348740, 429692955, 429145203, 428930740, 428286171, 427803116, 428015099, 427868271]
3397.5D27868271p90787r2621O38199l76549p12280j94664j94893m06837l67050j58768
3407.1D25212021m07601l02009O3705M41819K21557l58696k34413p1907j68838o25268
3416.8D23770370l31420L85513N00984J42212k00424J06048k26669j81732L16124K55966
3426.4D24536972J49536n7907J98364N42107N68581O4659l84751l81508M8600O54907
3436.1D25939560J52740p5798K8382K06489R88732N53169o7597J49155M6044M01573
3445.7D28322449Q32863j99051k47040R00917J163940R89991K25944p3204L12309J25809
3455.3D32354927M12369N13382M61387J259995R09195J2588M29650O95953L13225K50206
3465D37612877R71336J237107O21185N71556J24893K2011P35550J006851J015244O18171
$$ y = [427868271, 427077484, 426984863, 427623062, 427246513, 426534233, 426339569, 426144676, 425737839, 425370789, 425212021, 424804420, 424502411, 424566116, 425007935, 425229492, 424870796, 424636383, 424564476, 424395638, 423770370, 423438950, 423824463, 424325447, 424467659, 424267235, 424373283, 424146614, 423964882, 424281006, 424536972, 424686508, 424628601, 424826965, 425369072, 425937653, 426002312, 425617561, 425236053, 425284653, 425939560, 426092300, 426016502, 426044884, 426251373, 427240105, 427793274, 427725677, 427874832, 427920876, 428322449, 429155312, 428956261, 428709221, 429610138, 430774078, 431764069, 431990013, 431916809, 432229118, 432354927, 432767296, 433280678, 433742065, 435002060, 435911255, 435923843, 436353493, 437049446, 437362671, 437612877, 438584213, 439821320, 440442505, 441014061, 441138954, 441160965, 441896515, 442903366, 443918610, 444536781]
3474.6D44536781M51470L24630L79105O63261N20363N67093P36466P74994M57840R58747
3484.3D50370750J403504L16276K57225P93152M06723N54772P45697J021080J249199
3493D57118378O29463R36241P76482j64337Q49838J237449O79207P85523J039543N84946
3502.6D64472733r3499M64669J317634J227455M42658J073608P79610J65329J854515
3511.3D71704712J349831J048545J100769N0240L56522Q13903R14879R34906J082535
3520D79356842R26361Q34580Q28552L86085N35546J333046J518516N34249Q25538R77555
3529.6D88056870J346397J473732R38225J121177O37894J810875N58701m02375K181320
3538.3D97722816R22432J30959J059875K033043J423989R22622J161614J92757J242103
$$ y = [444536781, 444988251, 445312881, 445691986, 446355247, 446875610, 447442703, 448179169, 448954163, 449412003, 450370750, 451774254, 452090530, 452347755, 453140907, 453547630, 454102402, 454848099, 455869179, 457118378, 457747841, 458684082, 459460564, 459296227, 460146065, 461383514, 462062721, 462848244, 463887787, 464472733, 464379234, 464843903, 466161537, 467388992, 467831650, 468905258, 469684868, 469850197, 471704712, 473054543, 474103088, 475203857, 475254097, 475610619, 476424522, 477339401, 478274307, 479356842, 480283203, 481117783, 481946335, 482332420, 482867966, 484201012, 485719528, 486253777, 487079315, 488056870, 489403267, 490876999, 491815224, 492936401, 493574295, 495385170, 495943871, 495541496, 497722816, 498645248, 498776207, 499836082, 501869125, 503293114, 504215736, 505377350, 505570107, 506812210]
3547E06812210M14963J926002K296677J535530J889687p04995J422501J487885R76638
3555.6E18057098J744156O23970J608086J058731J067085J381684K288475J298294
3563.4E29127579N40848L625030M95873J62048l95241M15993M245033J295433R16329
3572E40428925J610031J322441J312561J575508J724167J256485K464638J368866J239929
3580.7E54303551J620636J629638J628685J484337L380089l45955o64062K656440K48261
3589.4E65941620K983284K984772K832565J023292P88117K387047j27335L047180K928391
3598.1E84788933J068649K884560J371612P98950J466294J534920K478752L896293
3605.8F00288963K269478r33609L298302m59099J22681O711807P83653r87320M448738
$$ y = [506812210, 507227173, 509153175, 511449852, 512985382, 514875069, 514170074, 515592575, 517080460, 518057098, 519801254, 520425224, 522033310, 523092041, 524159126, 525540810, 527829285, 529127579, 529668427, 533293457, 533789330, 533951378, 533556137, 533972130, 538217163, 539512596, 540428925, 542038956, 543361397, 544673958, 546249466, 547973633, 549230118, 551694756, 553063622, 554303551, 555924187, 557553825, 559182510, 560666847, 564046936, 563700981, 563036919, 565693359, 565941620, 568924904, 571909676, 574742241, 575765533, 576553650, 578940697, 578813362, 581860542, 584788933, 585857582, 588742142, 590113754, 590912704, 592378998, 593913918, 596392670, 600288963, 602558441, 601624832, 604923134, 604464035, 604586716, 611298523, 612082176, 611094856, 615543594]
3614.5F15543594l17459L249855M428520Q24738J992188j45302Q37364L340683L151512
3623.1F32905693K000885J811562K042846L271866O249466l126068r081459P108040
3630.9F43182831O484222M539719N02853J34125L236465L329010K168122M28543J998520
3639.5F66004410K679214K422562J279449R76563L144836L696289M709473n24902k058792
3648.2F82329102M232330j402054k303009J310425N722656M429550L984146M218369
3655.9G02521515o401367K694778N681076J163941K17514N02548K759094J255570R57641
3664.6G11352310J613159J213913M476471K782975p19910j808319n552674M258881
3672.3G17616806P051163N794754k280197j2899857M258728O880264L922043j972503
$$ y = [615543594, 615226135, 618475990, 622904510, 623729248, 625721436, 625576134, 626413498, 629754181, 632905693, 634906578, 636718140, 638760986, 642032852, 648282318, 645156250, 636074791, 643182831, 649667053, 654206772, 654709625, 654843750, 658080215, 661409225, 663577347, 664005890, 666004410, 668683624, 671106186, 672385635, 673362198, 676507034, 680203323, 684912796, 684387894, 682329102, 686561432, 685159378, 682856369, 684166794, 689889450, 694319000, 698303146, 702521515, 696120148, 698814926, 704496002, 705659943, 705877457, 706380005, 709139099, 710394669, 711352310, 712965469, 714179382, 718655853, 721438828, 720718918, 718910599, 713357925, 717616806, 724667969, 730462723, 728182526, 715282669, 719541397, 726421661, 730343704, 728371201]
3680G28371201m960K997590K173690J160508m77143j96609L506164M410782p164001
3688.7G34777222j005326O107331n338898Q89893N139694Q57925J375885Q3466n10178
3697.4G42377014J751175Q70438J993637K229538n254746j399383M690933J558075
3705.1G48816681J87225M34723K379379L041153o084518L440933J976395j1938553
3712.8G42253418N493011M243699n2643R47647J897201j6174l442306J525344M490357
3721.5G57339554l957672k839814M774018J453552j187515m245911J186600M288177
3729.2G56810989P26166M503861k149430n304413P983933n26581r509125O90384K115708
3737.9G55341492J069946K981415K417068l244171K928238R760132j0178986j4287338
$$ y = [728371201, 728366241, 731363831, 733537521, 734698029, 734220886, 734024277, 737530441, 741941223, 734777222, 733771896, 739879227, 734540329, 735430222, 740569916, 741427841, 742803726, 742887192, 742377014, 744128189, 744998627, 746992264, 749221802, 743967056, 742567673, 747258606, 748816681, 749003906, 749438629, 751818008, 754859161, 748774643, 752215576, 754191971, 742253418, 747746429, 751990128, 751937485, 752885132, 754782333, 754766159, 751323853, 752849197, 757339554, 753381882, 750542068, 755316086, 756769638, 755582123, 751336212, 752522812, 756810989, 757537155, 762041016, 759891586, 754587173, 762571106, 762044525, 752535400, 753225784, 755341492, 756411438, 759392853, 761809921, 758565750, 761493988, 771254120, 761075134, 746787796]
3745.6G46787796R416733O087341N553894m837952q396835J0109482o841812m414978
3753.3G53463669O560592L839493K009659m159393K653808L690415p677918j56326
3761G60223999L781815J209030P01751K009507l330918l015976L544770M007339j135254
3769.7G67996063p737045K849884L565979N69382P11441l68271P99103M41742K208709
3778.4G71036987l96118p169418K078094K048188O80770J299210l065643n18952J575089
3787.1G67568207Q13141O09588l91464L5858m9286J36109L57666J568069J642380m547958
3796.7G67742310j914597K694855L063736M461593o838455q084869M826965L255920
3804.4G69207458L778840K519149j0658950k451249N383912K771606N62897p7668n97534
$$ y = [746787796, 756204529, 762291870, 767845764, 763007812, 754610977, 764720459, 757878647, 753463669, 760024261, 763863754, 765873413, 761714020, 764367828, 768058243, 760380325, 760223999, 764005814, 765214844, 765916595, 767926102, 764595184, 761579208, 765123978, 769131317, 767996063, 760259018, 763108902, 766674881, 767244263, 767955704, 767587433, 768386536, 768828278, 771036987, 770640869, 763471451, 765549545, 767597733, 768278503, 769577713, 766512070, 765993118, 767568207, 768381348, 768990936, 768599472, 768635330, 768586044, 768722153, 769079819, 770647888, 772290268, 767742310, 765827713, 768522568, 771586304, 776047897, 769209442, 761124573, 765951538, 769207458, 772986298, 775505447, 764846497, 762395248, 767779160, 770550766, 771113663, 771035995, 770438461]
3813.1G70438461R84574M137878l748550j0630799N974274N285187L390655n41687
3820.8G75289993j5450134L257904N850067K233048J540908j197662l526459R33838
3828.6G68931503K016831K551422k86942p495269M270629O613160o849518m87671P309265
3837.2G76573410r582062l989181P546844m328613J029739O970826k965699l576584
3844.9G67678680L129883J137161L88947J714554j316681J198883L320160n820313
3852.7G71431274l34854j4335632M767456R322586j654053l20663L000946J533508
3860.4G73410568R43909m314346J264190M661408p087250l535919M635238M934693
3868.1G74912491K970962j0222778n457687N258255O471023K167664q528519J313553
$$ y = [770438461, 771423035, 775560913, 771812363, 761181564, 767155838, 772441025, 775831680, 775289993, 759839859, 763097763, 768947830, 771180878, 772721786, 771524124, 767997665, 768931503, 770948334, 773499756, 773212814, 765717545, 769988174, 776601334, 769751816, 769264145, 776573410, 766991348, 763002167, 770549011, 766220398, 767250137, 774220963, 771255264, 767678680, 770808563, 771945724, 772334671, 774049225, 772732544, 773931427, 777251587, 771431274, 771096420, 756760788, 761528244, 770850830, 769196777, 768876114, 771877060, 773410568, 774354477, 770040131, 771304321, 775965729, 768878479, 765342560, 769977798, 774912491, 777883453, 767660675, 762202988, 767461243, 773932266, 776099930, 767571411, 768884964]
3875.8G68884964K637329m11606J712418L505325n192947n246735O050949J049423
3883.5G72989120Q26798K011108j0923843K739334L313751K33612L096848p18994o003494
3892.2G67564240J623001K884216p93305J209794L35464J144333J56479p536926N280532
3900.9G71867828J062165m360886L732758k816620j220246J29700J216660J970672
3908.6G71582031J58386O15082o98623k62909K25982l63464O13937J046677l253632
3917.3G69663467k588806L854447k4567j988678K550583J342163M67224k531662j756897
3926G68987274K028580R82590K5100j682586K89764K408829j560517q37631J104202
3934.6G71745605L10059o6681n09415K6474l64456o65054J656113Q63952l180771n84030
$$ y = [768884964, 771522293, 771110687, 772823105, 776328430, 771135483, 765888748, 771939697, 772989120, 773815918, 775827026, 764903183, 767642517, 770956268, 771189880, 774286728, 773567734, 767564240, 769187241, 772071457, 771278152, 772487946, 772823410, 773967743, 774124222, 766587296, 771867828, 772929993, 768569107, 772301865, 769485245, 768264999, 768394699, 769611359, 771582031, 771740417, 772355499, 771656876, 771393967, 771619949, 771256485, 771870422, 772917099, 769663467, 767074661, 770929108, 770904541, 768915863, 771466446, 772808609, 773275833, 770744171, 768987274, 771015854, 771998444, 772023544, 770340958, 770630722, 773039551, 771479034, 770641403, 771745605, 772055664, 771988983, 771479568, 771506042, 771141586, 770476532, 772132645, 772996597, 769815826, 769231796]
3944.3G69231796J414948J769409Q70514k861328o04096j97067r98077J902542N03387
3953G71032028N799K94952o4621L7613p29141K86636k45895J24511K97470j750183
3962.6G69289169j89056O80466L94592Q04748K68097k33841l46603N6839L00369q64944
3972.2G70159836p32422J153183J079101n48019q07953Q77762J00861q29544P99408
3980.9G71252213k04316q20999j33438l81J18026q0642N47332K95182K47497j64795
3990.6G71055679o98776k79999j86920P91779j13068k01034Q47778l43781j68533K63367
4000.2G70966492
$$ y = [769231796, 770646744, 772416153, 773286667, 770425339, 769821243, 769624176, 768626099, 770528641, 771032028, 771037827, 771332779, 771268158, 771305771, 770576630, 770863266, 770617371, 770741882, 771039352, 769289169, 769100113, 769780579, 770175171, 770979919, 771248016, 771014175, 770667572, 770724411, 771024780, 770159836, 769427414, 770580597, 771659698, 771111679, 770303726, 771181488, 771282349, 770452805, 771252213, 771047897, 770226898, 770093460, 770093079, 770211105, 770130463, 770677795, 770972977, 771220474, 771055679, 770356903, 770076904, 769889984, 770681763, 770568695, 770367661, 771215439, 770871658, 770703125, 770966492]
##END=$$ End of the data block
