##TITLE=$$ Begin of the data block
##JCAMP-DX=5.00 $$ ACD/SpecManager v 10.08
##SPECTROMETER/DATA SYSTEM=Varian
##DATE=08 Jan 2013 16:00:52
##DATA TYPE=INFRARED SPECTRUM
##DATA CLASS=XYDATA
##ORIGIN=
##OWNER=
##NPOINTS=3735
##FIRSTX=399.26403809
##LASTX=4000.35498047
##MAXX=4000.35498047
##MINX=399.26403809
##MAXY=81.71717072
##MINY=42.45186234
##XFACTOR=1.0000000000
##YFACTOR=0.000000100000000
##FIRSTY=59.04186249
##DELTAX=0.96440572
##XUNITS=1/CM
##YUNITS=TRANSMITTANCE
##XYDATA=(X++(Y..Y))
$$ plain form
399.3 590418625 594486351 605633583 611422424 609679146 600734406 606439705 610733604 603903809
407 603903809 600513763 592758636 597450066 613142052 618438835 609643021 603713493 609173431 608151703
415.7 608151703 606009293 608587151 609176369 592227669 587043343 595821915 599036560 600023155 601681213
424.3 601681213 599083290 600145111 606852531 605571899 598139305 597316742 596773415 597801094 599980659
433 599980659 600874062 601319771 600041618 601576576 600799332 598432503 597377586 601492958 606680984
441.7 606680984 601979752 600854492 604958496 605597267 601875725 603455086 607182617 602401962 599193993
450.4 599193993 601584778 604189339 601083107 595746689 596070938 600336876 600677986 594651337 596332436
459.1 596332436 599695015 603028183 601390495 600253792 600368385 597116127 599166298 602094231 603258095
$$ packed form
399.3E90418625M067726J1147232N788841j743278q944740N705299M293899o829795
407F03903809l390046p755127M691430J5691986N296783q795814n929528N459938j021728
415.7F08151703k142410K577858N89218j6948700n184326Q778572L214645R86595J658058
424.3F01681213k597923J061821O707420j280632p432594q22563n43327J027679K179565
433E99980659Q93403M45709j278153J534958p77244k366829j054917M115372N188026
441.7F06680984m701232j125260M104004O38771l721542J579361L727531m780655l207969
450.4E99193993K390785K604561l106232n336418L24249M265938L41110o026649J681099
459.1E96332436L362579L333168j637688j136703J14593l252258K050171K927933J163864
$$ plain form
467.7 603258095 599602394 593418121 592724876 593991127 591968460 583222961 584078217 590413704 593736153
476.4 593736153 592746048 591322899 595056763 594435768 591508484 592470932 591877098 589341125 587719841
485.1 587719841 588130417 590423164 594939728 596654320 595881081 594425201 589447746 588794556 591659164
493.8 591659164 589362526 585894699 587961845 591212997 594652214 597175102 596632881 594408035 589599190
502.5 589599190 589052773 589630814 589880943 590757866 589507217 590154419 588764381 586849442 590163689
511.1 590163689 590750198 587141304 585828171 587103348 588649940 588538017 588419228 590168610 591238708
519.8 591238708 591822662 589565430 586184654 584769821 583550034 584404526 584548073 584139481 585795937
528.5 585795937 588184471 588728676 586112099 583374100 582510719 583434334 582791061 582261276 582414742
$$ packed form
467.7F03258095l655701o184273o93245J266251k022667q745499Q55256O335487L322449
476.4E93736153r90105j423149L733864o20995k927284R62448n93834k535973j621284
485.1E87719841M10576K292747M516564J714592p73239j455880m977455o53190K864608
493.8E91659164k296638l467827K067146L251152L439217K522888n42221k224846m808845
502.5E89599190n46417N78041K50129Q76923j250649O47202j390038j914939L314247
511.1E90163689N86509l608894j313133J275177J546592j11923j18789J749382J070098
519.8E91238708N83954k257232l380776j414833j219787Q54492J43547m08592J656456
528.5E85795937K388534N44205k616577k737999q63381R23615o43273n29785J53466
$$ plain form
537.2 582414742 581338234 583010750 584757423 584842987 583998032 582103233 579712448 578835144 579832039
545.9 579832039 578711853 580105629 581981812 580343895 578817749 578870506 580724602 581170578 579581413
554.5 579581413 577305527 576024704 575942230 576265869 577439995 577909927 578296204 578207703 577714577 577960243
564.2 577960243 578415375 576531906 573915291 575191422 576449852 577608185 579900780 580704918 579317970
572.9 579317970 579207535 579698715 576597099 575206528 575282021 575105362 576000366 576136475 576586266 576538734
582.5 576538734 577091446 577458038 577684517 578157196 577639885 577649918 576826515 576408501 576799278 578163528
592.1 578163528 580405045 581029053 581212807 580816193 579295998 578427353 578820457 577912178 577314034
600.8 577314034 579407120 580179329 578774109 578071442 578176575 576692123 575147781 574580078 573860283
$$ packed form
537.2E82414742j076508J672516J746673Q5564q44955j894799k390785q77304R96895
545.9E79832039j120186J393776J876183j637917j526146N2757J854096M45976j589165
554.5E79581413k275886j280823q2474L23639J174126M69932L86277q8501m93126K45666
564.2E77960243M55132j883469k616615J276131J258430J158333K292595Q04138j386948
572.9E79317970j10435M91180l101616j390571P5493j76659Q95004J36109M49791m7532
582.5E76538734N52712L66592K26479M72679n17311J0033q23403m18014L90777J364250
592.1E78163528K241517O24008J83754l96614j520195q68645L93104r08279n98144
600.8E77314034K093086P72209j405220p02667J05133j484452j544342n67703p19795
$$ plain form
609.5 573860283 572935867 571735153 573545914 576067886 575794945 575210762 574361000 573259888 574271469
618.2 574271469 575536232 574811554 574763641 575442543 576928329 578479080 578526268 578973503 579413185 579765358
627.8 579765358 579748230 580452499 581913795 582359428 583822327 586209297 588141289 588843384 589778595
636.5 589778595 591721497 592465401 592046471 591108322 591136360 592093811 592939911 594272499 595971565
645.2 595971565 596893959 596708717 597135620 598433952 598986435 598374710 597775917 597811432 598357506 599839363
654.8 599839363 601625748 602450447 601564217 601069145 600673904 599058304 598790474 599160500 600145683
663.5 600145683 601857033 602772865 603781281 602061424 587537346 592228241 599214211 601994171
671.2 601994171 601589088 601665726 603321419 604333153 605574875 607645988 607803001 608406219 609976578
$$ packed form
609.5E73860283r24416j200714J810761K521972k72941n84183q49762j101112J011581
618.2E74271469J264763p24678m7913O78902J485786J550751M7188M47235M39682L52173
627.8E79765358j7128P04269J461296M45633J462899K386970J931992P02095R35211
636.5E89778595J942902P43904m18930r38149K8038R57451Q46100J332588J699066
645.2E95971565R22394j85242M26903J298332N52483o11725n98793L5515N46074J481857
654.8E99839363J786385Q24699q86230m95072l95241j615600k67830L70026R85183
663.5F00145683J711350R15832J008416j719857j4524078M690895O985970K779960
671.2F01994171m05083P6638J655693J011734J241722K071113J57013O03218J570359
$$ plain form
679.9 609976578 610106659 609875107 610407181 611595612 612093811 613167610 614564171 615527420 617008896
688.6 617008896 617368660 617726860 618719177 619067917 618878632 618965416 619500504 619726562 620889511 622767372
698.2 622767372 623743668 623245544 622714081 623789787 624920311 625117683 624962845 625288887 625741043
706.9 625741043 627146149 629249420 630008659 630499382 630932732 631203957 630805283 630486488 630938683
715.6 630938683 631149216 632687798 634042130 634353943 634944992 636334305 637066040 636068039 636466599
724.3 636466599 636441498 636465912 638676071 640087204 640690079 640939636 641932678 643733521 644137650 642825928
733.9 642825928 643116150 645344543 645762711 645314407 645457687 646515274 647626495 648591766 649052963
742.6 649052963 648625183 648840637 648248444 648606949 649779739 650679855 652045364 652300415 653111191
$$ packed form
679.9F09976578J30081k31552N32074J188431M98199J073799J396561R63249J481476
688.6F17008896L59764L58200R92317L48740j89285Q6784N35088K26058J162949J877861
698.2F22767372R76296m98124n31463J075706J130524J97372j54838L26042M52156
706.9F25741043J405106K103271P59239M90723M33350K71225l98674l18795M52195
715.6F30938683K10533J538582J354332L11813N91049J389313P31735r98001L98560
724.3F36466599k5101K4414K210159J411133O02875K49557R93042J800843M04129j311722
733.9F42825928K90222K228393M18168m48304J43280J057587J111221R65271M61197
742.6F49052963m27780K15454n92193L58505J172790R00116J365509K55051Q10776
$$ plain form
751.3 653111191 654288788 655265961 655337067 655326538 656190338 656606674 657568054 657333221 657826462 659694748
760.9 659694748 660785141 661647568 661448364 661879730 662886276 663102112 662508926 662733612 663404465
769.6 663404465 663631058 665245361 666498184 666687241 665843582 665384369 664732513 662926254 663358536
778.3 663358536 664129486 664349136 665060120 665463409 665775833 666524658 667164078 667463531 668414764 668652878
787.9 668652878 668926926 668226242 666925354 668279572 669315109 668870926 669073563 669988480 670098724
796.6 670098724 670124054 669510880 668375778 668432846 667665482 667091980 666003494 664976730 665606842 664848404
806.2 664848404 663892899 663750305 663051987 661565094 660304031 659263458 658022461 657065887 655964584
814.9 655964584 655153275 654813080 654664307 653981171 653498306 653750687 653988571 655134125 656154633
$$ packed form
751.3F53111191J177597R77173P1106j0529Q63800M16336R61380k34833M93241J868286
760.9F59694748J090393Q62427j99204M31366J006546K15836n93186K24686O70853
769.6F63404465K26593J614303J252823J89057q43659m59213o51856j806259M32282
778.3F63358536P70950K19650P10984M03289L12424P48825O39420K99453R51233K38114
787.9F68652878K74048p00684j300888J354218J035537m44183K02637R14917J10244
796.6F70098724K5330o13174j135102N7068p67364n73502j088486j026764O30112p58438
806.2F64848404r55505j42594o98318j486893j261063j040573j240997r56574j101303
814.9F55964584q11309l40195j48773o83136m82865K52381K37884J145554J020508
$$ plain form
823.6 656154633 657145386 659020157 660850296 662318802 664366226 667187424 668863144 670269241 671540833
832.3 671540833 672675629 674847412 677792892 681005478 682850189 683602905 684057236 685148468 686406937
841 686406937 687286224 688610992 689208527 689284210 690494385 692798462 694329987 695505066 696574936
849.6 696574936 697135315 697412872 697058411 697314682 698068237 699140244 700472336 703274307 705532074
858.3 705532074 705432358 706155319 706135483 706331329 707395630 708062439 708384171 707982941 708653564 709040070
868 709040070 708412781 707413483 707060928 706117249 703698196 702671509 702880478 702782516 701571426 701266098
877.6 701266098 701191635 700821838 701366653 701018906 699983673 698570175 698267136 698120728 697543335 697566528
887.3 697566528 697292786 697259140 696864777 696335297 694950790 694133759 694356918 693770065 693628693 693466110
$$ packed form
823.6F56154633R90753J874771J830139J468506K047424K821198J675720J406097J271592
832.3F71540833J134796K171783K945480L212586J844711P52716M54331J091232J258469
841F86406937Q79287J324768N97535P5683J210175K304077J531525J175079J069870
849.6F96574936N60379K77557l54461K56271P53555J072007J332092K801971K257767
858.3G05532074r9716P22961j9836J95846J064301O66809L21732m01230O70623L86506
868G09040070o27289r99298l52555r43679k419053j026687K08969r7962j211090l05328
877.6G01266098p4463l69797N44815l47747j035233j413498l03039j46408n77393K3193
887.3F97566528k73742l3646l94363n29480j384507q17031K23159n86853j41372j62583
$$ plain form
896.9 693466110 693429108 692743149 692331543 692384644 690967865 689662170 688906631 689173737 690231781 691845398
906.5 691845398 693489914 694799576 696246796 696849594 697325134 697886200 698137894 697317963 696585770
915.2 696585770 696041336 694954147 694477081 693278427 691904068 690809021 689744263 687968903 686251297
923.9 686251297 684957199 682177048 680394669 678645325 676334763 674357224 672081070 671078033
931.6 671078033 669784317 668288574 667382660 666515121 665907974 664795074 663706589 662793427 662076111
940.3 662076111 661557922 660955429 660200882 659230347 658187485 656683044 655894089 655662079 654442520
949 654442520 654377289 655641785 655778656 655371475 654748611 653885956 652697601 650504303 648890991 648048706
958.6 648048706 646842728 645331192 644001846 642794495 641415329 640090408 638732872 637751274 636605530
$$ packed form
896.9F93466110l7002o85959m11606N3101j416779j305695p55539K67106J058044J613617
906.5F91845398J644516J309662J447220O02798M75540N61066K51694q19931p32193
915.2F96585770n44434j087189m77066j198654j374359j095047j064758j775360j717606
923.9F86251297j294098k780151j782379j749344k310562j977539k276154j003037
931.6F71078033j293716j495743r05914q67539o07147j112900j088485r13162p17316
940.3F62076111n18189o02493p54547r70535j042862j504441p88955k32010j219559
949F54442520o5231J264496J36871m07181o22864q62655j188355k193298j613312q42285
958.6F48048706j205978j511536j329346j207351j379166j324921j357536r81598j145744
$$ plain form
967.3 636605530 634505081 632437859 631091194 629744682 628150673 626343269 624649887 623823738 621661720
976 621661720 618393288 615724449 612507744 609676208 607457504 604641533 600905380 597050591 593473930
984.7 593473930 590172043 587447510 584713898 581724968 578178406 574899445 572613564 570562897
992.4 570562897 568719292 567054939 564757309 562459602 560847092 559159279 556979370 554627647
1000.1 554627647 552787437 550723114 548823776 546993217 544782333 543433723 542050629 540584526
1007.8 540584526 539122620 537774773 536012192 534199524 533571739 532535973 531180725 529348602
1015.5 529348602 527938728 526402550 524116974 522759857 520859680 518659515 516877747 515878334
1023.2 515878334 514437370 512710609 511716347 510309563 509194870 507812958 507006721 506027679 504858932
$$ packed form
967.3F36605530k100449k067222j346665j346512j594009j807404j693382q26149k162018
976F21661720l268432k668839l216705k831536k218704k815971l736153l854789l576661
984.7E93473930l301887k724533k733612k988930l546562l278961k285881k050667
992.4E70562897j843605j664353k297630k297707j612510j687813k179909k351723
1000.1E54627647j840210k064323j899338j830559k210884j348610j383094j466103
1007.8E40584526j461906j347847j762581j812668o27785j035766j355248j832123
1015.5E29348602j409874j536178k285576j357117j900177k200165j781768r99413
1023.2E15878334j440964j726761r94262j406784j114693j381912q06237r79042j168747
$$ plain form
1031.9 504858932 504111938 502997665 503055611 503866272 505016403 505262642 506040535 507509575 508929253
1040.6 508929253 510440788 510824547 511570091 511641655 511987648 512051620 511632195 511269951 509789810 509812393
1050.2 509812393 508800812 506794624 505049553 503982735 503673096 501819649 500987816 500545807 500326424
1058.9 500326424 500734520 501420937 501956139 503194847 505749245 507068367 508855019 510316925 511975021
1067.6 511975021 514081917 515460815 516625290 517379684 518609810 518252678 517775269 517547379 517666855
1076.3 517666855 519084206 519361801 519581146 520444984 521730652 521527710 521304054 522315636 523620186
1085 523620186 524838257 524347000 524596863 525339203 527104454 528943405 529457588 530119705 530548859
1093.6 530548859 532164497 532842903 532793045 532520256 532853317 535352325 537083778 538149719 537972832
$$ packed form
1031.9E04858932p46994j114273N7946Q10661J150131K46239P77893J469040J419678
1040.6E08929253J511535L83759P45544P1564L45993O3972m19425l62244j480141K2583
1050.2E09812393j011581k006188j745071j066818l09639j853447q31833m42009k19383
1058.9E00326424M08096O86417N35202J238708K554398J319122J786652J461906J658096
1067.6E11975021K106896J378898J164475P54394J230126l57132m77409k27890J19476
1076.3E17666855J417351K77595K19345Q63838J285668k02942k23656J011582J304550
1085E23620186J218071m91257K49863P42340J765251J838951N14183O62117M29154
1093.6E30548859J615638O78406m9858k72789L33061K499008J731453J065941j76887
$$ plain form
1102.3 537972832 537954979 538882790 539864349 540551910 539818039 539747658 540438385 541608467 542966003 543761978
1112 543761978 543411903 543387375 545017815 546101494 546604042 546003265 545663948 546127319 546396408 547122192
1121.6 547122192 547127914 547730980 548743324 548723488 548422890 548381195 548574715 549650383 551721802 553846130
1131.2 553846130 556208191 557291718 558223877 560277672 561826820 562863693 564372902 566325073
1139 566325073 567659416 569081268 570153656 570901566 571874580 572519913 573181381 573375282 573087463
1147.6 573087463 572650108 572701721 572772484 572998466 573584976 573259087 573511734 573813820 573300133 572673302
1157.3 572673302 572079659 571447144 570512657 569961205 569383087 569659576 570178757 570969238 572934113
1166 572934113 574415817 576230278 577625809 579046135 581387634 583247528 585067940 587511559 590612869
$$ packed form
1102.3E37972832j7853R27811R81559O87561p33871p0381O90727J170082J357536P95975
1112E43761978l50075k4528J630440J083679N02548o00777l39317M63371K69089P25784
1121.6E47122192N722O03066J012344j9836l00598m1695J93520J075668K071419K124328
1131.2E53846130K362061J083527R32159K053795J549148J036873J509209J952171
1139E66325073J334343J421852J072388P47910R73014O45333O61468J93901k87819
1147.6E73087463m37355N1613P0763K25982N86510l25889K52647L02086n13687o26831
1157.3E72673302n93643o32515r34487n51452n78118K76489N19181P90481J964875
1166E72934113J481704J814461J395531J420326K341499J859894J820412K443619L101310
$$ plain form
1174.6 590612869 593337784 595548248 598146095 600438614 601797752 603087730 604490585 606450844
1182.4 606450844 608577538 610444984 612392921 613773193 615205460 616170998 617065697 618434258 618984909
1191 618984909 618917122 618847618 619441223 619849739 619719734 619639435 619434471 619207878 618618736 617744141
1200.7 617744141 617073479 616929703 616469193 615613823 615216293 614756165 614720116 614805298 614592552 614314041
1210.3 614314041 613736992 613583031 613118591 612343102 612069283 611979980 612048149 611875572 611624069 611190758
1220 611190758 610498695 609992599 609543076 608997345 608199921 607842293 607706833 607011108 606750031 607012978
1229.6 607012978 606912804 606504250 605662155 604903145 604635849 604056168 603418198 602978554 602892838 603227463
1239.3 603227463 603735352 604342461 604389915 604320984 603713799 602647858 602179604 601769218 601601410 601516190
$$ packed form
1174.6E90612869K724915K210464K597847K292519J359138J289978J402855J960259
1182.4F06450844K126694J867446J947937J380272J432267R65538Q94699J368561N50651
1191F18984909o7787o9504N93605M08516j30005q0299k04964k26593n89142q74595
1200.7F17744141o70662j43776m60510q55370l97530m60128l6049Q5182k12746k78511
1210.3F14314041n77049j53961m64440p75489k73819q9303O8169j72577k51503m33311
1220F11190758o92063n06096m49523n45731p97424l57628j35460o95725k61077K62947
1229.6F07012978j00174m08554q42095p59010k67296n79681o37970m39644q5716L34625
1239.3F03227463N07889O07109M7454o8931o07185j065941m68254m10386j67808q5220
$$ plain form
1248.9 601516190 601698685 602235565 602469826 602512665 602412148 602163887 601425781 600749893 600569534 600230713
1258.5 600230713 599961967 600505638 601597519 602416687 602892952 603060112 603211441 603291435 603371735 603382797
1268.2 603382797 603891258 605375786 606497421 607306061 608240318 609514046 610560875 610937157 611143951
1276.9 611143951 611348343 611901283 612392387 613434792 614866371 616292839 618153915 619352531 620052338
1285.5 620052338 620463943 620612602 621103020 621931534 622823410 623562317 624560623 625754433 626755753
1294.2 626755753 627520332 628197937 628623199 628400230 628020554 627690315 627431717 628251266 629051170 629010658
1303.9 629010658 629035797 628885002 628841896 628337860 627118225 626244583 625857201 625245323 623893929 623565826
1313.5 623565826 624456100 624531021 623815231 623700409 624263802 624362564 624326820 624454689 624828491 625655251
$$ packed form
1248.9F01516190J82495N36880K34261M2839j00517k48261p38106o75888j80359l38821
1258.5F00230713k68746N43671J091881Q19168M76265J67160J51329P9994Q0300J1062
1268.2F03382797N08461J484528J121635Q08640R34257J273728J046829L76282K06794
1276.9F11143951K04392N52940M91104J042405J431579J426468J861076J198616O99807
1285.5F20052338M11605J48659M90418Q28514Q91876P38907R98306J193810J001320
1294.2F26755753P64579O77605M25262k22969l79676l30239k58598Q19549P99904m0512
1303.9F29010658K5139j50795m3106n04036j219635q73642l87382o11878j351394l28103
1313.5F23565826Q90274P4921p15790j14822N63393R8762l5744J27869L73802Q26760
$$ plain form
1323.2 625655251 626159401 626576996 627449265 628097496 627926712 627341614 626777763 626364441 625594177 624555130
1332.8 624555130 624116402 624641838 625122871 624619141 624538307 624896011 624495811 624147301 624725609 625604744
1342.4 625604744 625848923 626131668 626840630 627776413 628856583 629528160 630111656 629920654 629419022
1351.1 629419022 628980408 628633347 628093300 626983299 627305565 628064423 627935600 627444649 627497215 627692757
1360.8 627692757 627296486 626592865 624713516 624704437 625098343 624803581 624676743 624339790 624684525 624830284
1370.4 624830284 624721260 624520493 623625221 622731972 622653389 623129883 623473663 623977547 624275169 624335098
1380.1 624335098 624200821 623940659 623261147 621739349 620757484 620086441 619601517 618827324 618624687
1388.7 618624687 618937302 618427620 617623329 616319885 615468979 613640938 610342941 609144096 608015747
$$ packed form
1323.2F25655251N04150M17595Q72269O48231j70784n85098n63851m13322p70264j039047
1332.8F24555130m38728N25436M81033n03730q0834L57704m00200l48510N78308Q79135
1342.4F25604744K44179K82745P08962R35783J080170O71577N83496j91002n01632
1351.1F29419022m38614l47061n40047j110001L22266P58858j28823m90951N2566J95542
1360.8F27692757l96271p03621j879349r079L93906k94762j26838l36953L44735J45759
1370.4F24830284j09024k00767q95272q93249p8583M76494L43780N03884K97622N9929
1380.1F24335098j34277k60162o79512j521798r81865o71043m84924p74193k02637
1388.7F18624687L12615n09682q04291j303444q50906j828041l297997j198845j128349
$$ plain form
1397.4 608015747 606914406 604580345 603701210 603734245 602346344 601057701 599676132 596918716 595041542
1406.1 595041542 594289436 593230743 592070656 591151962 590006790 588970184 588064346 587152939 585863686
1414.8 585863686 584506111 583305588 582328300 581921654 579218750 579763794 581464691 581815262 581379967
1423.4 581379967 580188179 581061935 581945114 581899071 582158127 581866417 582312431 583358383 584461174
1432.1 584461174 584709740 585294952 587409859 588496857 587463875 588566093 591127129 592637596 593834953
1440.8 593834953 595056152 595815125 597348099 598090057 599088974 599913635 599944458 600490646 602474327
1449.5 602474327 604572983 605118523 606215248 607826500 609623413 610469475 610128212 609990654 610440636
1458.2 610440636 614213409 616313782 619064064 620800591 622333946 624688759 624046936 626176376
$$ packed form
1397.4F08015747j101341k334061q79135L3035j387901j288643j381569k757416j877174
1406.1E95041542p52106j058693j160087r18694j145172j036606r05838r11407j289253
1414.8E85863686j357575j200523r77288m06646k702904N45044J700897L50571m35295
1423.4E81379967j191788Q73756Q83179m6043K59056k91710M46014J045952J102791
1432.1E84461174K48566N85212K114907J086998j032982J102218K561036J510467J197357
1440.8E93834953J221199P58973J532974P41958R98917Q24661L0823N46188J983681
1449.5F02474327K098656N45540J096725J611252J796913Q46062l41263j37558M49982
1458.2F10440636L772773K100373K750282J736527J533355K354813o41823K129440
$$ plain form
1465.9 626176376 628650055 630861588 632620735 634126053 636506844 636531792 635501328 638137741 643149338
1474.6 643149338 646259613 647080231 650064240 652660294 653854980 654626923 655460358 656309433 657272034
1483.2 657272034 658313522 659124146 660317612 660500946 660636292 662346420 660651703 659388199 660872650
1491.9 660872650 661518250 661163330 660650635 658990402 653331680 655495071 656212158 654011459 654464874
1500.6 654464874 653919907 653276291 652743225 652814636 651967010 644657364 639932365 643052979 645961685
1509.3 645961685 646384277 648179474 647620392 645646439 646067505 644789200 643707504 640996704 638962746
1518 638962746 641902390 643872147 641245193 637420921 639087143 642049103 644014511 642382965 642615509
1526.6 642615509 642653275 642095566 643582001 644478226 644650040 644416885 643348618 641380157 643151779
$$ packed form
1465.9F26176376K473679K211533J759147J505318K380791K4948j030464K636413N011597
1474.6F43149338L110275Q20618K984009K596054J194686P71943Q33435Q49075R62601
1483.2F57272034J041488Q10624J193466J83334J35346J710128j694717j263504J484451
1491.9F60872650O45600l54920n12695j660233n658722K163391P17087k200699M53415
1500.6F54464874n44967o43616n33066P1411q47626p309646m724999L120614K908706
1509.3F45961685M22592J795197n59082j973953M21066j278305j081696k710800k033958
1518F38962746K939644J969757k626954l824272J666222K961960J965408j631546K32544
1526.6F42615509L7766n57709J486435Q96225J71814k33155j068267j968461J771622
$$ plain form
1535.3 643151779 643835449 643675919 644535370 639490242 634082413 639030266 642269516 641252213 642136307
1544 642136307 642775803 641822128 643833237 644502487 645396576 645126801 643398056 644915085 646231461
1552.7 646231461 647278442 644603577 645352554 647631836 647347412 636805573 625385895 637374306
1560.4 637374306 641849136 644421234 644712601 644468079 642384262 640424500 640074081 638561745 637087135
1569.1 637087135 630195618 630761757 630626717 628490601 627474289 625948677 623668556 612612343
1576.8 612612343 613701973 612600594 609541893 606907463 603142815 600911674 597047119 594686470
1584.5 594686470 591182632 588032684 584932442 580526085 577295494 572118187 569577751 565991707
1592.2 565991707 563557396 560554733 556946640 555222969 551162949 549058609 545166397 542433586
$$ packed form
1535.3F43151779O83670j59530Q59451n045128n407829M947853L239250j017303Q84094
1544F42136307O39496r53675K011109O69250Q94089k69775j728745J517029J316376
1552.7F46231461J046981k674865P48977K279282k84424j0541839j1419678J1988411
1560.4F37374306M474830K572098K91367k44522k083817j959762l50419j512336j474610
1569.1F37087135o891517N66139j35040k136116j016312j525612k280121j1056213
1576.8F12612343J089630j101379l058701k634430l764648k231141l864555k360649
1584.5E94686470l503838l149948l100242m406357l230591n177307k540436l586044
1592.2E65991707k434311l002663l608093j723671m060020k104340l892212k732811
$$ plain form
1599.9 542433586 538854980 535884628 534384956 531106339 530326424 527743797 526686707 523704834
1607.6 523704834 521725235 519816017 516437988 516042862 513577499 513754044 512190628 512130203 511030960
1616.3 511030960 503523026 506572113 505944138 506401024 504959335 505105858 504414482 502020454 503663177
1625 503663177 503563156 505116425 503037910 503440094 504012794 503996315 504712982 504453621 506445351 506900864
1634.6 506900864 505730972 504220467 507200050 508687668 509583435 511431427 511523857 513806992 514235802
1643.3 514235802 516411171 518421440 517482719 519694977 519151688 522749329 524832802 528591881 531042404
1652 531042404 524046936 524498520 529733925 535100060 537018051 539367485 540870209 542927589 545208549
1660.7 545208549 547639618 550140152 550108376 554071732 556685562 559373856 562018661 563991280 565040207
$$ packed form
1599.9E42433586l578606k970352j499672l278617p79915k582627j057090k981873
1607.6E23704834j979599j909218l378029l95126k465363J76545j563416o0425j099243
1616.3E11030960p507934L049087o27975M56886j441689J46523o91376k394028J642723
1625E03663177j00021J553269k078515M02184N72700j6479P16667k59361J991730M55513
1634.6E06900864j169892j510505K979583J487618Q95767J847992R2430K283135M28810
1643.3E14235802K175369K010269r38721K212258n43289L597641K083473L759079K450523
1652E31042404o995468M51584N235405N366135J917991K349434J502724K057380K280960
1660.7E45208549K431069K500534l1776L963356K613830K688294K644805J972619J048927
$$ plain form
1669.4 565040207 566750565 571102295 572714043 576582832 580303955 581922607 582411652 585654564
1677.1 585654564 589912643 592285004 594854164 595933647 600144730 605232925 605617790 606827698
1684.8 606827698 609176674 614486046 617572784 619633942 622702065 625692787 630094872 633497086
1692.5 633497086 636799088 640710068 643223648 640517578 645435104 651065598 656340485 658062515
1700.2 658062515 653714294 660669174 665926666 669375687 670463486 671816559 673360367 675517273
1707.9 675517273 678355789 679677277 681046371 683328552 685761871 687892151 687352905 687583923 691458130
1716.6 691458130 693165894 687334290 690668259 693916245 695321350 696306763 697085800 698461761 700337143
1725.3 700337143 701891251 702343597 702628250 703732376 702415848 702004242 705272980 707952957 704349060
$$ packed form
1669.4E65040207J710358M351730J611748L868789L721123J618652M89045L242912
1677.1E85654564M258079K372361K569160J079483M211083N088195L84865J209908
1684.8F06827698K348976N309372L086738K061158L068123K990722M402085L402214
1692.5F33497086L302002L910980K513580k706070M917526N630494N274887J722030
1700.2F58062515m348221O954880N257492L449021J087799J353073J543808K156906
1707.9F75517273K838516J321488J369094K282181K433319K130280n39246K31018L874207
1716.6F91458130J707764n831604L333969L247986J405105R85413P79037J375961J875382
1725.3G00337143J554108M52346K84653J104126j316528m11606L268738K679977l603897
$$ plain form
1734 704349060 700919113 707167358 711498032 713152008 715257950 714719772 713237686 716715012 718928604
1742.7 718928604 719485321 721550522 725130157 727702026 729073868 730886154 732274933 735904617
1750.4 735904617 736075668 736773529 741670380 744643784 747605743 750244522 750296936 752055511 754041367
1759 754041367 755972137 758738861 756971664 756806793 760336533 762190094 763776932 765918350 767433014
1767.7 767433014 765801849 767858353 771369934 770148468 766830978 766647110 771005402 772939835
1775.4 772939835 772449188 774868469 775979233 777377930 778010254 777161636 778135223 779555588 780407104
1784.1 780407104 779430313 779864120 781484222 782648010 783512497 784775543 785425491 785354996 783804550
1792.8 783804550 783690567 786626129 787123718 786517563 787924194 789669189 790038300 789500504 791746140
$$ packed form
1734G04349060l429947O248245M330674J653976K105942n38178j482086L477326K213592
1742.7G18928604N56717K065201L579635K571869J371842J812286J388779L629684
1750.4G35904617J71051O97861M896851K973404K961959K638779N2414J758575J985856
1759G54041367J930770K766724j767197j64871L529740J853561J586838K141418J514664
1767.7G67433014j631165K056504L511581j221466l317490j83868M358292J934433
1775.4G72939835m90647K419281J110764J398697O32324q48618R73587J420365Q51516
1784.1G80407104r76791M33807J620102J163788Q64487J263046O49948p0495j550446
1792.8G83804550j13983K935562M97589o06155J406631J744995L69111n37796K245636
$$ plain form
1801.5 791746140 791800613 791684875 792737274 792641296 792927017 793118744 793823929 795108261 796051483 795350800
1811.1 795350800 796131210 797511139 797452545 797455673 797392654 798110962 797853851 798429337 799526215 799876480
1820.8 799876480 801239090 801179047 801778030 801773148 798786163 799544754 801422958 802713547 801996613
1829.4 801996613 799553299 801435776 803896332 804397430 804690628 804852982 804599762 804065018 803632736
1838.1 803632736 804671021 805060043 805772552 806392136 807511215 807714767 802991867 805103073 807003021
1846.8 807003021 806543274 806320877 806981659 807880859 808278503 809082413 808962784 809247513 809488144 809509583
1856.4 809509583 809863510 809327774 809327927 809327240 809700470 810047226 810739212 811129532 810927505 811270370 810637512
1867.1 810637512 810629349 809299164 808873215 810471725 811377869 812289581 812421341 812316437 812108459 812921524
$$ packed form
1801.5G91746140N4473j15738J052399r5978K85721J91727P05185J284332R43222p00683
1811.1G95350800P80410J379929n8594L128o3019P18308k57111N75486J096878L50265
1820.8G99876480J362610o0043N98983m882k986985P58591J878204J290589p16934
1829.4H01996613k443314J882477K460556N01098K93198J62354k53220n34744m32282
1838.1H03632736J038285L89022P12509O19584J119079K03552m722900K111206J899948
1846.8H07003021m59747k22397O60782Q99200L97644Q03910j19629K84729K40631K1439
1856.4H09509583L53927n35736J53o87L73230L46756O91986L90320k02027L42865o32858
1867.1H10637512q163j330185m25949J598510R06144R11712J31760j04904k07978Q13065
$$ plain form
1876.7 812921524 813256073 812651520 812469940 812319107 813124771 813133316 813086700 812920990 812893829 813625031
1886.3 813625031 813861084 814785919 814200134 812661133 813092575 813592987 813577881 813742294 813602982 813063049
1896 813063049 814294434 815239792 815489349 815064774 814276886 814029999 813770370 814265823 814291458 814755096
1905.6 814755096 815414963 815626907 815926666 815634995 815179977 814757309 815128021 814755554 814614563 815022202
1915.3 815022202 815646515 816797409 814941635 814653931 816058426 816634674 816650467 814668350 813767624
1923.9 813767624 814671783 815441208 815575027 816074982 816445923 816464005 816422348 816200180 816044998 815142441
1933.6 815142441 815019989 814989471 815106201 815747070 816148987 816850204 816865997 817171707 815610657 813356400
1943.2 813356400 814479828 815214996 815043716 814860687 815371780 815833511 816363983 816642075 816462555
$$ packed form
1876.7H12921524L34549o04553j81580j50833Q05664Q545m6616j65710k7161P31202
1886.3H13625031K36053R24835n85785j539001M31442N00412j5106J64413j39312n39933
1896H13063049J231385R45358K49557m24575p87888k46887k59629M95453K5635M63638
1905.6H14755096O59867K11944K99759k91671m55018m22668L70712l72467j40991M07639
1915.3H15022202O24313J150894j855774k87704J404495N76248J5793j982117r00726
1923.9H13767624R04159P69425J33819M99955L70941J8082m1657k22168j55182r02557
1933.6H15142441j22452l0518J16730O40869M01917P01217J5793L05710j561050k254257
1943.2H13356400J123428P35168j71280j83029N11093M61731N30472K78092j79520
$$ plain form
1951.9 816462555 816213226 815211792 814579391 814305115 814745331 815204468 815406799 815886383 815878372 815838242
1961.6 815838242 815301819 815026550 814646835 814162827 814035187 813679504 814331665 815174942 815966187 816313477
1971.2 816313477 816275787 815979004 815313950 814720001 814041290 814090424 814307175 814584274 814934921 815264511
1980.8 815264511 815419617 815224686 815190659 814438477 814100647 814173126 813996429 813787079 813828278 814831772
1990.5 814831772 814777451 813749847 813898849 814354935 814129028 813771439 813617706 813392181 813372955 813307114
2000.1 813307114 813842163 813973160 813582611 813512268 813305588 813193359 812748413 812679749 812643051 812491684
2009.8 812491684 812499924 812463150 812688828 812455444 812405472 812220535 811729050 811578064 811821136 812011642
2019.4 812011642 811831970 812245636 812444839 812228394 811908035 811627808 811264954 811063309 811472244 811421051
$$ packed form
1951.9H16462555k49329j001434o32401k74276M40216M59137K02331M79584q011m0130
1961.6H15838242n36423k75269l79715m84008j27640l55683O52161Q43277P91245L47290
1971.2H16313477l7690k96783o65054n93949o78711M9134K16751K77099L50647L29590
1980.8H15264511J55106j94931l4027p52182l37830P2479j76697k09350M1199J003494
1990.5H14831772n4321j027604J49002M56086k25907l57589j53733k25525j9226o5841
2000.1H13307114N35049J30997l90549p0343k06680j12229m44946o8664l6698j51367
2009.8H12491684Q240l6774K25678k33384m9972j84937m91485j50986K43072J90506
2019.4H12011642j79672M13666J99203k16445l20359k80227l62854k01645M08935n1193
$$ plain form
2029.1 811421051 811579361 811469345 811106110 810763779 810195847 810214920 810181808 810158615 809846420 809989471
2038.7 809989471 810344772 810162811 810144730 810025558 809892654 809109192 808863068 809104233 809365845 809672089
2048.4 809672089 809213028 809249268 809343033 809343567 808852310 808458786 808755798 808490906 808314362 808310547 808916245
2059 808916245 808922882 808338242 808377151 808437119 808694000 808418655 808159790 807944794 807821655 807996750 808083115
2069.6 808083115 808480453 808493881 808333282 808010254 807720261 807653732 807524567 807344055 807401733 807674179
2079.2 807674179 807374191 807408295 807646408 807735062 807324295 806774673 807045212 806911087 806857605 806971588
2088.9 806971588 806870956 806736145 806829300 807017822 806825790 806624069 805976181 805927277 806096039 805989609
2098.5 805989609 806392822 806954041 807197342 806632156 806566238 806362381 805966721 805699921 805206757 805450516
$$ packed form
2029.1H11421051J58310j10016l63235l42331n67932J9073l3112k3193l12195J43051
2038.7H09989471L55301j81961j8081j19172j32904p83462k46124K41165K61612L06244
2048.4H09672089m59061L6240R3765N34m91257l93524K97012k64892j76544l815O05698
2059H08916245O637n84640L8909N9968K56881k75345k58865k14996j23139J75095Q6365
2069.6H08083115L97338J3428j60599l23028k89993o6529j29165j80512N7678K72446
2079.2H07674179k99988L4104K38113Q8654m10767n49622K70539j34125n3482J13983
2088.9H06971588j00632j34811R3155J88522j92032k01721o47888m8904J68762j06430
2098.5H05989609M03213N61219K43301n65186o5918k03857l95660k66800m93164K43759
$$ plain form
2108.1 805450516 805413818 805464706 805576324 805618057 805842056 805910187 805600662 804802780 804949265 805006256
2117.8 805006256 804810181 804777451 804795761 805125580 805152512 805316696 804982605 804593964 804330215 804257202
2127.4 804257202 804457169 804550247 805000076 804720917 804517670 804468307 804530869 804793549 804495468 804444809
2137.1 804444809 804292450 804363327 804202576 803912354 803960800 804244003 804815140 804669113 804639587 804625473
2146.7 804625473 804642334 804712143 804565582 804791260 804969711 805015640 804565430 804112167 803838882 804036865
2156.4 804036865 804455948 804546585 804733810 804632721 804888687 804994888 804974518 804906311 804849167 805490570
2166 805490570 805511627 804958801 804396896 804403458 804431305 804732666 805342407 805207825 805257492 804984055 805105362
2176.6 805105362 805326385 805181046 805242844 805123444 805533829 805664749 805712967 805458908 805305634 805610657
$$ packed form
2108.1H05450516l6698N0888J11618M1733K23999O8131l09525p97882J46485N6991
2117.8H05006256j96075l2730J8310L29819K6932J64184l34091l88641k63749p3013
2127.4H04257202J99967R3078M49829k79159k03247m9363O2562K62680k98081n0659
2137.1H04444809j52359P0877j60751k90222M8446K83203N71137j46027k9526j4114
2146.7H04625473J6861O9809j46561K25678J78451M5929m50210m53263k73285J97983
2156.4H04036865M19083R0637J87225j01089K55966J06201k0370o8207n7144O41403
2166H05490570K1057n52826n61905O562K7847L01361O09741j34582M9667k73437J21307
2176.6H05105362K21023j45339O1798j19400M10385J30920M8218k54059j53274L05023
$$ plain form
2186.3 805610657 805320587 805300217 805221176 805390854 805670013 805840149 805990448 805936203 806050720 805952454
2195.9 805952454 805871582 805319290 805472488 806210785 806132355 805950317 805947800 806331329 806135559 805905762
2205.5 805905762 805997620 806022644 806149826 806079330 806291504 806419144 806595993 806760025 806750565 806396942
2215.2 806396942 806168823 806467438 806371689 806359177 806357880 806657944 806887894 806998291 807189178 807009125
2224.8 807009125 807093582 806456070 805944214 806021957 806303253 806613922 806611633 806914978 806565170 806515198
2234.5 806515198 806730728 806635590 806314697 805780869 806213150 806692123 807109146 807220535 807116165 806855240
2244.1 806855240 806367493 806494370 806563873 806683578 806493149 806427536 806231689 805792236 806093903 806259232
2253.8 806259232 806426697 806257248 805832977 805506668 805414200 805352097 805078659 805459061 806150284 806557083
$$ packed form
2186.3H05610657k90070k0370p9041J69678K79159J70136J50299n4245J14517r8266
2195.9H05952454q0872n52292J53198P38297p8430j82038k517L83529j95770k29797
2205.5H05905762R1858K5024J27182p0496K12174J27640J76849J64032r460l53623
2215.2H06396942k28119K98615r5749j2512j297L00064K29950J10397J90887j80053
2224.8H07009125Q4457o37512n11856P7743K81296L10669k289L03345l49808m9972
2234.5H06515198K15530r5138l20893n33828M32281M78973M17023J11389j04370k60925
2244.1H06855240m87747J26877O9503J19705j90429o5613j95847m39453L01667J65329
2253.8H06259232J67465j69449m24271l26309r2468o2103k73438L80402O91223M06799
$$ plain form
2263.4 806557083 806150589 806003647 805959015 805682831 805740891 805410690 805360260 805294266 805676651 806041336
2273 806041336 806079941 806336975 806095657 805903244 805134583 804900589 805216675 805227509 805553589 805958557
2282.7 805958557 806124573 805660477 805544205 805038300 804715118 804589081 804192810 804451141 804022446 804035339
2292.3 804035339 803967667 803812180 803778458 803418350 803327637 802173080 801443481 801135941 801560287 801728592
2302 801728592 800932465 800944824 800535507 800252304 799401245 798648071 797829971 797122879 797265549 796370392
2311.6 796370392 796378098 795889664 795679169 795280838 794099579 793856430 792216339 791052475 789728088
2320.3 789728088 789289322 789481506 788715286 788220825 787149734 787010422 786064529 785824890 784920731
2329 784920731 783342133 783510056 783416748 783644714 782560577 783132629 783490524 782733307 782357254 781597977
$$ packed form
2263.4H06557083m06494j46942m4632k76184N8060l30201n0430o5994L82385L64685
2273H06041336L8605K57034k41318j92413p68661k33994L16086J0834L26080M04968
2282.7H05958557J66016m64096j16272n05905l23182j26037l96271K58331m28695J2893
2292.3H04035339o7672j55487l3722l60108r0713j154557p29599l07540M24346J68305
2302H01728592p96127J2359m09317k83203q51059p53174q18100p07092J42670q95157
2311.6G96370392P706m88434k10495l98331j181259k43149j640091j163864j324387
2320.3G89728088m38766J92184p66220m94461j071091j39312r45893k39639r04159
2329G84920731j578598J67923r3308K27966j084137N72052L57895p57217l76053p59277
$$ plain form
2338.6 781597977 781550446 780077591 780848236 781284714 780605469 781219482 782174530 784092712 786101303
2347.3 786101303 789447098 790140915 787997513 785914307 783016510 781247635 780538788 778213806 775635910
2356 775635910 773852234 771313171 770235367 771634827 773188019 774416122 773369675 772510300 773095856
2364.7 773095856 774983673 776000366 775988922 776926193 778640137 781417389 782952576 784624710 786541367
2373.3 786541367 787798920 788919601 789603195 790502396 791575546 793070526 794285736 795614777 797095566
2382 797095566 797946548 798372955 798560333 799155960 799198380 798888168 799066544 799161072 799226456 799388962
2391.7 799388962 799424210 799209671 799057693 798589935 798162079 797939835 797857742 797951965 797915573 798058701
2401.3 798058701 797822113 797835312 797783585 797498322 797263565 796593094 796765213 797059479 797135544 796757431
$$ packed form
2338.6G81597977m7531j472855P70645M36478o79245O14013R55048J918182K008591
2347.3G86101303L345795O93817k143402k083206k897797j768875p08847k324982k577896
2356G75635910j783676k539063j077804J399460J553192J228103j046447q59375N85556
2364.7G73095856J887817J016693j1444R37271J713944K777252J535187J672134J916657
2373.3G86541367J257553J120681O83594Q99201J073150J494980J215210J329041J480789
2382G97095566Q50982M26407J87378N95627M2420l10212J78376R4528O5384J62506
2391.7G99388962L5248k14539j51978m67758m27856k22244q2093R4223l6392J43128
2401.3G98058701k36588J3199n1727k85263k34757o70471J72119K94266P6065l78113
$$ plain form
2410.9 796757431 796240387 796372604 796356049 796563110 796152115 795752945 795485611 794924545 794820328 794680176
2420.6 794680176 795130615 795424042 795268860 794954605 794526291 794351501 794003448 793908234 793802872 793480988
2430.2 793480988 793001862 792902908 793054504 792857208 792869949 792756500 792434082 791857224 791413498 791463470
2439.9 791463470 791636047 791629944 791581802 791639786 791195908 790800095 790429382 790192642 790284271 790224152 790057297
2450.5 790057297 789567566 789411240 789306564 789028473 788746872 788592300 788810272 788660049 788356094 788028488
2460.1 788028488 787866058 787861557 787859955 787593155 787134628 787178802 787084351 786825409 786501541 786488953 786303253
2470.7 786303253 785584183 785255280 785237198 785390930 784778519 784436264 784480743 784165192 784162369 783615189
2480.4 783615189 783310394 783197708 782818527 782538223 782396851 782260590 781912842 782027359 781897507 781692581
$$ packed form
2410.9G96757431n17044J32217j6555K07061m10995l99170k67334n61066j04217j40152
2420.6G94680176M50439K93427j55182l14255m28314j74790l48053r5214j05362l21884
2430.2G93480988m79126r8954J51596j97296J2741j13449l22418n76858m43726M9972
2439.9G91463470J72577o103m8142N7984m43878l95813l70713k36740R1629o0119j66855
2450.5G90057297m89731j56326j04676k78091k81601j54572K17972j50223l03955l27606
2460.1G88028488j62430m501j602k66800m58527M4174r4451k58942l23868j2588j85700
2470.7G86303253p19070l28903j8082J53732o12411l42255M4479l15551k823n47180
2480.4G83615189l04795j12686l79181k80304j41372j36261l47748J14517j29852k04926
$$ plain form
2490 781692581 781330566 780882187 780695953 780232468 780006866 779603119 779505234 779308701 778933411 778807831
2499.7 778807831 778598251 778700638 777900085 777205048 777080841 776835480 776746521 776408386 776303101 776292419
2509.3 776292419 776223526 775846329 775735703 775785294 775288544 774866943 774452362 774232788 773899994 773886871
2519 773886871 774212189 774354172 774256592 773534698 772723694 771866455 771713715 771772003 771312561 771160812
2528.6 771160812 771328201 771437378 771114426 771155548 771051102 770592575 770243301 769578934 769172821 769104004
2538.2 769104004 769088211 768846893 768948593 769084320 768867187 768636093 768064804 767691040 767179108 766916809
2547.9 766916809 767034225 766634445 766087875 766160431 766670761 766580048 766143723 765174103 764424667 764323273
2557.5 764323273 764091187 764159698 764014664 763924942 763883514 763543320 763306580 763464737 763380432 762530136
$$ packed form
2490G81692581l62015m48379j86234m63485k25602m03747r7885j96533l75290j25580
2499.7G78807831k09580J02387q00553o95037j24207k45361q8959l38135j05285j0682
2509.3G76292419o8893l77197j10626M9591m96750m21601m14581k19574l32794j3123
2519G73886871L25318J41983r7580p21894q11004q57239j52740N8288m59442j51749
2528.6G71160812J67389J09177l22952M1122j04446m58527l49274o64367m06113o8817
2538.2G69104004j5793k41318J01700J35727k17133k31094n71289l73764n11932k62299
2547.9G66916809J17416l99780n46570P2556N10330r0713m36325r69620p49436j01394
2557.5G64323273k32086O8511j45034q9722m1428l40194k36740J58157q4305q50296
$$ plain form
2567.2 762530136 762185211 761694794 761102219 760887070 760740738 761242676 761728439 761977921 761580811 760504837
2576.8 760504837 759649200 759441452 759286499 758714981 758490295 758560486 758699799 758383484 758159332 758378677
2586.5 758378677 758104630 757648392 757128525 756698990 756559906 756685944 756588058 756581421 756689529 756129227
2596.1 756129227 755848541 755509415 754955826 754601059 754008789 753276443 752841644 753009415 753072662 753164215
2605.7 753164215 753256989 752914734 752459106 752349625 752247849 751397171 750556335 750117416 750312729 750489349
2615.4 750489349 750327759 750412445 749886551 749129486 748595047 748319244 748011627 747639771 747641296 747412415
2625 747412415 747165680 747073517 747143097 746760712 745616455 745026932 745132828 744772720 744144592 743897705
2634.7 743897705 743588943 743839569 743986206 743666687 743552704 743060455 742680588 741810760 740937729 740730438
$$ packed form
2567.2G62530136l44925m90417n92575k15149j46332N01938M85763K49482l97110j075974
2576.8G60504837q55637k07748j54953n71518k24686P0191J39313l16315k24152K19345
2586.5G58378677k74047m56238n19867m29535j39084J26038r7886o637J08108n60302
2596.1G56129227k80686l39126n53589l54767n92270p32346m34799J67771O3247R1553
2605.7G53164215R2774l42255m55628j09481j01776q50678q40836m38919J95313J76620
2615.4G50489349j61590Q4686n25894p57065n34439k75803l07617l71856J525k28881
2625G47412415k46735r2163O9580l82385j144257n89523J05896l60108o28128k46887
2634.7G43897705l08762K50626J46637l19519j13983m92249l79867q69828q73031k07291
$$ plain form
2644.3 740730438 740473480 740551834 740635223 740624390 740386505 740071945 739738998 739232788 738673096 738356552
2654 738356552 738411865 737753677 737344437 737487335 737205048 736972580 736907043 736645813 736034851 735737991
2663.6 735737991 735320740 734801025 734645615 734549866 734553604 734362564 734203033 733842850 733530350 733380737
2673.3 733380737 733128052 732913589 732474670 732410583 732510834 732389755 731906204 731489258 731484375 731351852
2682.9 731351852 731294403 730862045 730454025 730009842 729307022 729066086 728766632 728599319 728609772 728544769
2692.5 728544769 728518906 728323441 727682343 727128220 726973953 726464767 726213226 726416321 726539993 726423492
2702.2 726423492 726209793 726207657 725662308 724945068 724775162 724579544 724135208 723703461 723517227 723610458
2711.8 723610458 723704910 723827972 723953094 723724060 723025818 721999130 721895142 722225494 721855469 721787796
$$ packed form
2644.3G40730438k56958P8354Q3389j0833k37885l14560l32947n06210n59692l16544
2654G38356552N5313o58188m09240J42898k82287k32468o5537k61230o10962k96860
2663.6G35737991m17251n19715j55410r5749L738j91040j59531l60183l12500j49613
2673.3G33380737k52685k14463m38919o4087J00251j21079m83551m16946m883j32523
2682.9G31351852n7449m32358m08020m44183p02820k40936k99454j67313J0453o5003
2692.5G28544769k5863j95465o41098n54123j54267n09186k51541K03095J23672j16501
2702.2G26423492k13699k136n45349p17240j69906j95618m44336m31747j86234R3231
2711.8G23610458R4452J23062J25122k29034o98242j026688j03988L30352l70025o7673
$$ plain form
2721.5 721787796 721867371 721647491 721320724 721336975 721236038 720460358 719567032 718888779 719110870 719389420
2731.1 719389420 719428635 719714050 719767303 719725571 719661484 719691238 719254303 718705292 718526688 718433456 718237076
2741.7 718237076 717565994 717124252 717036438 717485886 717996674 717994690 717861710 717479095 717160034 716459808
2751.4 716459808 715962601 716037827 715913925 716081314 716275482 715829620 715455246 715576706 715279236 715117645
2761 715117645 714981918 714376068 714273224 714217377 713972397 713716354 713762207 713801804 713591385 713192749
2770.7 713192749 712420425 712321548 712162094 711662674 711456833 711326904 711280518 711055222 711016846 710933075
2780.3 710933075 710720215 710173035 709301224 708717041 708325272 708131409 707964630 708140030 708032990 707705841
2789.9 707705841 708003387 707905731 706950531 706040268 705864716 705496902 704890289 704581528 704455490 704311142
$$ packed form
2721.5G21787796P9575k19880l26767J6251j00937p75680q93326o78253K22091K78550
2731.1G19389420L9215K85415N3253m1732o4087K9754m36935n49011j78604r3232j96380
2741.7G18237076o71082m41742q7814M49448N10788j984j32980l82615l19061p00226
2751.4G16459808m97207P5226j23902J67389J94168m45862l74374J21460k97470j61591
2761G15117645j35727o05850j02844n5847k44980k56043M5853L9597k10419l98636
2770.7G13192749p72324r8877j59454m99420k05841j29929m6386k25296l8376q3771
2780.3G10933075k12860n47180q71811n84183l91769j93863j66779J75400j07040l27149
2789.9G07705841K97546r7656r55200r10263j75552l67814o06613l08761j26038j44348
$$ plain form
2799.6 704311142 703798370 703267975 702348099 701667023 701454239 700818100 700213318 700180435 700444794 700173874
2809.2 700173874 699940643 699458542 698575745 698157883 697639389 696884232 695874405 695335999 695109100
2817.9 695109100 694672165 694441681 694086227 693911591 693495178 692692719 691909714 690970917 690208969 689733582
2827.6 689733582 689250336 688414383 687740631 687528076 687072525 686213760 685508347 684799728 683670883
2836.2 683670883 682595749 681905212 681303635 680129547 678652344 677348404 676235123 675206528 673645706
2844.9 673645706 671903458 670447998 668861237 666957932 665133057 663486328 662629623 662505646 661591949
2853.6 661591949 660803909 660857544 661040726 660913086 660388107 660409546 660470886 660319214 660317383 660221100 660353012
2864.2 660353012 660362854 659617691 658748627 658445358 657728043 656547699 655983734 655919724 655846024 655718307
$$ packed form
2799.6G04311142n12772n30395r19876o81076k12784o36139o04782l2883K64359k70920
2809.2G00173874k33231m82101q82797m17862n18494p55157j009827n38406k26899
2817.9F95109100m36935k30484l55454j74636m16413q02459p83005r38797p61948m75387
2827.6F89733582m83246q35953o73752k12555m55551q58765p05413p08619j128845
2836.2F83670883j075134o90537o01577j174088j477203j303940j113281j028595j560822
2844.9F73645706j742248j455460j586761j903305j824875j646729q56705j23977r13697
2853.6F61591949p88040N3635J83182j27640n24979K1439O1340j51672j831r6283J31912
2864.2F60353012R842p45163q69064l03269p17315j180344n63965o4010p3700j27717
$$ plain form
2873.8 655718307 655489502 654759064 654023056 653687592 653320770 652761612 652279205 651822662 651484451 651355972
2883.5 651355972 650874939 650689087 650245590 649105682 648292542 647434311 646654053 645650787 644650192
2892.2 644650192 644157181 643779984 643461456 642524872 641524811 641336365 641190414 640271530 639235268
2900.8 639235268 638360748 637791176 637786827 637445679 637048149 636265068 635247726 634677200 634242210 633582573
2910.5 633582573 632169952 631318893 630453262 629236412 628335533 627112465 626192055 625048103 623997612
2919.2 623997612 622911072 621654129 620896606 619887428 619588509 619465714 619071732 619596214 620458260
2927.8 620458260 620970688 621135521 621003571 620958748 621037521 620689011 621082306 622062225 622591400 623093758
2937.5 623093758 623556557 624584122 625779572 626383133 626628990 626884079 627005920 627212296 628203087
$$ packed form
2873.8F55718307k28805p30438p36008l35464l66822n59158m82407m56543l38211j28479
2883.5F51355972m81033j85852m43497j139908q13140q58231p80258j003266j000595
2892.2F44650192m93011l77197l18528r36584j000061j88446j45951r18884j036262
2900.8F39235268q74520n69572m349l41148l97530p83081j017342n70526m34990o59637
2910.5F33582573j412621q51059q65631j216850r00879j223068r20410j143952j050491
2919.2F23997612j086540j256943p57523j009178k98919j22795l93982N24482Q62046
2927.8F20458260N12428J64833j31950m4823P8773l48510L93295R79919N29175N02358
2937.5F23093758M62799J027565J195450O03561K45857K55089J21841K06376R90791
$$ plain form
2946.2 628203087 628965149 629593239 630183945 630023766 630083237 630701485 630934753 630611649 630293541 630039062
2955.8 630039062 630361977 630854797 630985565 631253624 631776390 632452812 632756157 633070831 633481522 634013557
2965.5 634013557 634358139 634603081 635579681 635938911 636354141 637375107 637869606 638264809 638821487
2974.1 638821487 639193687 639090385 639623718 640583954 640969009 641309967 641872711 642247620 642381744 642994385
2983.8 642994385 643143311 642697372 642655640 642637177 642542191 642701874 643055573 643264694 643872147 644189301
2993.4 644189301 643735580 643598328 643546982 643203201 642793579 642346954 641527710 641350403 641745377 641642838
3003.1 641642838 641449127 640928345 640452499 640036926 639649315 639528160 639116211 638386307 637866096 637890472
3012.7 637890472 637698021 637829018 637837029 636837387 636097641 635399704 634679947 634172859 634051666 634275818
$$ packed form
2946.2F28203087P62062O28090N90706j60179N9471O18248K33268l23104l18108k54479
2955.8F30039062L22915M92820J30768K68059N22766O76422L03345L14674M10691N32035
2965.5F34013557L44582K44942R76600L59230M15230J020966M94499L95203N56678
2974.1F38821487L72200j03302N33333R60236L85055L40958N62744L74909J34124O12641
2983.8F42994385J48926m45939m1732j8463r4986J59683L53699K09121O07453L17154
2993.4F44189301m53721j37252n1346l43781m09622m46625q19244j77307L94974j02539
3003.1F41642838j93711n20782m75846m15573l87611j21155m11949p29904n20211K4376
3012.7F37890472j92451J30997Q011r99642p39746o97937p19757n07088j21193K24152
$$ plain form
3022.4 634275818 633955612 633337364 632986526 632510300 631753311 631027565 630066261 629645996 629343300 628599052
3032 628599052 628680000 628701401 628134422 627432785 627119789 626712799 625641136 625295219 625165024 624246140
3041.6 624246140 623481865 623376160 622951050 622202759 621571922 620831451 620315628 619688492 618975525 618321800
3051.3 618321800 617856979 617085304 616113968 616223030 616051178 615230331 614428902 613614731 612940788 612258377
3060.9 612258377 612047882 611873894 611409721 610678215 610481682 610798798 610089760 609320412 609122810 608778648
3070.6 608778648 607879181 606578293 605665779 605516167 605701904 605515137 605176277 604702721 604119682
3079.2 604119682 603692741 603282318 602751617 601953964 601118088 600585442 600340347 599939117 599699364 599669609
3088.9 599669609 599150810 598205948 597659111 597364883 596211929 595566597 595530510 594889374 594581985 594485016
$$ packed form
3022.4F34275818l20206o18248l50838m76226p56989p25746r61304m20265l02696p44248
3032F28599052Q0948K1401n66979p01637l12996m06990j071663l45917j30195r18884
3041.6F24246140p64275j05705m25110p48291o30837p40471n15823o27136p12967o53725
3051.3F18321800m64821p71675r71336J09062j71852q20847q01429q14171o73943o82411
3060.9F12258377k10495j73988m64173p31506j96533L17116p09038p69348j97602l44162
3070.6F08778648q99467j300888r12514j49612J85737j86767l38860m73556n83039
3079.2F04119682m26941m10423n30701p97653q35876n32646k45095m01230k39753k9755
3088.9E99669609n18799r44862n46837k94228j152954o45332l6087o41136l07389r6969
$$ plain form
3098.5 594485016 594238052 593638687 593102646 592690926 591777000 591130219 590553665 589847794 589397926 588777657
3108.2 588777657 588329391 588356781 587812195 586992989 586738358 586538620 585918465 584723473 584087296 583819923
3117.8 583819923 583321266 583100739 582544022 581691589 580636864 580006981 579933434 579636078 578984108 577983093
3127.5 577983093 577445030 577186584 576704788 575923462 575319405 574924278 574283295 574051514 573378334 572572365
3137.1 572572365 571921005 570701828 569943199 569615059 569454880 569234619 568785286 568216324 567580414
3145.8 567580414 566979179 566198387 565567856 564765663 564104080 563808517 563186264 562619286 562139969 561633720
3155.4 561633720 561103210 560316162 559135818 558315887 558508110 557972832 556418533 555811882 555605125
3164.1 555605125 554882164 554167328 553493614 553003120 552561913 552260246 551815491 550941315 550233498 549320602
$$ packed form
3098.5E94485016k46964n99365n36041m11720r13926o46781n76554p05871m49868o20269
3108.2E88777657m48266K7390n44586q19206k54631j99738o20155j194992o36177k67373
3117.8E83819923m98657k20527n56717q52433j054725o29883p3547k97356o51970j001015
3127.5E77983093n38063k58446m81796p81326o04057l95127o40983k31781o73180q05969
3137.1E72572365o51360j219177p58629l28140j60179k20261m49333n68962o35910
3145.8E67580414o01235p80792o30531q02193o61583k95563o22253n66978m79317n06249
3155.4E61633720n30510p87048j180344q19931J92223n35278j554299o06651k06757
3164.1E55605125p22961p14836o73714m90494m41207l01667m44755q74176p07817r12896
$$ plain form
3173.8 549320602 548739243 548689079 548314400 547379036 546385574 546078453 545545654 544787483 543975639 543251686
3183.4 543251686 542823410 542131119 542032547 541834641 540998650 540117874 539159508 538500443 537924652 537502060
3193 537502060 537104263 536412201 535585747 534959641 534365692 533494377 532789154 532225494 531726608 531055603
3202.7 531055603 530466766 529502602 528412170 528617592 528528214 527829475 527325745 526817322 526465340 525813637
3212.3 525813637 525229759 524545364 523533516 522987900 522952118 522565041 521257706 520351028 520484962
3221 520484962 520167732 519200974 518277893 517308655 517180290 517228889 515937500 514726753 514471245 514651527
3230.7 514651527 514421844 513663673 512908859 512071915 511382675 510972900 510570946 509759445 509144020 508888969
3240.3 508888969 508224945 507506866 507000961 507041931 507084084 506111107 505164108 504700775 504219780 504065704
$$ packed form
3173.8E49320602n81359n0164l74679r35364r93462l07121n32799p58171q11844p23953
3183.4E43251686m28276o92291r8572j97906q35991q80776r58366o59065n75791m22592
3193E37502060l97797o92062q26454o26106n93949q71315p05223n63660m98886o71005
3202.7E31055603n88837r64164j090432K05422q9378o98739n03730n08423l51982o51703
3212.3E25813637n83878o84395j011848n45616l5782l87077j307335r06678J33934
3221E20484962l17230r66758r23081r69238j28365M8599j291389j210747k55508J80282
3230.7E14651527k29683p58171p54814q36944o89240m09775m01954q11501o15425k55051
3240.3E08888969o64024p18079n05905M0970M2153r72977r46999m63333m80995j54076
$$ plain form
3249.9 504065704 503636131 502803345 502636604 502248306 501584206 501032867 500377960 500028152 499478836 499066315
3259.6 499066315 498873863 498530769 497855530 497121735 496880684 496421356 496323204 496328163 495661087 495162544
3269.2 495162544 495037766 494887161 494432907 494139671 493728638 493153496 492403259 491412201 491048431 490619125
3278.9 490619125 490177650 489965782 489579544 489356537 489102936 488746529 488260269 487932587 488032875 487852745
3288.5 487852745 487371063 487259636 486932831 486257324 486026115 485564842 484482269 483860512 484080811
3297.2 484080811 483721275 482596092 481890755 481597366 481620636 481648178 481351242 480847931 480613327 480717506
3306.8 480717506 480515785 479518661 477951622 477056236 476565170 476100082 475911713 475608444 475134354
3315.5 475134354 474340668 473914986 473717422 473142929 472429504 471724510 471422768 471143990 470664597 470147324
$$ packed form
3249.9E04065704m29573q32786j66741l88298o64100n51339o54907l49808n49316m12521
3259.6D99066315j92452l43094o75239p33795k41051m59328r8152M959o67076m98543
3269.2D95162544j24778j50605m54254k93236m11033n75142p50237r91058l63770m29306
3278.9D90619125m41475k11868l86238k23007k53601l56407m86260l27682J00288j80130
3288.5D87852745m81682j11427l26805o75507k31209m61273j082573o21757K20299
3297.2D84080811l59536j125183p05337k93389K3270K7542k96936n03311k34604J04179
3306.8D80717506k01721r97124j567039q95386m91066m65088j88369l03269m74090
3315.5D75134354p93686m25682j97564n74493p13425p04994l01742k78778m79393n17273
$$ plain form
3325.2 470147324 469791870 469023590 467759819 467008400 466245842 465234642 464251137 463624458 463060608
3333.8 463060608 462512970 462374306 461709099 460791855 460104942 459637032 458480835 456931419 456672020
3342.5 456672020 456419258 455815659 455077782 454017792 453436890 453492508 453437538 452407532 451110840
3351.2 451110840 449890633 449269829 449167786 448517189 447845421 447407761 446995010 446090469 445301743
3359.9 445301743 445064545 444558830 443880615 443267822 442971764 442724533 442615929 442194557 441361084 440625534
3369.5 440625534 439303894 438239517 437585449 437289467 437410660 436812019 435985909 435424347 435474281
3378.2 435474281 435593758 434797974 434157066 433828125 433245087 432980957 432634735 431900024 431561623 431373596
3387.8 431373596 431297493 431151581 430925941 431081505 430607796 429696388 429567719 429772415 429235802 428421745
$$ packed form
3325.2D70147324l55454p68280j263771p51419p62558j011200r83505o26679n63850
3333.8D63060608n47638j38664o65207r17244o86913m67910j156197j549416k59399
3342.5D56672020k52762o03599p37877j059990n80902N5618n4970j030006j296692
3351.2D51110840j220207o20804j02043o50597o71768m37660m12751r04541p88726
3359.9D45301743k37198n05715o78215o12793k96058k47231j08604m21372q33473p35550
3369.5D40625534j321640j064377o54068k95982J21193n98641q26110n61562M9934
3378.2D35474281J19477p95784o40908l28941n83038k64130l46222p34711l38401j88027
3387.8D31373596p6103j45912k25640J55564m73709r11408j28669K04696n36613q14057
$$ plain form
3397.5 428421745 428341103 428400040 428141785 427381859 427066956 427305145 426853485 426420250 426422729 426341743
3407.1 426341743 425952530 425811768 426018524 425902748 425747795 425247955 424692345 424916916 425158920 424798203
3416.8 424798203 424550514 425061951 425374794 425198441 424958458 424518623 424816895 425545311 425402107 425013847
3426.4 425013847 425214958 425358543 425271683 425739136 426186256 426301346 426578674 426681519 426714897 426942215
3436.1 426942215 427057762 426792183 426940002 427404480 427721176 428417664 428772812 429220200 429681473 429657288
3445.7 429657288 430022545 430068703 430383987 431099968 431798935 432423019 432584457 433199158 433753090 434033012
3455.3 434033012 434522400 434879570 435340538 435961952 436420708 436417084 437007370 438249359 438906288 439348373
3465 439348373 440300636 441205444 441202507 441467285 442124748 442634964 443495140 444137688 444672356 445498581
$$ packed form
3397.5D28421745q0642N8937k58255p59926l14903K38189m51660m33235K479q0986
3407.1D26341743l89213j40762K06756j15776j54953m99840n55610K24571K42004l60717
3416.8D24798203k47689N11437L12843j76353k39983m39835K98272P28416j43204l88260
3426.4D25013847K01111J43585q6860M67453M47120J15090K77328J02845L3378K27318
3436.1D26942215J15547k65579J47819M64478L16696O96488L55148M47388M61273k4185
3445.7D29657288L65257M6158L15284P15981O98967O24084J61438O14701N53932K79922
3455.3D34033012M89388L57170M60968O21414M58756l624N90286J241989O56929M42085
3465D39348373R52263R04808k937K64778O57463N10216Q60176O42548N34668Q26225
$$ plain form
3474.6 445498581 446001282 446531372 447395821 447874870 448373184 449250908 450181961 450832214 451148186 452426758
3484.3 452426758 453765182 453956375 454052925 454312553 454877739 455914154 456861267 457383995 458017731
3493 458017731 458707657 459313583 460376167 461332512 461613693 462320824 463872681 465046120 465875015
3501.6 465875015 466167831 465951385 466406021 467528381 469363632 470727806 471500969 471510239 471872902
3510.3 471872902 473746567 474741402 475771027 476906013 477106247 477132225 477700958 479070244 479989052
3519 479989052 480928078 481694412 482453423 483289833 483486328 484559441 486189041 487860069 488198166
3527.7 488198166 488059006 489432793 491125336 492247200 493008003 493963547 495271263 497132912 497436638
3536.4 497436638 497819595 499740677 500321846 501051140 502535744 504230423 505428505 506822281 507982483
$$ packed form
3474.6D45498581N02701N30090Q64449M79049M98314Q77724R31053O50253L15972J278572
3484.3D52426758J338424J91193R6550K59628N65186J036415R47113N22728O33736
3493D58017731O89926O05926J062584R56345K81181P07131J551857J173439Q28895
3501.6D65875015K92816k16446M54636J122360J835251J364174P73163R270L62663
3510.3D71872902J873665R94835J029625J134986K00234K5978N68733J369286R18808
3519D79989052R39026P66334P59011Q36410J96495J073113J629600J671028L38097
3527.7D88198166j39160J373787J692543J121864P60803R55544J307716J861649L03726
3536.4D97436638L82957J921082N81169P29294J484604J694679J198082J393776J160202
$$ plain form
3545 507982483 508401871 510173378 510377769 511781349 513650322 515112419 516861610 516115646 517736511
3553.7 517736511 519321785 520535431 522213440 522443085 524232559 525886917 526807976 527700081 529847527
3562.4 529847527 531232719 532103386 535704689 535193977 534787979 536267014 537241516 540567207 541948128
3571.1 541948128 543341179 545472565 547494965 549007454 550487633 552039452 552493896 554986267
3578.8 554986267 557515678 558699570 559644165 560765915 562499771 564205322 567525940 568358688 567115059
3587.5 567115059 568646240 569989243 573658943 576476021 578657532 579399986 579928703 583175392 583540955
3596.1 583540955 585536423 588074570 588842812 591870956 593141060 594352226 596965675 598935585
3603.9 598935585 601269875 603966904 605773964 606002121 610459747 611196823 610350685 616403542 617827415
$$ packed form
3545E07982483M19388J771507K04391J403580J868973J462097J749191p45964J620865
3553.7E17736511J585274J213646J678009K29645J789474J654358R21059Q92105K147446
3562.4E29847527J385192Q70667L601303n10712m05998J479035R74502L325691J380921
3571.1E41948128J393051K131386K022400J512489J480179J551819M54444K492371
3578.8E54986267K529411J183892R44595J121750J733856J705551L320618Q32748j243629
3587.5E67115059J531181J343003L669700K817078K181511P42454N28717L246689L65563
3596.1E83540955J995468K538147P68242L028144J270104J211166K613449J969910
3603.9E98935585K334290K697029J807060K28157M457626P37076q46138O052857J423873
$$ plain form
3612.5 617827415 616717720 619685860 619258423 623520622 628068466 628753090 630700531 630660439 631651306
3621.2 631651306 634711571 636917114 638549576 641444244 643890228 646213684 652331161 653340149
3628.9 653340149 645037308 648044891 652794266 658120804 660127869 659929733 662735214 665979156
3636.6 665979156 668487167 669794159 671556549 673920364 676449509 677598572 678281174 681280289
3644.4 681280289 685484467 690905991 689714584 686053085 690234909 690416107 690280838 690971909 695431061
3653 695431061 699756241 704341125 708887787 701866989 703913574 709254837 710886993 711869659 712239838
3661.7 712239838 714390106 715371933 716616745 718295593 719486389 723646469 725468445 724702835 723754959
3670.4 723754959 719413605 723403931 730525894 737218475 733153305 718203125 723156586 730372238
$$ packed form
3612.5F17827415j109695K968140m27437M262199M547844O84624J947441m0092R90867
3621.2F31651306L060265K205543J632462K894668K445984K323456O117477J008988
3628.9F53340149q302841L007583M749375N326538K007065j98136K805481L243942
3636.6F65979156K508011J306992J762390K363815K529145J149063O82602K999115
3644.4F81280289M204178N421524j191407l661499M181824J81198j35269O91071M459152
3653F95431061M325180M584884M546662p020798K046585N341263J632156R82666L70179
3661.7G12239838K150268R81827J244812J678848J190796M160080J821976p65610r47876
3670.4G23754959m341354L990326P121963O692581m065170j4950180M953461P215652
$$ plain form
3678.1 730372238 734800873 733636475 734445953 737294006 739113693 739672775 739071732 739650803 743405991
3686.8 743405991 748665924 741626358 739017487 745115585 740299911 741332626 745972672 746612701
3694.5 746612701 747740402 747627106 747835236 749219360 749558334 751980438 754243317 749662094 748720551
3703.2 748720551 752678452 753616943 753734589 754282990 756955109 760079346 753484268 757055206 759691467
3711.9 759691467 748298645 753580322 757564621 757742767 758481369 759765930 760173416 757384109 758741608
3720.5 758741608 763568649 759504166 755573196 760035095 760633011 759464569 756910629 758121262
3728.3 758121262 761686554 762059021 766349945 764178085 759379044 768116684 768641052 757440567
3736 757440567 757683792 761684723 763175964 765515976 767297668 763405838 766161880 774507523 762442322
$$ packed form
3678.1G30372238M428635j164398Q09478K848053J819687N59082o01043N79071L755188
3686.8G43405991N259933p039566k608871O098098m815674J032715M640046O40029
3694.5G46612701J127701j13296K08130J384124L38974K422104K262879m581223r41543
3703.2G48720551L957901R38491J17646N48401K672119L124237o595078L570938K636261
3711.9G59691467j1392822N281677L984299J78146P38602J284561M07486k789307J357499
3720.5G58741608M827041m064483l930970M461899N97916j168442k553940J210633
3728.3G58121262L565292L72467M290924k171860m799041Q737640N24368j1200485
3736G57440567K43225M000931J491241K340012J781692l891830K756042Q345643j2065201
$$ plain form
3744.7 762442322 753085251 763209381 768564301 773918304 770783081 761657104 770312424 763825150
3752.4 763825150 759900360 766223602 769873428 771801682 767471695 769990158 773872147 766207809
3760.1 766207809 765818024 769762192 770865021 771886444 774480667 770242996 766864548 770632248
3767.8 770632248 774361572 773420334 766477432 769040909 771805344 772118301 773073959 773184509 774200363
3776.5 774200363 774570312 776354904 775157928 768538132 770676498 772682648 773674545 775197296 772585220
3785.2 772585220 771462479 772770309 774012909 775176620 774651489 773370819 773040771 773669128 774085312
3793.8 774085312 775680084 777677765 773176575 770342484 773147049 776598816 781141510 774656372
3801.5 774656372 765951767 769996567 772939758 776789551 780172882 772028503 769767075 774427414
$$ packed form
3744.7G62442322r357071J0124130N354920N354003l135223r125977Q655320o487274
3752.4G63825150l924790O323242L649826J928254m329987K518463L881989p664338
3760.1G66207809l89785L944168J102829J021423K594223m237671l378448L767700
3767.8G70632248L729324r41238o942902K563477K764435L12957R55658J10550J015854
3776.5G74200363L69949J784592j196976o619796K138366K006150R91897J522751k612076
3785.2G72585220j122741J307830J242600J163711n25131j280670l30048O28357M16184
3793.8G74085312J594772J997681m501190k834091K804565L451767M542694o485138
3801.5G74656372q704605M044800K943191L849793L383331q144379k261428M660339
$$ plain form
3809.3 774427414 776519470 776452637 776338654 776398010 777845612 782244644 780365829 768850327 773356781
3817.9 773356781 778502121 780919342 778523407 763201447 768121490 774435959 776456757 778486633
3825.7 778486633 777556229 773650055 774417114 776356659 779085999 779116440 771576462 775167007 780909042
3834.3 780909042 774197922 774940491 782768784 773805771 770141525 776782837 772278061 773238831 779138870
3843 779138870 776862259 774687576 777195663 777581177 777363205 778315735 776617355 777842407 782124329
3851.7 782124329 777862091 775767212 762813339 768074036 776475677 775121613 774707489 777472763
3859.4 777472763 779780502 780584641 774970856 775726013 780175323 773894196 771739502 776429672 780600281
3868.1 780600281 783879852 775000458 768528748 773401337 779605026 781692123 772918472 774035034
$$ packed form
3809.3G74427414K092056o6833j13983N9356J447602M399032j878815j1515502M506454
3817.9G73356781N145340K417221k395935j5321960M920043O314469K020798K029876
3825.7G78486633r30404l906174P67059J939545K729340L0441p539978L590545N742035
3834.3G80909042o711120P42569P828293q963013l664246O641312m504776R60770N900039
3843G79138870k276611k174683K508087L85514k17972R52530j698380J225052M281922
3851.7G82124329m262238k094879j2953873N260697Q401641j354064m14124K765274
3859.4G77472763K307739Q04139n613785P55157M449310o281127k154694M690170M170609
3868.1G80600281L279571q879394o471710M872589O203689K087097q773651J116562
$$ plain form
3875.8 774035034 777199173 777662201 779700928 782552643 777215958 771768570 776579971 777141953 778737946
3884.5 778737946 781289291 770122681 773497696 777782974 778461227 781530151 779774933 772633514
3892.2 772633514 774835815 778447800 777386703 777542648 777080154 777931519 778996429 773686066 778789139
3900.9 778789139 778729401 774478836 779089203 775756912 773262787 773598557 775069504 777215271 777663345
3909.6 777663345 778629761 778516388 777658997 777310410 777375870 778609238 780512543 777168045 773721848
3918.2 773721848 776932373 776589432 774473038 776467667 777585983 778716736 777286606 775457535
3926 775457535 776952438 777326431 776975021 775650406 775766525 777686386 775694733 775503693 777293015
3934.6 777293015 777050095 777105179 777001648 776858597 776912308 776721039 777862396 777889328 775150681 775503998
$$ packed form
3875.8G74035034L164139M63028K038727K851715n336685n447388M811401N61982J595993
3884.5G78737946K551345j1166610L375015M285278O78253L068924j755218p141419
3892.2G72633514K202301L611985j061097J55945m62494Q51365J064910n310363N103073
3900.9G78789139n9738m250565M610367l332291k494125L35770J470947K145767M48074
3909.6G77663345R66416j13373q57391l48587O5460J233368J903305l344498l446197
3918.2G73721848L210525l42941k116394J994629J118316J130753j430130j829071
3926G75457535J494903L73993l51410j324615J16119J919861j991653j91040J789322
3934.6G77293015k42920N5084j03531j43051N3711j91269J141357K6932k738647L53317
$$ plain form
3944.3 775503998 776767502 777639465 778584442 777264862 777652969 776804199 774827194 776747589 776559448
3953 776559448 775700073 776362076 776847076 777177734 776582718 776838913 776374969 775859375 776041565 775475616
3962.6 775475616 775804138 776372833 776791229 777114716 776959991 776385269 776178741 776782532 777062531 776433182
3972.2 776433182 776048813 776815720 776749268 775983582 776134186 776936722 777144394 776768799 777155991 777182693
3981.9 777182693 776700363 776283646 776353302 776891174 776697235 776262817 776165009 776475143 776448288 776427689
3991.5 776427689 776828156 777085037 776796875 775968246 776333466 776690674 776623993 776951141 776622925
4000.2 776622925
$$ packed form
3944.3G75503998J263504Q71963R44977j319580L88107q48770j977005J920395j88141
3953G76559448q59375O62003M85000L30658n95016K56195m63944n15594J82190n65949
3962.6G75475616L28522N68695M18396L23487j54725n74722k06528O03791K79999o29349
3972.2G76433182l84369P66907o6452p65686J50604Q02536K07672l75595L87192K6702
3981.9G77182693m82330m16717O9656N37872j93939m34418r7808L10134k6855k0599
3991.5G76427689M00467K56881k88162q28629L65220L57208o6681L27148l28216
4000.2G76622925
##END=$$ End of the data block
