##TITLE=$$ Begin of the data block
##JCAMP-DX=5.00 $$ ACD/SpecManager v 10.08
##SPECTROMETER/DATA SYSTEM=Varian
##DATE=08 Jan 2013 15:01:58
##DATA TYPE=INFRARED SPECTRUM
##DATA CLASS=XYDATA
##ORIGIN=
##OWNER=
##NPOINTS=3735
##FIRSTX=399.26403809
##LASTX=4000.35498047
##MAXX=4000.35498047
##MINX=399.26403809
##MAXY=70.82581329
##MINY=35.52727509
##XFACTOR=1.0000000000
##YFACTOR=0.000000100000000
##FIRSTY=52.74733734
##DELTAX=0.96440572
##XUNITS=1/CM
##YUNITS=TRANSMITTANCE
##XYDATA=(X++(Y..Y))
399.3E27473373m064598k961311J226807k112160N874138J208954l419915j327247
407E21898041j682244K556191m624977k46926P016640r63440k580871n70374k96707
415.7E20505333J088028K021904k665215n027847P337875P732354K679176n693779
423.4E27977829n483131o707497p62444M265633K991409K090798K48184o57158n06706
432.1E23456917K810859O14853n63011L298531k459259n143891k983131R82780N553360
440.7E25568008K131424k395706k551994m441071n78270N976220L064498j521110J239395
449.4E26491394k42004m293023N28145K439461j572113K139702J723175k895699p242660
458.1E17076378R28268N256119k038727n905761N10673L732719Q86612J731377L191071
$$ y = [527473373, 523408775, 520447464, 521674271, 519562111, 525436249, 526645203, 523225288, 521898041, 520215797, 522771988, 518147011, 517900085, 524916725, 523953285, 521372414, 520802040, 520505333, 521593361, 523615265, 520950050, 515922203, 523260078, 530992432, 533671608, 527977829, 522494698, 515787201, 515024757, 519290390, 522281799, 524372597, 524620781, 523963623, 523456917, 526267776, 526882629, 526319618, 529618149, 527158890, 522014999, 519031868, 520014648, 525568008, 527699432, 525303726, 522751732, 518310661, 517732391, 523708611, 526773109, 525251999, 526491394, 526249390, 521956367, 522484512, 524923973, 523351860, 525491562, 527214737, 524319038, 517076378, 518004646, 523260765, 521222038, 515316277, 515826950, 519559669, 520446281, 522177658, 525368729]
466.8E25368729q30040J688690k956009o256294K062721K061272l652001K21176M371605
475.5E22079849j079674n059852Q78334R95674J144638K285957j33247l415871l712501
484.1E13983307J441460R03778j237870l30505k99721j405220K7390R23614k254638
492.8E11751595k247963p42608J588059K03628j118316M281807L483505Q88367J101989
501.5E19190063j740074k968216o01310J262436j3237K18086M43382j988144l388061
510.2E10414925j695137J435928P47642K78550O21299R05342Q71506k754516k435112
518.9E08390427j137886l15400R02176J366654l35961k015304J189995J694679m41170
527.5E09298210j55411r59396j665688j338577J59874k47383q0795N70488Q82225J284637
$$ y = [525368729, 524538689, 526227379, 523271370, 517015076, 519077797, 521139069, 517487068, 517708244, 522079849, 521000175, 515940323, 516818657, 517814331, 518958969, 521244926, 521111679, 517695808, 513983307, 515424767, 516328545, 515090675, 514760170, 514460449, 513055229, 513082619, 514006233, 511751595, 509503632, 508761024, 510349083, 510552711, 509434395, 513716202, 517199707, 518088074, 519190063, 517449989, 514481773, 513880463, 515142899, 515129662, 515347748, 515791130, 513802986, 510414925, 508719788, 510155716, 510903358, 511181908, 511803207, 512708549, 513580055, 510825539, 508390427, 507252541, 506937141, 507839317, 509205971, 508870010, 506854706, 508044701, 509739380, 509298210, 509142799, 508183403, 506517715, 505179138, 505339012, 505091629, 505010834, 505581322, 506463547, 507748184]
537.2E07748184j007652j085243M3258m50630j298179j255036J186142J019669j081848
545.9E03818665l67280L30201j309471j222535J161347R77020p28302j047668m16527
554.5E01195450n2338k80113j660309j213531n1690j106262J028366L189316L29781
563.2E01378670j359139O98891O40449j179046j344719m1199J377869k76451m73366
571.9D99421959Q37898O95839J600762N14106j992683j505432L44543O74439j76010
580.6E00415421m59595j334458k07748J395798J010513p6790r19418j64528J135750
589.3E00794945R68094j091576j041527O05049K78473J94359r54J12801O83861P53402
598.9E02256927j20697k39105K08740o67190p14417l51028M70543O19659m94995q60557
$$ y = [507748184, 506740532, 505655289, 505698547, 505247917, 503949738, 502694702, 503880844, 504900513, 503818665, 503451385, 503781586, 502472115, 501249580, 502410927, 503387947, 502659645, 501611977, 501195450, 501143112, 500862999, 499202690, 497989159, 497937469, 496831207, 497859573, 501048889, 501378670, 500019531, 500718422, 501358871, 500179825, 498835106, 498793907, 500171776, 499895325, 499421959, 500259857, 500955696, 502556458, 503070564, 501077881, 499572449, 499916992, 500591431, 500415421, 499955826, 498621368, 498413620, 499809418, 500819931, 500743141, 499823723, 499659195, 500794945, 501763039, 500671463, 499629936, 500234985, 500513458, 500707817, 500706863, 500819664, 501503525, 502256927, 502136230, 501897125, 502105865, 501438675, 500724258, 500373230, 500843773, 501463432, 500968437, 500107880]
608.5E00107880j242524l90548J37062o92291m57459N53894L59116j141663m87671
617.2D96745796J655655R29108j281166r75800M64134N70565J080055K019424J752091
625.9E02959862P96890J35231J7166O26717K14462L58162J516075J60790r5711J744919
635.5E08434563J191520N58815J074334P12928Q72231R13620J71776P32689O69479
644.2E15331955M12674J313705N01137k00424K25182J117897J359176k39715n7907
652.9E19763680N51185M4212l81813n68542o0501k06871k56539m93240l66669o50406
662.5E17374496k82135J538773J472435J857338L173218J997795l003426j768226K5215
671.2E22385483n6915o06995L49769M53454N86242Q16078J174355J398735J487274
$$ y = [500107880, 498865356, 498474808, 498611870, 497919579, 497462120, 498016014, 498375130, 497233467, 496745796, 498401451, 499330559, 498049393, 497073593, 497537727, 498108292, 499188347, 501207771, 502959862, 503756752, 503891983, 503909149, 504535866, 504750328, 505108490, 506624565, 506785355, 506689644, 508434563, 509626083, 510184898, 511259232, 511972160, 512844391, 513758011, 513929787, 514662476, 515331955, 515744629, 517058334, 517559471, 517359047, 517584229, 518702126, 520061302, 519821587, 519763680, 520314865, 520359077, 519977264, 519408722, 519348221, 519141350, 518884811, 518391571, 518024902, 517374496, 517092361, 518631134, 520103569, 521960907, 525134125, 527131920, 524128494, 522360268, 522385483, 522328568, 521721573, 522071342, 522524796, 523111038, 523927116, 525101471, 526500206, 527987480]
679.9E27987480M68712J39198O91490l00674J47667O17142j09597N46647J767959J045304
689.6E33001328n26085p42951K17400K131881J414032p86781q93669j33438N14603
698.2E34196320M32968O46209O95572L46871j3199j84975K61955O58837J004066N39742
707.9E38584366K21329j41030k14805P88231R26361O56509J17073L60146Q15010j89057
717.5E41924133n64117O70967J045876n19333K23617J795387P84989j54038M3602Q89206
727.2E46140289J625252N97611p706M39377l7384Q26530R08699K33689Q04023m8218
736.8E51482162M42811J132621O25420J05858j13297M96865j08033K76871P28722R51385
746.5E56021385J339760J30997k22168L82232J298867P90558J34010R8686Q087O13175
$$ y = [527987480, 528456192, 528595390, 529286880, 528986206, 529133873, 529751015, 529641418, 530188065, 531956024, 533001328, 532475243, 531732292, 531949692, 534081573, 535495605, 534708824, 533815155, 533681717, 534196320, 534629288, 535275497, 535971069, 536317940, 536304741, 536119766, 536381721, 537040558, 538044624, 538584366, 538805695, 538664665, 538449860, 539238091, 540164452, 540820961, 540938034, 541298180, 542113190, 541924133, 541360016, 542030983, 543076859, 542557526, 542781143, 544576530, 545361519, 545207481, 545251083, 546140289, 547765541, 548363152, 548355446, 548794823, 548757439, 549583969, 550492668, 550726357, 551530380, 551482162, 551924973, 553057594, 553683014, 553788872, 553675575, 554172440, 554064407, 554341278, 555070000, 556021385, 557361145, 557492142, 557269974, 557652206, 558951073, 559741631, 559875641, 559974327, 559982414, 560595589]
756.1E60595589M81186J504325J500664N71785Q48351N2795j84746O35949J140632
764.8E67146530P2632n87921J7433l1662J65901M17099k29873m56505M22096J90544
774.4E67126274J99013J009216O93512R7733r38149l00331J437798M60929n45921L67737
784.1E69607811M92477J89743k28843j73645J117630O73256l13149m30717K37884P23725
793.7E71896172P5950k4261l62091M28505R58404m3449k17667l41530j045418j449432
803.4E69875183o04057l26576p75452k046623j850014o3591j04103O1569k98805j204224
813E62663307j602707m27818K91443q71697l76014l07846J15547O76040R27201J088562
822.6E62176018J85241R74846R93500J145363K185707K216072J332245J202507K558136
$$ y = [560595589, 561076775, 562581100, 564081764, 564653549, 565501900, 565554695, 565369949, 566005898, 567146530, 567219162, 566631241, 566648674, 566617012, 566782913, 567200012, 566970139, 566513634, 566935730, 567126274, 567325287, 568334503, 569028015, 569125748, 568187599, 567887268, 569325066, 569785995, 569240074, 569607811, 570100288, 570290031, 570061188, 569887543, 571005173, 571678429, 571365280, 570934563, 571172447, 571896172, 571972122, 571947861, 571585770, 572014275, 572972679, 572929230, 572711563, 572370033, 571324615, 569875183, 569271126, 568944550, 568169098, 566122475, 564272461, 564208870, 564104767, 564166336, 563867531, 562663307, 561060600, 560632782, 560924225, 560052528, 559676514, 559368668, 559484215, 560160255, 561087456, 562176018, 562361259, 563336105, 564329605, 565474968, 567660675, 569876747, 571208992, 572411499, 574969635]
831.3E74969635J472473J017571J089859J853408K857895J462250J770172J370926
839E87864189P80373P80906P08275M80805N21011J732979J216926Q24547O84777J349296
848.7E96944084M52423P7477J732750L40004K31666K20833R07440J721382J030236
857.4F03658295Q03604Q44803J862106K06261M09774N33448k01989J152077k79922
866F08988457p44400l44849l35007r05342m64630k14157j295395P019J3542n56564
875.7F04148674j166954q46062m8561l68728N8021p20291r62181o56166O01082Q30497
885.3F00869331j129951j375427o81992P4425n36118q66813l28789l77770l79676q6022
895E95181198l09181l80249O41136k66800q33626r15794r29909K53258J95427J22070
$$ y = [574969635, 576442108, 577459679, 578549538, 580402946, 583260841, 584723091, 586493263, 587864189, 588644562, 589425468, 590133743, 590614548, 591135559, 592868538, 594085464, 594910011, 595594788, 596944084, 597396507, 597473984, 599206734, 599546738, 599778404, 599999237, 600906677, 602628059, 603658295, 604461899, 605306702, 607168808, 607375069, 607784843, 608318291, 608116302, 609268379, 608988457, 608244057, 607899208, 607564201, 606658859, 606194229, 605980072, 604684677, 604691696, 604705238, 604148674, 602981720, 602135658, 602087097, 601718369, 601776390, 601056099, 600093918, 599437752, 600038834, 600869331, 599739380, 598363953, 597681961, 597756386, 597220268, 596353455, 596024666, 595646896, 595267220, 595181198, 594872017, 594491768, 595132904, 594866104, 594032478, 593116684, 592186775, 592440033, 592635460, 592757530]
904.6E92757530r270J232224K280884J813774J700096N93529p29180j299514J10054
913.3E98450127Q06541R2011q27637p49245J07041p17278p92465k014351k435303j308632
922.9E90610809j536712j389199j482391j309624j274872j257171j670876j545257
930.7E79144707r20868j513596j314010j350251j152000r13391p66640m19044o56319
939.3E70138588m35562p42798r77860j008071o20804r31359j529693q18482o37283
948E62436676r3613j61018o0997M20j005021n37338J3237j13830j202164j727295j678085
958.6E55870972k406273k397919j582489k31819j16005o94580o72226j049080j394119
967.3E45326462j033020m52843j323814k094879j709939j569976r46923p68547j790809
$$ y = [592757530, 592748260, 593980484, 596261368, 598075142, 599775238, 600368767, 599639587, 598340073, 598450127, 599256668, 599348679, 598521042, 597771797, 597878838, 597161560, 596369095, 594354744, 591919441, 590610809, 589074097, 587684898, 586202507, 584892883, 583618011, 582360840, 580689964, 579144707, 578223839, 576710243, 575396233, 574045982, 572893982, 571980591, 571213951, 570794907, 570138588, 569703026, 568960228, 567982368, 566974297, 566353493, 565422134, 563892441, 563073959, 562436676, 562343063, 562182045, 562121048, 562121468, 561116447, 560579109, 560592346, 560478516, 559276352, 557549057, 555870972, 553464699, 551066780, 549484291, 549252472, 549136467, 548441887, 547769661, 546720581, 545326462, 544293442, 543840599, 542516785, 540421906, 538711967, 537141991, 536195068, 535426521, 533635712]
976E33635712j775208j155548j249542j674690k373162k654686k851028l214874l503304
984.7E13183670l405914k519303k184791k378617j834983j656304k580566k468796
992.4D94154396j534576j220589j685524k669487k733002j661911j457557j849709
1000.1D79342041j358032j458588j405945j380844j538086j349258j631355j277810
1007.8D67942123j766891j471062j129112j728783j342201j889725j331901p49588
1015.5D56532860q67653j097450j678505j805611j880989j157150j658173j676330
1023.2D44710999j573029j488838o91796j091804o20880r29299j013374o56815j00135
1031.9D36545029O6375j010589n28336q39M60968Q19855J747741J450882J075478J583900
$$ y = [533635712, 531860504, 530704956, 529455414, 527780724, 525407562, 522752876, 519901848, 516686974, 513183670, 509777756, 507258453, 505073662, 502695045, 500860062, 499203758, 496623192, 494154396, 492619820, 491399231, 489713707, 487044220, 484311218, 482649307, 481191750, 479342041, 477984009, 476525421, 475119476, 473738632, 472200546, 470851288, 469219933, 467942123, 466175232, 464704170, 463575058, 461846275, 460504074, 458614349, 457282448, 456532860, 455665207, 454567757, 452889252, 451083641, 449202652, 448045502, 446387329, 444710999, 443137970, 441649132, 440957336, 439865532, 439244652, 438315353, 437301979, 436645164, 436545029, 436611404, 435600815, 435072479, 435071640, 435532608, 436352463, 438100204, 439551086, 440626564, 442210464]
1041.6D42210464P17774J235657O65054j51482j06010P9727j20697p35474j99775j006775
1051.2D42588463n05791l71857n10788j64871q04901k57034p14340j32904n10712k5368
1060.9D38589897J768456J114387J008034R99565J892891J455955M54903M63410J405868
1069.5D49153366J517525j65215J58692l97110N3253P53670M80957O22291n32074q3046
1079.2D51562309N42755O74820l5209J51977P53670N01785R88999K40516Q89359R36432
1088.8D57207413K58445P78466J260643J269264N18799N68504J76277O92826J55334
1097.5D62885971k6131J586800Q93936J08376J7624J246948J115913M70886P16095
1106.2D69016418N00107J135140K45857L27377O6719n65109O46477J065101J366959
$$ y = [442210464, 442928238, 444163895, 444828949, 444677467, 444571457, 444651184, 444530487, 443795013, 443595238, 442588463, 442082672, 441710815, 441200027, 441035156, 440230255, 439973221, 439258881, 439125977, 438615265, 438589897, 440358353, 441472740, 442480774, 443480339, 445373230, 446829185, 447284088, 447747498, 449153366, 450670891, 450505676, 450664368, 450267258, 450320511, 451074181, 451555138, 452177429, 451645355, 451562309, 452105064, 452779884, 452744675, 452896652, 453650322, 454152107, 455141106, 455381622, 456270981, 457207413, 457465858, 458244324, 459504967, 460774231, 461293030, 461861534, 462037811, 462730637, 462885971, 462859840, 464446640, 465340576, 465448952, 465466576, 466713524, 467829437, 468300323, 469016418, 469516525, 470651665, 470897522, 471224899, 471291618, 470726509, 471372986, 472438087, 473805046]
1114.9D73805046M78668j11351K34375P22390P99102N38826N10903k95983J14746J81427
1124.5D76978149k00882J30806O65017J078376R35898J575012J372300J179008J336250
1133.2D85049934J525574J929207J340866J051369R14306J213456J495361J034927
1140.9D95555000O94199L82996O66847R54818O65017N09796P47070M81720K75269O28128
1150.5E01560860l10440p52640p6599l02201k0065L82004o12831r54018P6447L1700
1160.2D99022217n79376j60447J75019k137O62537J426621J048317Q40683J459960
1168.9E03893394K081910J994667K216987K388993K213668J955071J918678K305336
1176.6E20968704J582108J228790J766090J854058K047920J939507J919059K210770
$$ y = [473805046, 474283714, 474172363, 474406738, 475129128, 475928230, 476467056, 476977959, 476681976, 476796722, 476978149, 476777267, 476908073, 477573090, 478651466, 479587364, 481162376, 482534676, 483713684, 485049934, 486575508, 488504715, 489845581, 490896950, 491811256, 493024712, 494520073, 495555000, 496249199, 496632195, 497299042, 498253860, 498918877, 499428673, 500175743, 500657463, 500932732, 501560860, 501250420, 500497780, 500421181, 500118980, 500098915, 500480919, 499868088, 498914070, 498990517, 499022217, 498442841, 498282394, 498457413, 498455276, 499117813, 500544434, 501592751, 502433434, 503893394, 505975304, 507969971, 510186958, 512575951, 514789619, 516744690, 518663368, 520968704, 522550812, 523779602, 525545692, 527399750, 529447670, 531387177, 533306236, 535517006]
1184.3E35517006J484222J008721J136970J131935Q09746j22413K07633N86815K52839
1193E42013474j06469k71873m19350r59892k73285j66817p62901p59659p86781r68743
1202.6E36537704j244964p14836l53279r07708j073074j99165o7787l68500n25513
1211.3E31082878r26704l19672k79999l82385l96385q41217k57073j77154n62096j00365
1220.9E26839828L33367j46561m15802k55089n79109p39631q53577p88231n98793k75307
1230.6E22521095l60832q12111k24418L48892j23902n42030p3891J53046j06430k16904
1240.2E20562515k64587j57776k96516k34108J29127K75993m9018m14925l97339n07431
1249.9E18645935l88031j98212m2152k01149k88239n8555k82250r5214L01284L47443
$$ y = [535517006, 537001228, 538009949, 539146919, 540278854, 541088600, 540966187, 541173820, 541760635, 542013474, 541907005, 541635132, 541215782, 540255890, 539982605, 539815788, 539052887, 538293228, 537506447, 536537704, 535292740, 534577904, 534224625, 533316917, 532243843, 532044678, 531976891, 531608391, 531082878, 530156174, 529836502, 529556503, 529174118, 528777733, 527936516, 527679443, 527502289, 526940193, 526839828, 527173195, 527026634, 526610832, 526355743, 525776634, 525037003, 524183426, 523395195, 522796402, 522521095, 522160263, 521348152, 521123734, 521472626, 521348724, 520806694, 520732803, 520885849, 520779419, 520562515, 520297928, 520140152, 519843636, 519609528, 519738655, 520014648, 519965630, 519550705, 519153366, 518645935, 518257904, 518059692, 518017540, 517816391, 517528152, 517469597, 517187347, 517092133, 517393417, 517740860]
1259.5E17740860j41525k12212M67224J31340q3656K97584N29404M50134K78244J057930
1269.2E20515327J120568J60751K24381Q65097Q96911O84510M27589K90184R37653
1277.8E26122971J031417N59731M25987O99425J071930Q93707R40628P07169O75888
1286.5E33128853O93893M27437M60739K02828N32493N41916N38025M76265K92053M88854
1296.2E37783356K66189L30544n8289k6512r0675j84822J9416m83856M0474J46637
1305.8E37742462k27318j20163k3613l38363o62575n19753q06884l34435l41110o21223
1315.4E33747025l34092l21960L74184N99975M23775Q56094Q86917K75421J30654J38550
1325.1E36776543j8959Q6479J14021L61176l11127o49223k48642l5401Q2474l07426
$$ y = [517740860, 517599335, 517387123, 517854347, 517985687, 517902031, 518199615, 518729019, 519179153, 519457397, 520515327, 521635895, 521796646, 522021027, 522886124, 523783035, 524467545, 524895134, 525185318, 526122971, 527154388, 527714119, 528140106, 528839531, 529911461, 530805168, 531745796, 532452965, 533128853, 533822746, 534250183, 534710922, 534913750, 535446243, 535988159, 536526184, 537002449, 537294502, 537783356, 538049545, 538380089, 538321800, 538295288, 538204613, 538019791, 538039207, 537555351, 537595825, 537742462, 537515144, 537394981, 537371368, 537033005, 536370430, 535850677, 535043793, 534709358, 534368248, 533747025, 533412933, 533090973, 533465157, 534065132, 534488907, 535345001, 536231918, 536507339, 536637993, 536776543, 536757584, 536844063, 536958084, 537319260, 537008133, 536358910, 536110268, 536074867, 536157341, 535849915]
1334.7E35849915q8273l25317l64418l395j74904k79198P6638P91778L91312O06575
1344.4E36480713P34978L74794O72531L48091J92757o23627N5694O02303m40445n32913
1354E37864876o88324n31807l53394o6490k06184K50778L43323k01264M54178j531753
1363.7E35333939k94686O73561m09088l05519p85217q28667m45099j182J92527K91214
1373.3E33421783J10741n24063M26407L69339j10665p71942o92024m36172p32575q58040
1382.9E30202789p05375j80779N0354O99959j073456j632156n09796j178704j128387
1391.6E24544449j062622l52631j580314l046723p26395m66079l18909k354279k163581
1400.3E12472916p42188j229744j188545j122131k400284k442169p99294j017418j112938
$$ y = [535849915, 535761642, 535436325, 535071907, 535068512, 534893608, 534614410, 534691048, 535482826, 535874138, 536480713, 537215691, 537590485, 538263016, 538611107, 538803864, 538180237, 538235931, 538838234, 538397789, 537864876, 537176552, 536644745, 536291351, 536224861, 536018677, 536269455, 536612778, 536411514, 536865692, 535333939, 535039253, 535712814, 535303726, 534998207, 534212990, 533384323, 532939224, 532938042, 533130569, 533421783, 533532524, 533008461, 533434868, 533804207, 533693542, 532921600, 532229576, 531793404, 531060829, 530202789, 529497414, 529316635, 529366989, 530066948, 528993492, 527361336, 526851540, 525672836, 524544449, 523481827, 523129196, 521548882, 518502159, 517775764, 517309685, 516990776, 514636497, 512472916, 511730728, 510500984, 509312439, 508190308, 505790024, 503347855, 502548561, 501531143, 500418205]
1409E00418205o31752r53293o23626q28133q68988n78308n46379o66237q20160N75028
1418.6D94476357k269326j637420J059646N60417N35431l36189K12059O14548K40822
1427.3D93456345R38453K15073o83327J17722J177673O84166P95441K412376K260590
1436E01374512L6087K3956J922302J292839Q61092J073265M35143R18121P84798J008453
1445.6E09730568J354752J293869L93371J016045J923599J181374J029014O15730J593361
1454.3E20131683J867066N10902j201896j374512L102150J490936K178230J942101
1462E28646660J405868K554436n38978N3978J937103J851921J614838J656265K993698
1470.7E42175789K184601L33061P85484K655792L099022R66072R29604K264137J890564
$$ y = [500418205, 499786453, 498833160, 498209534, 497381401, 496512413, 495934105, 495387726, 494721489, 493901329, 494476357, 492207031, 490569611, 491629257, 492189674, 492725105, 492388916, 492600975, 493215523, 493456345, 494394798, 494609871, 493926544, 494044266, 495221939, 495906105, 496701546, 499113922, 501374512, 501410599, 501434555, 503356857, 504649696, 505510788, 506584053, 507019196, 507937317, 508722115, 509730568, 511085320, 512379189, 512772560, 513788605, 515712204, 516893578, 517922592, 518538322, 520131683, 521998749, 522509651, 521307755, 519933243, 523035393, 524526329, 526704559, 528646660, 530052528, 532606964, 532067986, 532121964, 534059067, 535910988, 537525826, 539182091, 542175789, 544360390, 544693451, 545478935, 548134727, 551233749, 552199821, 553129425, 555393562, 557284126]
1479.4E57284126J159096L05634J69525J303558J500588N75447J212539M85535n27000
1488.1E63469048K226142j60484l259010k44789N74226o3744j19018M17442m097175
1496.7E58742638O27060L22227k812271j40991m96598m80995k36053J248283J377182
1505.4E58150482l521271o165618N4359K260513r75723L26309l64036j021538J006088
1514.1E49749565J32065k02980j417694l244477J167450K662621n31654l711281j219254
1522.8E43384361O67534K264481j338654r31358q5488p94372K9640N570P7133k01073
1532.4E43077774J05515k504654R18312R39140P60574L175545l05557o246719o51169
1541.1E39268761o47621q31872K487755J573830l844757P08313N28183J085625O20689
$$ y = [557284126, 558443222, 558748856, 558918381, 560221939, 561722527, 562297974, 563510513, 563996048, 563469048, 565695190, 565534706, 562275696, 562030907, 562605133, 562541389, 562422371, 562839813, 558742638, 559369698, 559691925, 556879654, 556738663, 556242065, 555761070, 555525017, 556773300, 558150482, 554629211, 548463593, 548517952, 550778465, 549802742, 550129051, 549765015, 548743477, 549749565, 549881630, 549678650, 548260956, 545016479, 546183929, 548846550, 548314896, 544603615, 543384361, 544051895, 546316376, 544977722, 544046364, 543960876, 543166504, 543196144, 543201714, 543278847, 543077774, 543183289, 540678635, 541596947, 542536087, 543296661, 546472206, 546166649, 539919930, 539268761, 538621140, 537789268, 540277023, 541850853, 538006096, 538714409, 539242592, 540328217, 540948906]
1549.8E40948906k050057M55590P59582K071381k402458k520790J722221L548431J138268
1558.5E43671074j2733688o01731J097183J866837N47295L90396k242356k353019P3280
1567.1E29715271o34346N88341o819687k174568m89083j791610j130066p94945m1657
1575.8E16427650j0281143j50795p80334j959534k099838l436813j683159l297158
1583.5D92738876j852302l176079k895546k279777l107605j351471l080216j744346
1591.2D73251534l257752j873703j780090l200455j525078k821083j322098k558517
1599D54912758j300430k064820j615753n61943k612457q86574k187767o08025j864624
1607.6D41210365r39560q69331k253914J33095j847038P9040j210022O12526R24187
$$ y = [540948906, 538898849, 539354439, 540114021, 542185402, 539782944, 537262154, 538984375, 542532806, 543671074, 530937386, 530335655, 531432838, 533299675, 533846970, 534237366, 531995010, 529641991, 529715271, 529080925, 529669266, 522849579, 520675011, 520185928, 518394318, 517264252, 516469307, 516427650, 506146507, 505995712, 505215378, 503255844, 501156006, 497719193, 496036034, 492738876, 490886574, 487710495, 484814949, 482535172, 479427567, 478076096, 474995880, 473251534, 469993782, 468120079, 466339989, 463139534, 461614456, 458793373, 457471275, 454912758, 453612328, 451547508, 449931755, 449369812, 446757355, 445870781, 443683014, 443074989, 441210365, 440270805, 439401474, 437147560, 437280655, 435433617, 435512657, 434302635, 434915161, 435839348]
1616.3D35839348o504784J737251m42771M08363j004257P73430P37075k935295M13285
1625D29021645L4828K215156r14230n88188N12962K16446P93839K14271K285080J802178
1634.6D35593987j607132k895623J962433P96318Q49915J581726k05918J776391L58390
1643.3D38210487J583596K126846k11144K275391n44281N82962L71895L079605M311638
1652D51786995N103989q063393j521225L179703J393699J852074J084518J342354J646347
1660.7D57805061J769905J689873j546402K130928J726074J563187K073784K582893
1668.4D69795303J117936J83868L625336Q55140K608872L181305R85069J27258K509194
1677.1D84989281L044281K134094L414802R34220L188934O185112K590180m923516
$$ y = [435839348, 429334564, 431071815, 430629044, 431037407, 430033150, 430806580, 431543655, 428608360, 429021645, 429056473, 431271629, 430357399, 429769211, 430282173, 430498619, 431292458, 431506729, 433791809, 435593987, 433986855, 431091232, 433053665, 433849983, 434699898, 436281624, 436075706, 437852097, 438210487, 439794083, 441920929, 441709785, 443985176, 443440895, 444023857, 444395752, 447475357, 451786995, 456890984, 448827591, 447306366, 450486069, 451879768, 453731842, 454816360, 456158714, 457805061, 459574966, 461264839, 459718437, 461849365, 463575439, 465138626, 467212410, 469795303, 470913239, 471097107, 474722443, 475577583, 478186455, 481367760, 482352829, 482480087, 484989281, 488033562, 490167656, 493582458, 494516678, 497705612, 503890724, 506480904, 501557388]
1684.8E01557388J978646N547485M295197K642707K439003K003250K577820K899552
1692.5E25941048L543319M336815N366059r91555K366677M753303N996895O676674
1700.2E57989235p999191M718208M735222L854751K105561K357101J211281J555519
1707.9E70527687M108887K604027J384048K035866K350731L035087Q59299J04256L353576
1716.6E90363464L387490m638214J008606L275680K334786J795768Q92487M62990J628646
1725.3F00511703J891747R45854Q94356J930466k96784m19693L765221M296722q68225
1734F12651367o605186L497162M053268J696053K618255P34787k466469L407250L214798
1742.7F22801285M2038N31311K839432K344017J880531J787147P73316M464493J059990
$$ y = [501557388, 503536034, 509083519, 513378716, 516021423, 518460426, 520463676, 523041496, 525941048, 529484367, 533821182, 539187241, 538195686, 540562363, 545315666, 551312561, 557989235, 549990044, 554708252, 559443474, 563298225, 565403786, 567760887, 568972168, 570527687, 574636574, 577240601, 578624649, 580660515, 583011246, 586046333, 586905632, 587009888, 590363464, 593750954, 589112740, 590121346, 593397026, 595731812, 597527580, 598420067, 598883057, 600511703, 602403450, 603349304, 604243660, 606174126, 605877342, 605457649, 609222870, 613519592, 612651367, 606046181, 609543343, 613596611, 615292664, 617910919, 618645706, 616179237, 619586487, 622801285, 622843323, 623374634, 626214066, 628558083, 630438614, 632225761, 632999077, 637463570, 638523560]
1751.3F38523560j520806L958855K470932K251663L258591j74942P31506K373200K292938
1760F54165497L665466o97632j349182K758637J743240J225739J735763J929321k470169
1768.7F62706680J357193M709244J707840j617813l582077L034439K471542q71963
1776.4F69915085J550445O69861J462250Q97980r91135R43298J596833J233673o93512
1785.1F76584778J54342J558075Q38089N34363J691513J028137M40827j834869j623459
1793.8F79371796L216705J333466j210404O96640K078247P14569j410370J450577j99356
1802.4F86041870L5248J760635O45752P38678M45023m76380M47388J478195j248703
1811.1F89867706j72500J047821M93469J279449J27793O39725k24839m3945P05185
$$ y = [638523560, 637002754, 640961609, 643432541, 645684204, 648942795, 648767853, 649499359, 651872559, 654165497, 657830963, 657133331, 655784149, 658542786, 660286026, 661511765, 663247528, 665176849, 662706680, 664063873, 668773117, 670480957, 668863144, 665281067, 668315506, 670787048, 669915085, 671465530, 672135391, 673597641, 674495621, 673504486, 674447784, 676044617, 677278290, 676584778, 676739120, 678297195, 679135284, 679669647, 681361160, 682389297, 682830124, 680995255, 679371796, 682588501, 683921967, 682711563, 683408203, 685486450, 686201019, 684790649, 686241226, 686041870, 686077118, 687837753, 688483505, 689222183, 689667206, 689190826, 689638214, 691116409, 689867706, 689695206, 690743027, 691236496, 692515945, 692643738, 693283463, 693058624, 693014679, 693719864]
1819.8F93719864j95847J035233l71857O51016K024155j937256n94406J781921K194596
1828.5F98307419J345444l946839r47265K057266L28827L11050P72095O86645j5564
1837.2F98899078j077957Q32367L96958M89959L66516J342011J548386n604935J046753
1845.8F98239136K358474k83889p21817N25436J243897R8342M37012J2131J58157J61820
1855.5G02228699k03476K212l09219O45370K92893L10593J07421K67411K24762j1979
1865.1G03554687Q01392l38974R03702k29645k355957K50473R37119P15484k69851
1873.8G03968430K35443L68652K21252j34277N5008L43704n95398K09504o0578J41144
1883.4G04752884J46484p4691L90548l36075R82132L67127j915131K67792J216812
$$ y = [693719864, 693524017, 694559250, 694187393, 694838409, 696862564, 694925308, 694330902, 696112823, 698307419, 699652863, 695706024, 694758759, 696816025, 697144852, 697455902, 698227997, 698914642, 698899078, 697821121, 698653488, 699050446, 699540405, 699906921, 701248932, 702797318, 697192383, 698239136, 700597610, 700313721, 699591904, 700117340, 701361237, 701459579, 701896591, 701908722, 702066879, 702228699, 702025223, 702027435, 701718216, 702363586, 702656479, 702967072, 703074493, 703341904, 703566666, 703554687, 704356079, 704017105, 704920807, 704691162, 702335205, 702585678, 703522797, 704238281, 703968430, 704203873, 704572525, 704793777, 704659500, 704714508, 705058212, 704462814, 704672318, 704611740, 704752884, 704899368, 704824677, 705215225, 704879150, 705861282, 706228409, 704313278, 704581070, 705797882]
1892.1G05797882j1444N8823R7503j077041K40173L53317K11563K37122J17798M51584
1901.8G06477280j43204L00751P7743k74353k58255k63824N3253L65982j33133o64749
1911.4G05537491Q70209O7672j25198J38855R7198J671906j674805j677627J079178
1920.1G05984879P98111J018371o31714j207657L17841K17133m89350O87O3476R8801
1929.7G06170578P4921l22495L60031l9062j00556j96151k04926J28479j69983J27716
1939.4G05828552P9804J110458Q7738k340546J18714R39331j59378m55170l5324m58984
1949G04715195l13568J54571Q2016o180L82L51791Q7814j07650o21643l71323K74582
1959.6G04245987K36664n9204o00205K06757m3259r0713O48346l1434l45840k26288
$$ y = [705797882, 705786438, 705845261, 705942764, 704865723, 705105896, 705459213, 705670776, 705907898, 706025696, 706477280, 706334076, 706634827, 706712570, 706438217, 706179962, 705916138, 705969391, 706335373, 706202240, 705537491, 706407700, 706475372, 706350174, 706489029, 706586227, 708258133, 706583328, 704905701, 705984879, 706782990, 707801361, 707169647, 705961990, 706279831, 706496964, 706007614, 706008301, 706071777, 706170578, 706245499, 705923004, 706283035, 706243973, 706143417, 705947266, 705742340, 705870819, 705700836, 705828552, 705908356, 707018814, 707106552, 704766006, 704884720, 705824051, 705664673, 705209503, 705174179, 704715195, 704401627, 704556198, 704638214, 704632034, 704632416, 704984207, 705072021, 704964371, 704342728, 703971405, 704245987, 704482651, 704423447, 703823242, 704029999, 703986740, 703896027, 704544373, 704512939, 704167099, 703940811]
1969.3G03940811j07269k48947J53351P8659q3390J4801l53241j53045m24347j8845
1978.9G02798538J83792J35422j1368j78146L75595m07791j64185J36719k65045o31180
1988.6G01972351q51135P25403R10720p89337r54818L33480M07181J12915n035o60858
1998.2G01200867k90146o9580J43814q3542k82440j59760l61328K53372K69776J60446
2007.8G00781479k59018l38059O2180l41415m52805l60794j23672R1629K15148m98504
2017.5F98776169j71509K55814k84272J75858j91956o5765k74048n13763K9983n08804
2027.1F97227707j83487p7972k1744P858j31302J98517J6403l08151n64346k49558
2036.8F95913925l47824j37939O1340k54059o6452Q5449J33057k89993o6681k65045
$$ y = [703940811, 703833542, 703584595, 703737946, 703816605, 703733215, 703748016, 703394775, 703241730, 702817383, 702798538, 702982330, 703117752, 703106384, 702928238, 703303833, 702896042, 702731857, 702868576, 702603531, 701972351, 701121216, 701846619, 702757339, 701968002, 701013184, 701346664, 701753845, 701866760, 701861725, 701200867, 700910721, 700841141, 700984955, 700901413, 700618973, 700459213, 700097885, 700351257, 700621033, 700781479, 700522461, 700184402, 700246582, 699905167, 699452362, 699091568, 698967896, 699059525, 699274673, 698776169, 698604660, 698860474, 698576202, 698752060, 698560104, 698494339, 698220291, 697706528, 697736511, 697227707, 697044220, 696966248, 696944504, 696952362, 696821060, 697019577, 697035980, 696727829, 696163483, 695913925, 695566101, 695428162, 695489502, 695235443, 695168991, 695254440, 695387497, 695097504, 695030823, 694765778]
2046.4F94765778l21351p1563n16052M8751L1205K7389K61917J43051l76205n69229
2056.1F93423691L04642J14669j29394k35291q2779p2708j74637J72119k26821k99302
2065.7F92794189l70178k9907J1368j51367K04239K51312J30386n33676j89209l17230
2075.4F91799927l34931K67792r6283j85394l57514P1869M2649p1030m5548j75323
2085F90916214k3651m01688J30158J62887m1885k58103k51083r3155n37414J76010
2094.6F89778290J01089Q3084M0970j01089p401p81631m72565l30048M2038K83966
2104.3F88636703J78223m0283n14526j9684j43509r5520r6894O9581n2491l94210O9885
2114.9F87597275l24707j30615j49994j12305N9738k6779J43585m50745l64227n1346
$$ y = [694765778, 694444427, 694372864, 693856812, 693905563, 693936768, 693964157, 694226074, 694369125, 693992920, 693423691, 693728333, 693843002, 693713608, 693478317, 693395538, 693322830, 693148193, 693320312, 693093491, 692794189, 692424011, 692394104, 692405472, 692254105, 692458344, 692709656, 692840042, 692306366, 692117157, 691799927, 691464996, 691732788, 691636505, 691451111, 691093597, 691165466, 691208115, 691137085, 691091537, 690916214, 690892563, 690490875, 690621033, 690783920, 690742035, 690483932, 690232849, 690139694, 689602280, 689778290, 689879379, 689962463, 690003433, 689902344, 689894943, 689113312, 688640747, 688310699, 688352737, 688636703, 688814926, 688774643, 688260117, 688240433, 688096924, 688001404, 687904510, 687974091, 687921600, 687527390, 687597275, 687272568, 687141953, 686991959, 686879654, 686939392, 686912613, 687056198, 686605453, 686241226, 686189880]
2124.5F86189880N27802N5160n53817M39376M06342k52609m01993N9967l04031j94168
2134.2F85971909J86233k78320j92261k19727L62015J70517n9891M2725k99072p0114
2143.8F85614014k49176J31149K01034j06430j18255J0605l4561j99128J75476O4392
2153.5F85489120L78647J1368j60065q3999p15409k81906j17035K87781K66342K63672
2163.1F85338516K25754k95792K7466J46637M12369l78113l59573J73721k59857j7700
2172.8F85013428p7133L03268J0452K2812M85611l1509j73111O561L84064j14823k55661
2183.4F85573959k54745l95737P5150K06299M64172L59878j1673m01001j5869J99280
2193F85799713k97241j93710J81121M28162q6212N9280N9052j76468M1046Q1253M41742
$$ y = [686189880, 686717682, 686772842, 686219025, 686658401, 687064743, 686812134, 686410141, 686470108, 686166077, 685971909, 686158142, 685879822, 685687561, 685467834, 685829849, 686000366, 685940475, 685983200, 685684128, 685614014, 685364838, 685495987, 685697021, 685590591, 685472336, 685482941, 685448380, 685249252, 685424728, 685489120, 685867767, 685879135, 685719070, 685635071, 684919662, 684637756, 684520721, 684808502, 685074844, 685338516, 685564270, 685268478, 685295944, 685442581, 685854950, 685476837, 685117264, 685290985, 685031128, 685013428, 684936295, 685239563, 685250015, 685272827, 685758438, 685726929, 685553818, 685560379, 685944443, 685829620, 685573959, 685319214, 684923477, 684998627, 685204926, 685669098, 686028976, 686017303, 685616302, 685600433, 685799713, 685502472, 685308762, 685489883, 685918045, 685831833, 685891113, 685950165, 685773697, 685814743, 685895996, 686337738]
2203.6F86337738L4180j12686l09983k50854Q0948j76697j90735r7961L21731k29721
2213.3F85405960J11160M15802Q1787N56489P705k0523m23889l21732J32218K4566
2222.9F85969543J84098m47006k0371R1400l3264o4926P8735M81796j52816K3575j77536
2233.5F85933228l28064k05384n9738j1597M807Q02917n645l60871k36663k80381K25525
2244.1F85478134L29209M04586l86581p14264j61057N53132J64642j07575L13950k68936
2253.8F85605240j40228j79596J12228M13895K24304J20621k31095l3569k31705J23749
2263.4F85783844p5302k37885J4878j7014L52554j54571L77426J90430l20587j17493
2273F85796280j73798J26801k39487J35193j91956m6463K4414m95910J74789L281L04718
$$ y = [686337738, 686371918, 686259232, 685949249, 685698395, 685779343, 685602646, 685411911, 685313950, 685635681, 685405960, 685517120, 685932922, 686014709, 686571198, 686578903, 686558380, 686134491, 685812759, 685944977, 685969543, 686153641, 685706635, 685686264, 685777664, 685744400, 685679474, 685758209, 686240005, 686087189, 686110764, 685933228, 685605164, 685399780, 685340042, 685328445, 685333252, 686136169, 686130524, 685769653, 685532990, 685252609, 685478134, 685807343, 686211929, 685825348, 685111084, 684950027, 685503159, 685667801, 685560226, 685874176, 685605240, 685465012, 685285416, 685397644, 685811539, 686035843, 686156464, 685925369, 685891800, 685660095, 685783844, 685708542, 685470657, 685485535, 685468521, 685821075, 685666504, 686043930, 686234360, 685913773, 685796280, 685622482, 685749283, 685509796, 685644989, 685453033, 685406570, 685430984, 684935074, 685109863, 685113144, 685417862]
2283.7F85417862k63748l11737J32293J44959O27746k58178K41852M9591l85056p3929
2293.3F85321655P1488J126480L99322O3706l5019K212L54386J33362N34210r5825
2302.9F87875977m43345k80685P03278J021652M05426P90024M72183M88510q6136K9678
2312.6F90976562K06986l62854Q09250K78702j84937O25839J124649J214295Q05893
2321.3F95494385Q00857M72718O39801m71497p47070J378250R40780j04446J17035
2329.9F98520813O01273Q4686j324005m15497J131897J471939P66525J27335O48498
2338.6G01613464j1673n69229N9281J63040q04672j492157j977234k012253j601639
2347.3F93366928j577911J344986L549728J278992J133423J380386J039810K353058
$$ y = [685417862, 685154114, 684842377, 684974670, 685119629, 685747375, 685489197, 685731049, 685780640, 685395584, 685321655, 685393143, 686519623, 686918945, 686982651, 686947632, 686949844, 687304230, 687437592, 687971802, 687875977, 687432632, 687151947, 687855225, 688876877, 689282303, 690072327, 690544510, 691033020, 690946884, 690976562, 691183548, 690820694, 691629944, 691908646, 691723709, 692349548, 693474197, 694688492, 695494385, 696295242, 696767960, 697407761, 696936264, 696189194, 697567444, 698508224, 698403778, 698520813, 699122086, 699206772, 697882767, 697467270, 698599167, 700071106, 700837631, 700964966, 701613464, 701601791, 701032562, 701091843, 701254883, 700450211, 698958054, 696980820, 694968567, 693366928, 691789017, 693134003, 696683731, 697962723, 699096146, 700476532, 701516342, 703869400]
2355G03869400J741028J567154q97904k79235N78079m25568j072159j259613M02680
2363.7G04223862k054749j486816N36728j09711k012177l518524j419449o42623p53022
2372.4F92763519j449737k002411j381149j797410j568298r42612j009674p78350m69895
2381.1F81363983q65326j035690j174622j074447l87039l92685k89460l60260k17895
2389.7F75566559J46026j89743j5869l7002j17798O9351j5182n18036o76041j01242
2399.4F74111023l8147N8746J73416j38015n76248j46561L11508l45535k60391J55181
2409F73304977J87455k91901l90320J19324l69415o27289j65558l128p8812K83432
2418.7F71968765J3199o37817m35791l71933k25907j51977j75705k82059m2801K23084
$$ y = [703869400, 705610428, 707177582, 706279678, 706000443, 706578522, 706152954, 705080795, 703821182, 704223862, 702169113, 700682297, 701219025, 701109314, 699097137, 695578613, 694159164, 693516541, 692763519, 691313782, 689311371, 687930222, 686132812, 684564514, 683621902, 682612228, 681833878, 681363983, 680498657, 679462967, 678288345, 677213898, 676826859, 676434174, 676144714, 675784454, 675566559, 675712585, 675522842, 675506973, 675469971, 675352173, 675421524, 675406342, 674888306, 674212265, 674111023, 674072876, 674131622, 674305038, 674167023, 673590775, 673444214, 673755722, 673410187, 673149796, 673304977, 673492432, 673200531, 672810211, 672929535, 672560120, 671932831, 671767273, 671764145, 671685333, 671968765, 671981964, 671344147, 670908356, 670536423, 670310516, 670158539, 669982834, 669700775, 669657974, 669881058]
2428.3F69881058k45209k51846l37525r3994j1597l48205o8131q8424k93579m09851
2438F67732697k17057l77578k42081J02463l42865k34375Q1787J29471l59650k83661
2447.6F65989151K16217k60086m94690m10156k10571j08948k02942l94821k37427j11847
2457.2F63773880j48315L64914j43052n05218k20337m33273k50626J16653o332n15747
2466.9F62032547n16510l60794l3188J99204l5782m34723q08945k59476j32827j91117
2476.5F59458389q5144k92282j61590k51694l60718o67877m22135l8528j92871O6223
2486.2F57051773P9651q9264k49863l22265m88053l94516j34887m99878n60379m5014
2495.8F54347305K19422k84424m00086l53164n62287k31399M4250q6212n42679n20172
$$ y = [669881058, 669635849, 669384003, 669046478, 668952484, 668940887, 668592682, 668524551, 668436127, 668142548, 667732697, 667515640, 667138062, 666895981, 666998444, 666655579, 666421204, 666502991, 666632462, 666272812, 665989151, 666205368, 665945282, 665450592, 665040436, 664829865, 664720917, 664517975, 664123154, 663885727, 663773880, 663625565, 663990479, 663847427, 663342209, 663121872, 662688599, 662437973, 662554626, 662548294, 662032547, 661516037, 661155243, 661122055, 661321259, 661285477, 660850754, 660041809, 659782333, 659649506, 659458389, 659373245, 659080963, 658919373, 658667679, 658306961, 657639084, 657216949, 657178421, 656985550, 657051773, 657131424, 657042160, 656792297, 656470032, 655981979, 655587463, 655452576, 654952698, 654392319, 654347305, 654566727, 654282303, 653882217, 653529053, 652966766, 652735367, 652779617, 652693405, 652150726, 651630554]
2505.5F51630554o69327o96334M2724R0561m5395J87302J51443n17807m06646k4338
2515.1F49742737m36173l38211k13775k97394m94385n22919k93808m3945j66778k82898
2524.7F46652451K46582k823j58615m26102q41370m86145k93274L7155n3024j49460
2534.4F44525375l94287l88336K13089M6845k64740n44739j85471r0942m73786l21273
2544F42121735j04752q926n12467l95202Q2092q545k57492k40097j26267n51223o03791
2554.6F39395065j65634K29759l02543n61714q8616j80740k61498l73230L3608j39771
2564.3F37584686m10957j67732m08058n1842j29051j85395l27720p66030m20112Q011
2573.9F34725800L99704r8877p25289m88014p1449n0850l6888j80512o27441l86849
$$ y = [651630554, 650961227, 650264893, 650307617, 650398178, 650352783, 650540085, 650691528, 650173721, 649767075, 649742737, 649306564, 648968353, 648754578, 648457184, 647962799, 647439880, 647146072, 647102127, 646935349, 646652451, 646899033, 646896210, 646737595, 646311493, 645470123, 644983978, 644690704, 644727859, 644674835, 644525375, 644131088, 643742752, 643955841, 644002686, 643737946, 643193207, 643007736, 642916794, 642443008, 642121735, 642016983, 642008057, 641495590, 641100388, 641182480, 641173935, 640916443, 640676346, 640550079, 639998856, 639395065, 639229431, 639459190, 639156647, 638594933, 638506317, 638325577, 638064079, 637690849, 637724457, 637584686, 637173729, 637005997, 636597939, 636546097, 636417046, 636231651, 635903931, 635137901, 634717789, 634725800, 635125504, 635026627, 634301338, 633813324, 633741875, 633691025, 633654137, 633473625, 632846184, 632459335]
2583.6F32459335l38630l5973Q4114l44734m41971n96352k34870j87645j16196J42021
2593.2F30389099j22108k42424q0529k57301p76100l02734q6785k50053k21443m90380
2602.9F27559242l78952j21918L4638k40440r8839j89820o28318p05834o99043p6k88811
2613.5F24241829m24118q0795j64376M9401m52309m06876r9487l50800n01976l29132
2623.1F21481361l51104n14679p2518o0692P2289k43568o75278l74184r2277K90985
2632.8F19460335l41797o71311o17256m99954k67715p12014r2506R8267m63410l87001
2642.4F15505638l41263k07214J4076J76239l62053q86917n62286k17476j49765o6223
2652F12902756j46065m64973l04909K3765l30505m93660L4447j79825o84090o82754
$$ y = [632459335, 632120705, 632084732, 632168846, 631824112, 631382141, 630785789, 630550919, 630363274, 630247078, 630389099, 630266991, 630024567, 629944038, 629686737, 628910637, 628607903, 628521118, 628271065, 628049622, 627559242, 627180290, 627058372, 627093010, 626852570, 626753731, 626563911, 625935593, 625229759, 624530716, 624530640, 624241829, 623817711, 623736916, 623572540, 623621941, 623169632, 622762756, 622663269, 622312469, 621810493, 621481361, 621130257, 620615578, 620543060, 620482368, 620554657, 620311089, 619635811, 619261627, 619169350, 619460335, 619118538, 618447227, 617829971, 617330017, 617062302, 616350288, 616257782, 616356049, 615892639, 615505638, 615164375, 614957161, 614971237, 615147476, 614785423, 613898506, 613336220, 613118744, 612968979, 612902756, 612756691, 612291718, 611986809, 612010574, 611680069, 611186409, 611220856, 611041031, 610356941, 609674187]
2661.7F09674187m81301k38266l88450o0845K32659K40364J40533n13801n14832k67372
2671.3F07822876l49464l87574l17993n01022k99072K37121k79846m43001l26309n73692
2681F04582024k57569L30239J94053n69610n97496l38555j45836j71280k39677k22168
2690.6F02564125m07295j3008R041k95334m92440n88951l30429m09050m40063l12233
2700.3E99284363j20049r1552k59057j67427J06163l7803j72348j5984n23681l82729
2709.9E97619896j63536m51203m00390n99861l57476j7814L58925P9116n63468k77634
2719.5E95226555j50261k03056m23203p9918O7635l45078k64015n13000k76757N8480
2729.2E93097382j12839k0828J82724q2512n75714l10326J14212J27525k37655n07775
$$ y = [609674187, 609192886, 608954620, 608566170, 608505325, 608737984, 608978348, 609118881, 608605080, 608090248, 607822876, 607473412, 607085838, 606767845, 606266823, 605967751, 606204872, 605925026, 605482025, 605155716, 604582024, 604324455, 604654694, 604848747, 604279137, 603681641, 603343086, 603197250, 603025970, 602786293, 602564125, 602156830, 602143822, 602152863, 601857529, 601365089, 600776138, 600445709, 600036659, 599596596, 599284363, 599164314, 599072762, 598813705, 598646278, 598752441, 598714638, 598542290, 598526306, 598002625, 597619896, 597456360, 597005157, 596604767, 596004906, 595647430, 595629616, 595988541, 596067657, 595504189, 595226555, 595076294, 594873238, 594450035, 594370117, 594437752, 594092674, 593828659, 593315659, 593038902, 593097382, 592984543, 592963715, 593146439, 593063927, 592488213, 592177887, 592292099, 592419624, 592181969, 591674194]
2738.8E91674194o59828l92265K52266m6768j67084J66588r1591k91863r9029l46565
2748.5E89998055n06821m6005j19858k16179j91002k75345j76697l4713J3275Q4076
2758.1E88528786K1972p88536m52881N4779l85017J2894j4076j61362j56517l98674
2767.8E86261368k35787j69448k25640r3613J11199l4943k72827q36601j056404n67703
2777.4E82879601j07041K69356q9913j72576q7204l3112N1651p57790n83381L54080
2787E81723671L44887m05388o91948k91290m40064o86226l52440P3891l50647o49567
2796.7E78274879j30424l54500o32973r6817J10856l87383o91299m13437l51601n71747
2806.3E74755554m12636k11448j55602m60090p29371k40936l47481p45086n13802j24664
$$ y = [591674194, 591014366, 590622101, 590874367, 590827599, 590660515, 590827103, 590735512, 590443649, 590344620, 589998055, 589491234, 589445229, 589325371, 589109192, 588918190, 588642845, 588466148, 588431435, 588444710, 588528786, 588550758, 587762222, 587309341, 587364120, 586979103, 586991997, 586977921, 586816559, 586660042, 586261368, 586025581, 585856133, 585630493, 585536880, 585648079, 585613136, 585340309, 584503708, 583447304, 582879601, 582772560, 583041916, 582952003, 582779427, 582692223, 582659111, 582710762, 581952972, 581369591, 581723671, 582068558, 581663170, 580971222, 580679932, 580239868, 579553642, 579201202, 579275093, 578924446, 578274879, 578144455, 577789955, 577156982, 577060165, 577171021, 576783638, 576092339, 575678902, 575327301, 574755554, 574342918, 574131470, 573975868, 573515778, 572786407, 572545471, 572197990, 571452904, 570939102, 570814438]
2816E70814438j60141n33829m47769p23534n92575l30047m54827o752n25589q77647
2825.6E66161728m54559l75634o13975j098137p38335m43725p70874n37262k76299
2834.3E60852928n44510l00026k34451p03316p65495j068954j150361j279335j219253
2843E53587227j005058j257401j195679j567459j366882j202355j605186j279869j083298
2851.7E42024040p19986n45730k53754R5100k10762l33633j57700P9384L1052J59378
2861.3E40167389L7384M1695K49404n20439p21817k00004j63117m60167q39767q56018
2870.9E36734543K5596L16468m81949n34821m16259m29116l07960l38135l74641o29082
2880.6E33564644q51593n20020j69067o54411n28031j06392l93638m91066n90210m75121
$$ y = [570814438, 570654297, 570120468, 569672699, 568949165, 568356590, 568026543, 567571716, 567564964, 567039375, 566161728, 565707169, 565331535, 564717560, 563619423, 562881088, 562437363, 561666489, 561129227, 560852928, 560308418, 560008392, 559773941, 559070625, 558305130, 557236176, 556085815, 554806480, 553587227, 552582169, 551324768, 550129089, 548561630, 547194748, 545992393, 544387207, 543107338, 542024040, 541304054, 540758324, 540504570, 540599670, 540388908, 540055275, 539897575, 539976959, 540008011, 540167389, 540204773, 540246468, 540495872, 539975433, 539253616, 539053612, 538890495, 538430328, 537590561, 536734543, 536760139, 537076607, 536594658, 536059837, 535643578, 535214462, 534906502, 534568367, 534193726, 533564644, 532713051, 532193031, 532023964, 531369553, 530841522, 530735130, 530341492, 529850426, 529260216, 528785095]
2890.2E28785095n70259o73561n57785n35622l54690o25534q26836o02722n04265o27441
2899.9E22906380k77329l78761q40607k68783l36495m88205m37584p04002o56357r31358
2909.5E17586899j002503p48558n05676p17545o89811o58379j499939j298752n75142
2918.2E09890594o85157j093598q64181j60179N9738j90544m83704l09677j05400K49786
2927.8E06307678N20210K70157k62680k670Q98933L35045l1357K36779K15683K69851
2937.5E08757629K87667P91588P76634N04989L03193M43382R10492N77240L29284j2207
2947.1E13669891q8806M01230L99628j2055O8360K11067q7166L24669K95563K81028
2956.8E15463409N28870Q4610L08075M33235L70140J09635k62719Q2970N06935O64788
$$ y = [528785095, 528214836, 527541275, 526983490, 526447868, 526093178, 525467644, 524640808, 524038086, 523533821, 522906380, 522629051, 522250290, 521409683, 521140900, 520804405, 520316200, 519878616, 519174614, 518518257, 517586899, 516584396, 515835838, 515330162, 514612617, 513922806, 513264427, 511764488, 510465736, 509890594, 509205437, 508111839, 507247658, 507087479, 507147217, 506956673, 506472969, 506163292, 506057892, 506307678, 506827888, 507098045, 506835365, 506832695, 507731628, 508066673, 508035316, 508272095, 508487778, 508757629, 509045296, 509836884, 510613518, 511118507, 511421700, 511865082, 512775574, 513352814, 513682098, 513669891, 513581085, 513982315, 514381943, 514369888, 514438248, 514649315, 514562149, 514886818, 515182381, 515463409, 515992279, 516076889, 516384964, 516818199, 517188339, 517297974, 517035255, 517118225, 517625160, 518289948]
2966.4E18289948M05693M70581L46603J64375J021004J160889M99153L86734L853l90511
2976.1E22358322m9972J59034M47693N06172p9040k68746P8545L37524J29738L3264
2985.7E23652534J11466J49307O1951p4120M33884O15807k05346o08978j86767P5645
2995.3E24025383K79388L4142m69284l35350n10254m30946O2217l8414n31654p01981
3005E21383247l67508J02654L59383l12195m28009k23351m72221j44959m01687o76003
3014.6E18819351o37321n20478k81410k99835j76849k32125k76642k24990k20757o51321
3024.3E15297623o45752l58467q30651o49490m22974k89535k04621l15704j83029m25568
3033.9E10971832n06210m68483m10080n32379l30773k53906n48324j43814n59388q07876
$$ y = [518289948, 518695641, 519166222, 519512825, 519677200, 520698204, 521859093, 522358246, 522744980, 522748833, 522358322, 522308350, 522467384, 522915077, 523421249, 523342209, 523073463, 523152008, 523489532, 523619270, 523652534, 523764000, 523913307, 523975258, 523901138, 524335022, 524950829, 524745483, 524136505, 523949738, 524025383, 524304771, 524338913, 523869629, 523534279, 523024025, 522593079, 522655296, 522616882, 522085228, 521383247, 521015739, 521118393, 521477776, 521165581, 520737572, 520514221, 520042000, 519897041, 519495354, 518819351, 518182030, 517661552, 517380142, 517080307, 516903458, 516671333, 516394691, 516169701, 515948944, 515297623, 514651871, 514293404, 513462753, 512813263, 512390289, 512100754, 511896133, 511580429, 511397400, 510971832, 510465622, 509997139, 509587059, 509054680, 508723907, 508470001, 507921677, 507777863, 507218475, 506410599]
3043.6E06410599l60070m62036o29005o08864m94232l97377l11356o15844j80245L9520
3053.2E02391090m18663l37295q25958r54247m95186k21329o35948m89425M76532j29166
3062.9D98360405p10182o42472l52630j78108m35181o55098q07037m07029m72869m28849
3072.5D93270950k14348k23236j83525k47268k7390o22711r51195p72362k89383L08648
3082.1D90048180l30162o60401l32870k54860q56743o85883J1025q0147j97029n54771
3091.8D86106339k93999l36838n76248m47045m76493j26877n89981l79830j00631p04613
3101.4D82073784l35198l32107o64444m41628l92227p00607k69508J87225n73311r20486
3111.1D77631493l67356k13089l18489m63943r58748j63117M32358p28111q63228j91955
$$ y = [506410599, 506050529, 505588493, 504959488, 504350624, 503856392, 503459015, 503147659, 502531815, 502351570, 502391090, 501972427, 501635132, 500809174, 499854927, 499359741, 499138412, 498502464, 498013039, 498489571, 498360405, 497650223, 497007751, 496655121, 496477013, 496041832, 495386734, 494579697, 494172668, 493699799, 493270950, 493056602, 492833366, 492649841, 492402573, 492375183, 491752472, 490801277, 490028915, 489739532, 490048180, 489718018, 489057617, 488724747, 488469887, 487613144, 486927261, 486938286, 486858139, 486661110, 486106339, 485812340, 485475502, 484899254, 484452209, 483975716, 483848839, 483258858, 482879028, 482778397, 482073784, 481738586, 481406479, 480742035, 480300407, 479908180, 479207573, 478938065, 479125290, 478551979, 477631493, 477264137, 477051048, 476732559, 476268616, 475309868, 475146751, 475579109, 474850998, 473987770, 473795815]
3120.7D73795815l65830q39271o01388j21612r8534o08062j039048q10928n03044o7024
3130.4D68741074m33655m92325k10724q68111p21588n49354k06490k2583n56793p60689
3140D63918762o06117m6845l90167n64651q0567k04963r14193j252746l30505K6245
3149.6D59554253q3084k71721p15790p00531o58760o82640m78020q7433l70369m34036
3159.3D55071869l67165p27997r49096j032181j70288P8392m11644o92444o94351k37923
3168.9D49867172l09448l90854q10394r96208n53933m78553o46973n88493K44445P6676
3178.6D45413437p67937o88171n78957p86323p13959o27823j096306k45094L48129
3187.3D40256996m83894n49736n11437l29322l09220n68046j37597l96232q91113m06838
$$ y = [473795815, 473429985, 472590714, 471989326, 471867714, 471769180, 471161118, 470122070, 469311142, 468808098, 468741074, 468307419, 467815094, 467604370, 466736259, 466014671, 465465317, 465258827, 465236244, 464679451, 463918762, 463312645, 463265800, 462875633, 462310982, 462230415, 462025452, 461111259, 459858513, 459528008, 459554253, 459471169, 459199448, 458483658, 457783127, 457124367, 456441727, 455963707, 455876274, 455505905, 455071869, 454704704, 453976707, 453027611, 451995430, 451825142, 451903534, 451491890, 450799446, 450105095, 449867172, 449557724, 449166870, 448356476, 447360268, 446806335, 446327782, 445680809, 445092316, 445336761, 445413437, 444645500, 443957329, 443378372, 442592049, 441878090, 441250267, 440153961, 439908867, 440256996, 439773102, 439223366, 438711929, 438382607, 438073387, 437505341, 437367744, 436971512, 436080399, 435673561]
3196.9D35673561l98102p37343o65702m46282j77994m20799m25644n14297l60070j41983
3206.5D31385345j112403n96962Q5563p63054r57069m31938Q3046l17307p08847n94444
3216.2D26071930n56984k27623P5035o13098r49631j75819n74341n33905Q888j09291
3225.8D22415161j74141q84094p85103o46095m27742L47786j44844o54488m72298l73840
3235.5D18200302p99522p33223n4207N0621n48096p71293l34740o11267J00975O32477
3245.1D15132027n38636r99984j137810n32417J52320M921o22253j028328k38151L16543
3254.8D10508232K37045o27212j041222q9950l06969n41725M6692j60218l37677m58488
3264.4D07228508p41196l94592j19591m9019K2927j76544k80419k82173l07503n48286
$$ y = [435673561, 435275459, 434538116, 433872414, 433426132, 433248138, 432827339, 432401695, 431887398, 431527328, 431385345, 430272942, 429675980, 429761543, 428998489, 428041420, 427609482, 427692528, 427375221, 426666374, 426071930, 425514946, 425287323, 425362358, 424749260, 423799629, 423623810, 423049469, 422515564, 422524452, 422415161, 422241020, 421356926, 420571823, 419925728, 419497986, 419845772, 419700928, 419046440, 418574142, 418200302, 417400780, 416667557, 416613350, 416663971, 416115875, 415344582, 415009842, 414398575, 414499550, 415132027, 414593391, 413593407, 412455597, 411923180, 412075500, 412080421, 411458168, 410429840, 410191689, 410508232, 410745277, 410118065, 409076843, 408986893, 408679924, 408138199, 408184891, 408024673, 407686996, 407228508, 406487312, 406092720, 405973129, 405924110, 405947037, 405770493, 405490074, 405207901, 404900398, 404352112]
3274D04352112l36609p0381r76258j200676l28178j40228k90833r1858J76545L61785
3283.7D01455421K8763n41572o14357n82314m79431J24893K93999o23169r41048k61841
3293.3C97859344N990j07308j75667l35006q64830q14782m13742L8147M95758k32544
3303C95455360l35426l86009q86345K2469j61248p13539K1591j68571m78706m18854
3312.6C91950722p84416n45197j33553l06205n76210o79589m54826l39890j57241k00692
3322.3C87772903k41355j22910r29222q29964k55623n80711p01485o45981k65274m42619
3331.9C82757759q40835k33002m7264n20592j54915m79431j222267n22537m34876m9705
3341.6C78252335k1630j173172p08008m06837o01578p76214o37780O5346j75629l03230
$$ y = [404352112, 404015503, 403945122, 402968864, 401768188, 401440010, 401299782, 401008949, 400917091, 401093636, 401455421, 401484184, 400942612, 400328255, 399745941, 399266510, 399391403, 399685402, 399062233, 398121185, 397859344, 397865334, 397758026, 397582359, 397247353, 396382523, 395567741, 395153999, 395192146, 395687904, 395455360, 395119934, 394733925, 393847580, 393870049, 393708801, 392995262, 393016853, 392848282, 392369576, 391950722, 391166306, 390621109, 390487556, 390181351, 389605141, 388925552, 388470726, 388130836, 387973595, 387772903, 387531548, 387408638, 386479416, 385649452, 385393829, 384813118, 384111633, 383465652, 383200378, 382757759, 381916924, 381683922, 381636658, 381116066, 380961151, 380481720, 379259453, 378736916, 378302040, 378252335, 378230705, 377057533, 376349525, 375942688, 375341110, 374564896, 373927116, 373992462, 373816833, 373513603]
3351.2C73513603j70288l53813p47299n88989n06783q09135P3013M85954j71661r92775
3360.8C69731827r04770j09520k00386l28560l16048l86009n89981q09936m06571l2539
3370.5C65647507k65732l86353m78820k44065M56276m86450j124496l82576m8981k18506
3380.1C62467804n35469K47345j40610o21223J78337k68479j09672j85738n95436k42729
3389.8C60194130r5215K73209j39160p02591l47977R537J41258k8534o9122J22528
3399.4C59358063n67971j023826k73781l08495j3313L99857l05596k07443m80080q99887
3409.1C55677528K34337N36194R6970L11203k90757o31523l25431l35770P2059M73252
3418.7C55818062N82504l94783n41038L45611k26974j09635L76244O57463N67093l42026
$$ y = [373513603, 373343315, 372989502, 372242203, 371653214, 371146431, 370337296, 370410309, 370896263, 370724602, 369731827, 368827057, 368717537, 368517151, 368188591, 367872543, 367486534, 366896553, 366086617, 365680046, 365647507, 365381775, 364995422, 364516602, 364272537, 364728813, 364242363, 363117867, 362735291, 362686310, 362467804, 361932335, 362179680, 362039070, 361417847, 361596184, 361327705, 361218033, 361032295, 360436859, 360194130, 360098915, 360372124, 360232964, 359530373, 359182396, 359191933, 359333191, 359304657, 359235535, 359358063, 358790092, 357766266, 357492485, 357183990, 357170677, 357570534, 357264938, 357057495, 356577415, 355677528, 355911865, 356448059, 356545029, 356856232, 356565475, 355933952, 355608521, 355272751, 355344810, 355818062, 356400566, 356005783, 355464745, 355810356, 355583382, 355473747, 355849991, 356507454, 357074547, 356732521]
3428.3C56732521n58090k55470K09426K05193R6474J31416J92719K2811n10711J60484
3438C56426773N91469o1875J12496J014061N25551n46456j82495M42200P12776j88331
3447.6C58846169j11046O87904J25160K29264P23915N56373J18103J83106K55356m6196
3457.3C61568108J62582M79164Q68416N54085J98288L40461K24381M02794P25822P67555
3466.9C66291656Q8921J21880O09817M21524L49045L14064O88324N71594j28364Q6288
3476.6C69414749M02947O57425Q38966M85458M64249K88925K56691J294785J042900
3485.2C75147095J99966L10860J17111j33591L74985J096726O98356L91579O05812
3493.9C78808899M73175O74286N80368K23350J63460M91944P86514R37538R74693P80297
$$ y = [356732521, 356174431, 355918961, 356128387, 356333580, 356430054, 356561470, 356754189, 356777000, 356266289, 356426773, 357018242, 356956367, 357068863, 358082924, 358608475, 358062019, 357879524, 358321724, 359034500, 358846169, 358735123, 359423027, 359548187, 359777451, 360501366, 361057739, 361175842, 361358948, 361614304, 361568108, 361730690, 362209854, 363078270, 363632355, 363830643, 364171104, 364395485, 364798279, 365524101, 366291656, 366380577, 366502457, 367112274, 367533798, 367882843, 368196907, 368885231, 369456825, 369328461, 369414749, 369817696, 370475121, 371314087, 371799545, 372263794, 372552719, 372809410, 374104195, 375147095, 375347061, 375657921, 375775032, 375641441, 376016426, 377113152, 377811508, 378203087, 378808899, 379282074, 379956360, 380536728, 380760078, 380923538, 381415482, 382201996, 383139534, 384114227, 384894524]
3503.6C84894524M89883K39601K25487K1362J281090J556549j82876L76892M19006
3512.2C89321518J99814O42433J136093R91249M91181Q55598M61121N81360Q03451
3520.9C95483818J058998J114502j33972J74828P57408P81784L97682N76897P12509
3529.6D00924454P14073P00111P87545J251068L26576J504249J320878m21334J046295
3538.3D08153915O46706M64401P78351J397591J398697J092262R17702j96686J244888
3547D15897827l27530L29476J627578J824150K619668q61702M62837P29561M65698
3555.6D22767563J830520l4370R58901J450119J220283M8027J263809J899567L59306
3564.3D31763725M254570M88243j723098J376991j460686K530174J707230M55742J147842
$$ y = [384894524, 385384407, 385624008, 385849495, 385870857, 387151947, 388708496, 388525620, 388902512, 389321518, 389521332, 390163765, 391299858, 392291107, 392782288, 393637886, 394099007, 394680367, 395483818, 396542816, 397657318, 397523346, 397698174, 398455582, 399237366, 399635048, 400211945, 400924454, 401638527, 402338638, 403126183, 404377251, 404703827, 406208076, 407528954, 407107620, 408153915, 408800621, 409265022, 410043373, 411440964, 412839661, 413931923, 414849625, 414652939, 415897827, 415570297, 415899773, 417527351, 419351501, 421971169, 421109467, 421572304, 422301865, 422767563, 424598083, 424563713, 425522614, 426972733, 428193016, 428241043, 429504852, 431404419, 431763725, 436018295, 436506538, 434783440, 436160431, 434699745, 437229919, 438937149, 439392891, 440540733]
3573D40540733J799279J567497R45244J789817M93622J934929J554985R957R52301
3581.7D51588364J119384K115326J235085L143997K596130j200332L96423j617432
3589.4D59376945K031289K822532K986870J643105l0976L342057j661835P43599L732109
3598.1D74985695L21121L010063J541825r8801J607628J149750J311225L191491L538627
3606.8D90558624j620865K392807M47350j927147O746292J635742l827591L480072
3614.5D97885284Q6480L742485N867233O97899R16862p27730l44047K547569K324982
3623.1E12997017J928100K439690K361374K701149P533073M757195j2201080M36782
3630.9E22953300L974457O350556K567520l359261J406250L219414K742577M83589
$$ y = [440540733, 442340012, 443907509, 444852753, 446642570, 447136192, 449071121, 450626106, 450636063, 451588364, 452707748, 454823074, 456058159, 459202156, 461798286, 460597954, 460994377, 459376945, 461408234, 464230766, 467217636, 468860741, 468829765, 472171822, 470509987, 471253586, 474985695, 475306816, 478316879, 479858704, 479759903, 481367531, 482517281, 483828506, 487019997, 490558624, 488937759, 491330566, 491777916, 489850769, 496597061, 498232803, 494405212, 497885284, 497971764, 501714249, 507581482, 508279381, 509196243, 508468513, 508124466, 510672035, 512997017, 514925117, 517364807, 519726181, 522427330, 529960403, 534717598, 522516518, 522953300, 526927757, 533278313, 535845833, 532486572, 533892822, 537112236, 539854813, 540338402]
3638.6E40338402P51304K796898K991028J762619J34735J687241L777923O682282J821022
3647.3E62743454l780785L891564p1526k351303j873779M727745M895935L734703O418648
3655.9E78334656o381989n40886M684143J184006J599693P71485J852684R03778J752586
3664.6E84160156J791458m43039M743958M313621m3449R01642p951317J89972Q263397
3673.3E95926399J0631943J779442j7546959J038856O365891M268150j675033N27534
3681F01316223K316895J257934J841889Q20007j00822L795509Q262596p673759o652718
3689.7F05183754Q907433n076447k470741M885711J065827J744041P05147l91960O41136
3698.4F15193901M273K252311L496056m274559l597031M688072K337304n71290l36151
$$ y = [540338402, 541089706, 543886604, 546877632, 548640251, 548774986, 550462227, 554240150, 560922432, 562743454, 558962669, 562854233, 562782707, 560431404, 558557625, 563285370, 568181305, 571916008, 578334656, 571952667, 571411781, 576095924, 577279930, 578879623, 579651108, 581503792, 582407570, 584160156, 585951614, 585508575, 590252533, 594566154, 594522705, 595424347, 587473030, 587663002, 595926399, 606558342, 608337784, 590790825, 591829681, 598195572, 602463722, 600788689, 601316223, 603633118, 604891052, 606732941, 607552948, 607452126, 611247635, 619510231, 611836472, 605183754, 614091187, 609014740, 606543999, 611429710, 612495537, 614239578, 614944725, 614552765, 615193901, 615198174, 617450485, 620946541, 616671982, 613074951, 617763023, 620100327, 619529037, 619192886]
3707F19192886K897148P001915o304435O42853M863014j4853287K999763N138741J112366
3715.7F22690964M78401J860390K452049l971672q66471O893502j253395o149445M542122
3724.4F26676445J464119m27132k846908j533814L773041J045456O194572L7156j0348359
3733.1F24034576Q482399M248887j0827714k009391J500549r66530K014961M226838
3740.8F30704575l858605K756386J4530487k127151k3404274O613388N580558O652069
3748.5F37447433j559333j3328781J1605415j141739j2053909M200363N665626M800377
3756.2F35635452n928879O22674P236289o779098m221840L425369J266938k36283M297028
3764.9F35317650j321182n730744K734108M982834J589890r147950K08359K737885
$$ y = [619192886, 622090034, 629091949, 622787514, 623430367, 628293381, 613440094, 616439857, 621578598, 622690964, 623169365, 625029755, 627481804, 623510132, 622643661, 629537163, 628283768, 622134323, 626676445, 628140564, 627713432, 624866524, 623332710, 627105751, 628151207, 634345779, 634382935, 624034576, 632516975, 636765862, 625938148, 623928757, 625429306, 624462776, 626477737, 630704575, 626845970, 629602356, 644132843, 642005692, 618601418, 625214806, 630795364, 637447433, 635888100, 622559319, 634164734, 633022995, 620969086, 625169449, 630835075, 635635452, 629706573, 630329247, 637565536, 630786438, 626564598, 629989967, 631256905, 631020622, 635317650, 633996468, 628265724, 630999832, 635982666, 637572556, 628424606, 628632965, 631370850]
3772.6F31370850l87650J048317K55547J064300Q6479K482109J096344q698234J419258
3781.3F29737320K284164J155358L537407k468224k260284J058082Q71468L03535o38809
3790F33580017p0991k07482J33133l71323J519700M304351l123207m645767J791878
3798.7F32910309L596802O789398l103790j3432503J444053K720414M946632P500343
3806.4F43371658q534813o784477M379502J953544K04201L61175m1656J075058O453018
3815.1F42437210L217926j7408485J555175O598969M959450L548279j5844689j028175
3822.8F28035660M335060J852264L150444J213951m835472j404762J939735L646737
3830.5F37933617K291755r580955J003151Q552093m414825j566734Q281059p725525
$$ y = [631370850, 630983200, 632031517, 632287064, 633351364, 633437843, 635919952, 637016296, 628318062, 629737320, 632021484, 633176842, 636714249, 634246025, 631985741, 633043823, 633915291, 634218826, 633580017, 633509026, 633301544, 633434677, 633063354, 634583054, 638887405, 635764198, 631118431, 632910309, 636507111, 643296509, 640192719, 626760216, 628204269, 630924683, 635871315, 643371658, 634836845, 628052368, 632431870, 634385414, 634589615, 634950790, 634909134, 635984192, 642437210, 645655136, 628246651, 629801826, 636400795, 641360245, 644908524, 629063835, 628035660, 632370720, 634222984, 637373428, 638587379, 633751907, 632347145, 634286880, 637933617, 640225372, 630644417, 631647568, 640199661, 635784836, 634218102, 642499161, 634773636]
3838.2F34773636o261444P946167l851471k173538P108154q47321n258751K166558
3845.9F33601990J304779k07520K325135n55573J135597O458702m673767J084900j3447265
3854.6F27026978k591439J0542832J59645k733002J644554J992226L486824m805069
3862.3F34723549j116448P380524m672317p155991K729950M954185P421456o639404
3870F37625504j2086602M010430P320060M877892j0302086j889954L854981L02467
3877.7F33712692J908188N610581l593102r055862M495659R19532J255303N827636
3885.4F41080627j3218727M9782M982834J059532M974213O10580r732780L42216L906517
3894.1F34054794j488495M17290J145821K225189K946548j0258712M018402L937797
$$ y = [634773636, 628512192, 636458359, 632606888, 630433350, 637541504, 636694183, 631435432, 633601990, 634906769, 634699249, 637024384, 636468811, 637604408, 644063110, 639389343, 640474243, 627026978, 624435539, 634978371, 635138016, 632405014, 634049568, 636041794, 639528618, 634723549, 633607101, 640987625, 636315308, 629159317, 631889267, 636843452, 644264908, 637625504, 625538902, 629549332, 636869392, 641747284, 631445198, 629555244, 633410225, 633712692, 635620880, 641231461, 637638359, 628582497, 633078156, 633997688, 635252991, 641080627, 627861900, 627911682, 632894516, 633954048, 638928261, 639538841, 629806061, 630148277, 634054794, 632566299, 632983589, 634129410, 636354599, 639301147, 629042435, 633060837, 636998634]
3901.8F36998634o153297M884834l467788l063202J293716P04041K332725l48015K11144
3910.5F33392792l00370q61969L38707L4447J275940J650047l683128l773270M577485
3919.2F32650681N83572m527054K131691J914291J750603r32579l669319Q77190J519088
3927.9F32298164J736679j427688j426392L030815k150764k801247J994705R62105
3935.6F32216377j84021J76506j09710m42543p45278J085510J738320l206749j103249
3944.3F29425163J154251P38793J342811k037277M21868O78100k751312J341133Q16040
3953F31129570j071968j81046N22614O07910l12614J28250r15108J22261J371689j189308
3962.6F30212250p11785P55310M32473l35389l47824P56302n302j081085K51884N27840
$$ y = [636998634, 630845337, 635730171, 632262383, 629199181, 630492897, 631196938, 633529663, 633181648, 633392792, 633092422, 632230453, 632569160, 632603607, 633879547, 635529594, 631846466, 628073196, 632650681, 633234253, 628707199, 630838890, 632753181, 634503784, 633571205, 629901886, 630779076, 632298164, 634034843, 632607155, 631180763, 634211578, 632060814, 629259567, 631254272, 632216377, 632032356, 632208862, 632099152, 631656609, 630911331, 631996841, 633735161, 630528412, 629425163, 630579414, 631318207, 632661018, 630623741, 631045609, 631723709, 628972397, 630313530, 631129570, 630057602, 629876556, 630399170, 631007080, 630694466, 630822716, 629907608, 630029869, 631401558, 630212250, 629500465, 630255775, 630688248, 630352859, 630005035, 630761337, 630756035, 629674950, 629926834, 630454674]
3972.2F30454674n1460n16549n59463J34849j41601Q12454L41568n13878P26662L1586
3981.9F30718842n61371p71218m40559N27496Q63152L23944n10635j59760r76524l44200
3991.5F28669167J74560n26924N33943J17302Q0605J05400l19252N77812M70810
4000.2F29883423
$$ y = [630454674, 630403214, 629886665, 629327202, 629462051, 629320450, 630132904, 630474472, 629960594, 630687256, 630718842, 630157471, 629386253, 628945694, 629473190, 630336342, 630660286, 630149651, 629989891, 629013367, 628669167, 628843727, 628316803, 628850746, 628968048, 629048653, 629154053, 628834801, 629412613, 629883423]
##END=$$ End of the data block
