##TITLE=$$ Begin of the data block
##JCAMP-DX=5.00 $$ ACD/SpecManager v 10.08
##SPECTROMETER/DATA SYSTEM=Varian
##DATE=08 Jan 2013 15:01:54
##DATA TYPE=INFRARED SPECTRUM
##DATA CLASS=XYDATA
##ORIGIN=
##OWNER=
##NPOINTS=3735
##FIRSTX=399.26403809
##LASTX=4000.35498047
##MAXX=4000.35498047
##MINX=399.26403809
##MAXY=71.20053864
##MINY=35.35271072
##XFACTOR=1.0000000000
##YFACTOR=0.000000100000000
##FIRSTY=55.88947296
##DELTAX=0.96440572
##XUNITS=1/CM
##YUNITS=TRANSMITTANCE
##XYDATA=(X++(Y..Y))
399.3 558894730 519056664 508207741 518171959 518021584 518593140 518808365 514123459 516978645 517059784
407.9 517059784 517875633 525918961 528766441 523902893 517713127 517017441 516528549 518404007 526586761
416.6 526586761 529275818 532899055 540656738 536831055 536885681 533220100 523062706 515983276 513006973
425.3 513006973 516604462 517739143 519418716 524723663 525605774 523415184 524774857 527294464 526276398
434 526276398 521858139 518956184 520395393 521261330 518509216 514734955 515000534 518424454 519763680
442.7 519763680 519453888 520161858 523310051 525914459 523190994 518985367 518684425 522301369 522574120
451.3 522574120 519623260 521152229 524526901 523900948 524358940 526754036 523558197 521088905 518383751
460 518383751 518132133 520551224 517465019 514751663 516497955 521241760 521777763 517853317 514156837
468.7 514156837 509726219 509774437 515111160 518937035 514197464 512803497 513671875 511400185 511517754
477.4 511517754 512748833 512672882 514995346 517798767 517974014 514651947 511429901 515630684 518355713
486.1 518355713 516729431 517131157 514085312 512644043 516251564 514987946 512436562 512555275 513056297
494.7 513056297 512617111 511547432 512266083 514426079 514263039 512820549 513555374 511308060 509132805
503.4 509132805 509065132 509012756 511141510 510581322 509058037 509895401 510535278 510793419 508971367 507516708
513.1 507516708 509165306 510144463 509210205 508300591 507562256 506630020 506157799 507317467 507193108
521.7 507193108 506794205 507818794 507682190 509337654 509979401 508663940 508209076 504957047 503530350
530.4 503530350 503742218 502179604 501592979 503465919 506189384 505755501 504078217 503434334 502610512
539.1 502610512 503319969 504455986 503972054 502982597 502683678 503098297 502072182 499747734 500450745
547.8 500450745 501982651 501400146 501517715 501476135 499748268 499115143 500723152 501373940 499860153
556.5 499860153 497508392 496174965 497675438 498954277 498029327 497475014 498189774 499493370 500576439
565.1 500576439 500132484 499364624 499045143 498055077 497543640 497398148 497845230 498198662 497640762 498612137
574.8 498612137 499598427 499133186 498371124 497568855 497167625 497018585 497013779 496402283 497070999 498969078
584.4 498969078 499394569 499915428 500711327 500252876 500179558 500779953 500190620 498675575 497317581 496988029
594.1 496988029 497748375 498240356 498983498 499631615 499970627 500324745 501177101 502203407 501261215 500047646
603.7 500047646 499418488 498306847 497758560 498042831 498580475 498024559 497194405 496952820 496530647 496820602
613.4 496820602 498065186 498244591 496945190 496931496 497986450 497523918 495987511 495749931 497572365
622 497572365 499161415 499887505 500929565 502294464 503066635 502493896 502438049 503425255 504027481 505252457
631.7 505252457 506357460 506278000 507003059 508906479 510100632 510852051 511827774 511922684 511829605 512439270
641.3 512439270 513111992 513709793 514674644 515832100 516297112 516437149 517099991 518002396 519035149
650 519035149 520178833 520238991 519832840 519995766 520234032 520502510 520612488 520833435 520215073 519314003
659.7 519314003 519437866 519264793 518883820 518984756 519409065 520056686 521906929 526828156 531185837
668.3 531185837 525292816 522349281 521755753 522619820 522920761 523456268 523663063 523941154 525309677
677 525309677 526272163 526788406 526942215 527093430 529521637 531653175 529971733 528852196 530902748
685.7 530902748 532904243 532917747 532606392 533790550 534081459 532744064 532382050 533292999 534323082
694.4 534323082 534652176 534409866 534426537 535056839 536450920 537308350 537374649 537783279 537616997 537310028
704 537310028 537314453 537343712 538025627 538805504 539415131 539386215 539022598 539635315 541129265 541953392 541949463
714.6 541949463 542418938 542710075 543324165 543832893 543513451 543726921 543802948 544235535 545371399 546155281
724.3 546155281 546664352 547141876 547596016 548179245 548889999 549011765 548716125 549013367 550480232 551659737
733.9 551659737 552023392 552410126 552347336 552362289 553512001 555656281 556013680 555347176 555616722 555319443
743.6 555319443 555355148 556195488 557791595 558197632 557676620 558489113 559309654 560463142 560942268 561055183
753.2 561055183 561820908 562418938 562828674 563535957 564388351 563890076 564714699 565718079 565387077 566211624
762.8 566211624 566805878 567294731 567037926 566418991 567195435 568303566 568616982 568870239 569438095 568595314
772.5 568595314 568104324 568253059 567982597 568572350 569588928 569934464 569503059 569555359 569818115 569795036
782.1 569795036 570073013 571120644 571830063 572014160 572817307 572915459 572707481 572348480 572206230 572342377
791.8 572342377 572324409 572881966 572911835 572693825 572397919 573119125 574068184 574187546 574549904 573889160
801.4 573889160 572499695 570606194 570158424 570093422 568748474 568467560 567834244 566365433 565584335
810.1 565584335 565445442 564123878 563267136 563486862 562489204 561586227 561070175 561021881 560048332 559564590
819.7 559564590 560778656 561113853 561741753 562516594 563974609 565849075 567648849 569420433 569970360
828.4 569970360 571334839 573308868 575728378 577934341 579133072 580438881 582554169 584997520
836.1 584997520 586452904 588111153 589028702 589753914 590635605 591242409 592280197 592866554 594139633
844.8 594139633 594887428 595351601 596327515 597220383 598021049 598508263 599544907 600121651 601294518
853.5 601294518 602578964 602516403 602221794 602909317 604887047 607083511 608946495 608943825 608849602 609294472
863.1 609294472 609527855 609953766 610147057 610245132 609029312 608877831 609029884 608337936 608038406 607028961
872.8 607028961 606368637 605524635 605095291 604233093 602850647 602813606 602517090 602059250 601569824 601417389
882.4 601417389 601926918 602394447 601894951 600785065 600170822 599586678 598802490 597197189 595995216
891.1 595995216 596066284 596634750 596652870 596197662 596058159 595539894 595621872 595442772 594458961 593921509
900.8 593921509 593795395 593762665 593681870 594329948 594862785 595987206 597688103 598742523 599491692 599450607
910.4 599450607 600022926 600620842 600494080 600530205 600187111 599240799 598420563 598126717 597332039 595640945
920 595640945 593498764 592365189 591352921 589495811 588457603 587954407 586498413 583840141 582058029
928.7 582058029 581170158 580186272 579344254 578175545 576451874 574662704 574424171 574024353 572162819
937.4 572162819 571094131 570892487 570253906 569068527 568570480 568203545 567060776 565331268 563507271
946.1 563507271 562884254 562847633 562733994 562547035 562140045 561945915 561388206 560575752 560086174 559629288
955.7 559629288 559051704 557622643 555374985 553148727 551673012 551452255 550672798 549351540 548761673
964.4 548761673 548219185 547413139 546556587 546133232 544833755 542912140 541688690 540011978 537933807
973.1 537933807 536037178 534633255 533355179 531924667 530467262 529138947 527352829 524873009
980.8 524873009 522635078 519413948 516052513 513334618 510377960 507315102 504277611 502537422
988.5 502537422 501410637 499640312 497025375 494576225 492971230 491523285 489698792 487180328
996.2 487180328 484906654 482972336 481712952 480518456 478465843 476483917 475166512 474312325 472947769
1004.9 472947769 471336174 469579086 467860641 466359444 465004616 463303528 461157532 460295868
1012.6 460295868 459498100 458052025 456699600 455645447 454659157 453270874 451623001 449919472 448843307
1021.3 448843307 446639442 444614525 443810005 442681694 442064857 441218224 440404968 439167671 437879143
1030 437879143 437345772 436663361 435562401 434442902 434482498 434857941 436034470 437675629 439290047
1038.7 439290047 440742455 441726151 442833595 443276520 444279327 445365105 445696182 445616417 445294876
1047.4 445294876 445207787 444361572 443716393 443329659 442836571 442152405 441419868 441202621 440776024 440326958
1057 440326958 440014076 440050468 439374237 439566116 440913467 441050491 441264343 442749100 445306091 446706276
1066.6 446706276 447555428 448603783 449612389 450617065 450731163 451244888 451339226 451461792 451546974
1075.3 451546974 451222878 451906967 451917572 451710739 452700272 454250526 454694176 454499092 454316330 454237900
1085 454237900 455144577 456412926 457827301 457860489 457727051 459044533 460393066 461004791 461347237
1093.6 461347237 462550163 463256493 463810959 464147224 463781967 464361992 465533752 466050072 465810547
1102.3 465810547 467149048 468931656 469300346 469578552 470305977 471311150 471621170 471429024 471062698
1111 471062698 471498070 472439880 472789574 473526230 474234772 474891090 475674019 476192894 476064949 476388054
1120.6 476388054 477242775 477146454 477713470 478330536 478013382 478058281 478459778 479343185 480799675 482325172
1130.3 482325172 483176651 483432617 484457817 486958122 488870659 489626198 490638504 492342567 494746094
1139 494746094 496094322 496017876 496129951 496821289 497941666 498806496 499063530 499545250 500312881 500737305
1148.6 500737305 500876579 501219482 501911774 501788139 500833473 500636330 501028290 500957832 500415001 500135117
1158.3 500135117 499907036 499492111 499285736 498700981 498423195 498813248 499313011 500503159 501910248
1166.9 501910248 503083839 504485016 506468620 508657341 510696106 512841606 515002937 517012444
1174.6 517012444 519267807 521414948 523452568 525230255 526566162 528488655 530376663 532199974
1182.4 532199974 533879166 535137863 536661606 538314743 539673271 540466690 541488953 542335281 542728081
1191 542728081 542676888 542142639 541844978 541810303 541625862 540996208 540940552 540742264 539959450 539461861
1200.7 539461861 538814201 538095551 536868057 535230217 533982773 533152122 532585945 532295647 531788254
1209.4 531788254 531208000 531326332 531574020 531407738 530860710 530450287 529961166 529022751 528428192 528174438
1219 528174438 527887192 527592239 527752075 527376823 526409645 526332855 526088181 525475655 524999809 524292564
1228.6 524292564 523627930 523244324 522897110 522294502 522027817 521927299 521482162 521405830 521541748 521372948
1238.3 521372948 521390343 521409492 520885201 520399857 520583878 521005173 521081848 520920181 520310364 519622955
1247.9 519622955 519576378 519694710 519441757 518900909 518869553 518786011 518352966 518489151 518498840 518110542
1257.6 518110542 517848778 518056755 518386421 518488579 518500633 518470497 519002037 519521294 519898605 520234146
1267.2 520234146 520529099 521521416 522293968 522872353 523339806 523788414 524645920 525258064 525712967 525898781
1276.9 525898781 526728210 527740364 528419762 529293251 529677582 530588531 531765442 532644920 533285065
1285.5 533285065 534124336 535285034 535396423 535208549 535295410 536050987 536844559 537342224 538351021
1294.2 538351021 539029655 539101028 538942719 539151611 539227943 539105606 539276352 539440956 539211693 538895340
1303.9 538895340 538976860 538739433 538649063 538550835 538621254 538627815 537701607 537149620 536680374 536251144 535612564
1314.5 535612564 534833412 534620171 534407730 534818611 535596581 536190491 536711426 537131348 537412834 537667847
1324.1 537667847 537946434 537962685 538125458 538194733 538232040 537902870 537380867 537174072 536869507 536932602
1333.8 536932602 537095909 537001305 536301651 536000214 536609497 536581650 535969925 535795937 536556206 537373199
1343.4 537373199 538063164 538736839 538997879 539194031 539247971 539700584 539528122 539043694 538981476 538813705
1353.1 538813705 538679237 538274117 538051300 537943306 538089676 537971802 538020020 538245697 537748566 537661705
1362.7 537661705 536212311 535986061 536505737 535759621 535338707 534966812 534399719 534262657 534699478
1371.4 534699478 534961815 534958649 534779587 534043732 534441528 534928513 534544525 533665237 533223419 533022499
1381 533022499 532612915 531985130 531266975 530923119 530719261 530828056 529519081 528267479 528045654 527387428
1390.7 527387428 526331711 524877701 524179420 522607689 519688454 518346596 517540779 517142830 515091820
1399.3 515091820 513456688 512745476 511375237 510011559 509096985 507301445 504901886 503843460 502869072
1408 502869072 501990356 501276550 500315285 499578934 498535690 497898903 497436333 496820602 496178055 495501823
1417.7 495501823 496102180 493171959 491869698 493158188 493322144 493835564 493673744 493802452 494931984
1426.3 494931984 495090866 495427437 495876617 495645599 495747261 496704903 497623558 498582764 500502586
1435 500502586 502801361 502756844 502348480 504339828 505513535 506388969 507593727 508067741 508980026
1443.7 508980026 509690704 510868492 512611771 513904381 513951263 514961853 517061729 518272247 518876228
1452.4 518876228 519493027 521305008 523148994 523699760 522776031 521740417 524257698 525894089 528350220
1461.1 528350220 529982338 531137009 533748360 533702545 533860016 535780563 537563972 538940811 540680656
1469.7 540680656 543491898 545654869 547255669 547483711 549630089 552980156 554122162 555115776 557278404
1478.4 557278404 558815231 559693489 559712143 560362778 562010384 563101273 563668404 565091782 565583344
1487.1 565583344 564703484 566574516 566617088 563661575 563424225 564109917 564161263 564050636 565255051
1495.8 565255051 561279907 560646553 560421677 557693253 558009834 557546387 557101135 557371864 558910294
1504.5 558910294 560512314 556986694 551624527 549931145 551094627 550795288 552169991 552244568 550030365
1513.1 550030365 550580177 551067085 551433334 550546227 546773224 547873955 550387230 549817543 547454987
1521.8 547454987 546705856 546690826 548045731 546018486 545394821 546201324 545399055 545216599 545534668
1530.5 545534668 545825577 546226387 545936508 541197090 542191620 543736153 544587631 547454491 548508759
1539.2 548508759 542711906 541684761 541908340 540812912 542158279 543104324 540334473 541024513 541034966
1547.9 541034966 541749573 541576920 539968338 541093674 541487274 543296814 541999550 540206680 542172470
1556.5 542172470 545727348 547482758 536204987 532738037 533887367 535841904 536198158 536130943 533655891
1565.2 533655891 531187019 530975800 530974350 532762451 525844727 523334618 522648392 520686150 519514008
1573.9 519514008 518684654 519589119 508980904 507509842 506865997 504851875 502697601 499690781 498029442
1582.6 498029442 494518242 492352180 489075966 486261444 483920135 480750313 479101982 475890770
1590.3 475890770 474264336 471320190 469436226 467172966 464267769 462731133 459454346 458241577
1598 458241577 455584602 454049225 451996422 450641937 450127068 447012024 445781326 443801880 443606148
1606.7 443606148 441629944 440557747 439669991 437007256 437003860 435227814 435142136 433638268 434152145
1615.4 434152145 435364418 429162369 430638161 430216255 430677567 429673691 430495071 430961761 428133736
1624 428133736 428829994 428751411 430631561 429226456 428768539 429756927 430355301 430886383 430521011 432665787
1633.7 432665787 434641075 434348335 431798134 433507996 433911018 434322281 435578804 435257378 436842232
1642.4 436842232 437356453 439627571 442447548 442803497 443302689 441537743 443778305 445300407 448912354
1651 448912354 453706932 458762398 448615990 447494850 451025925 452820892 454782410 455834274
1658.8 455834274 457382584 458924179 460560646 462535095 461406898 463536568 465015259 466811600
1666.5 466811600 469368248 472269287 473143845 473013268 476795349 477215385 479569931 483363647 485457726
1675.1 485457726 484514275 486581306 489982147 492125587 495380287 496801949 500144348 505889664
1682.9 505889664 509300461 507136841 507149696 511720695 515170403 517864609 520599251 522267838 525092201
1691.5 525092201 527843475 531379204 536457405 542384071 541268044 543675194 548289185 553829918
1699.3 553829918 558855858 550938835 556834068 561731682 565046196 567462578 569908562 571450233
1707 571450233 573382759 577266121 579984093 581049309 582832909 585464211 588758583 590142784 590286522
1715.6 590286522 593651314 597185135 591798477 592790184 596078110 598336754 600292587 601526566
1723.4 601526566 601979752 602999573 604164200 605098686 606311455 608689842 608856087 607948608 611438828
1732 611438828 615686684 615123062 609118652 612593307 616539192 618055229 620737419 621134262 618485870
1740.7 618485870 621950264 625217590 625521431 625540733 628351097 631379623 633941040 635945206 635739403
1749.4 635739403 639637833 641306534 640157013 643673935 646164627 648569565 651424026 651039505
1757.1 651039505 651911926 654354019 656906357 661042633 660272598 658397827 661336594 663159561 664211349
1765.8 664211349 665958633 668329544 665965271 666915741 671393738 672732086 671978683 668851547 671362534
1774.5 671362534 673738861 673189545 675021286 675606461 677050552 678225021 676683426 676905594 678483047
1783.2 678483047 680310059 679721832 679150848 680747681 682085648 682733612 684246979 685455170 686356812
1791.8 686356812 683981705 682239380 685689926 687015457 685907135 686645203 688806076 689103851 687379303
1800.5 687379303 689305420 689113007 689077225 690901260 691576004 692033081 692125854 692107925 692624435 693900833
1810.2 693900833 693179169 693359604 694242020 694230423 695396957 695707932 696476440 696360016 696087265 696926422
1819.8 696926422 697008896 697747498 697198181 697878418 699825211 697653275 697054367 699254227 701587982
1828.5 701587982 702757187 699049683 697995605 699895020 700337067 700844498 701334000 701423950 701357346
1837.2 701357346 700742493 701847382 702144089 702553101 703278580 705090866 706954575 701110001 701603622
1845.8 701603622 703540421 703521957 703449249 704002991 704948654 704791870 705111771 705071259 705318146 705630875
1855.5 705630875 705300827 705108795 704893112 705495300 705514297 705951004 706306076 706709061 707132187 707024307
1865.1 707024307 707769699 707749557 708677673 708265686 705882721 705973129 706877899 707673416 707355423 707385712
1874.8 707385712 707518616 708059998 708546295 708500214 708415222 707862930 707943344 707594376 708042526 708417740
1884.4 708417740 707988663 708067703 708020172 709549103 710138168 708097610 708087158 709167023 709051056 709128952
1894.1 709128952 709605255 708589630 708691254 708927078 709116440 709548492 709585724 709850693 709674835 709861908
1903.7 709861908 709822464 709690781 709719162 709616241 709483414 709460373 709370422 708886490 709601974 709713516
1913.3 709713516 709722366 709723358 709982224 712005386 710420074 708713074 709567490 709995193 710607681 709970474
1923 709970474 709266510 709412231 709312897 708998718 709305801 709579086 709660492 709742355 709552994 709749756
1932.6 709749756 709224625 709168320 709672394 709594345 709148788 708959503 709236755 708878708 710052261 710513077
1942.3 710513077 708079224 708201981 709102478 709100800 708560944 708176117 707885132 707789307 708089142 708289337
1951.9 708289337 708203049 708122482 708334503 708088226 707837906 707634430 707723618 707857513 707420731 707188873
1961.6 707188873 706945343 707221451 707545624 707781067 708127975 707656097 707007980 706979141 707225571 706988144
1971.2 706988144 706991653 706936569 706935959 707288895 707167282 707042160 706632309 706403732 706264191 706431046 706589813
1981.8 706589813 706177826 706250305 705918121 705648727 705731277 705890350 705631638 704821777 705386047 706046829
1991.5 706046829 705162888 704745865 705402374 705480728 705405731 705307693 704729843 704604568 704424973 704385223
2001.1 704385223 704161606 704114151 704162827 703724136 703682938 703644485 704017487 703835068 703288116 703349380
2010.7 703349380 703269653 703196411 702973785 703024750 703004990 702578964 701709366 701323929 701640091 701788177
2020.4 701788177 702036667 701829224 701792984 701736832 701572723 701389771 700786362 700650101 700353928 700182648
2030 700182648 700088730 700130310 700214005 699920425 699803772 699575424 699584885 699217072 698776855 698641891 698919067
2040.6 698919067 699329987 698986969 698798065 698413467 698595200 698684464 698212051 697892380 697379990 697661209
2050.3 697661209 697728043 697618256 697511673 697444763 697645035 697469788 697440109 697204361 697089691 696663513
2059.9 696663513 696403732 696358261 696061707 696497650 696462326 696185074 696004257 696116714 696319504 696031723
2069.6 696031723 696218185 696483231 696379700 695987015 695850220 695529099 695375061 695507202 695163116 695033417
2079.2 695033417 694866409 695052185 695051727 694931870 695085373 694895020 694602127 694134979 694387817 694636383
2088.9 694636383 694451370 694198914 693924713 693720474 693504868 693698349 693431625 693525925 693569336 693258514
2098.5 693258514 693376083 692994385 692710876 692429352 692388000 692331696 692449112 692769623 692201920 691727524
2108.1 691727524 691520691 691651382 691700439 691638031 691336823 691199341 691703491 691405411 691239243 691097717
2117.8 691097717 690909882 690965576 690936813 690990677 690555420 690411224 690214157 690109482 690252762 690235062
2127.4 690235062 690270615 690277405 690553131 690462494 690527954 690457611 689953690 689676971 689585953 689726715 689801407
2138 689801407 690108795 689851456 689611511 689755936 689706039 689866333 689570160 689384232 689627686 689818115
2147.7 689818115 689481049 689284821 689385834 689354095 689533691 689350739 689520721 689142151 688637238 689008484
2157.3 689008484 689091034 689100800 688800659 689024048 689289703 689334183 689567108 689454575 689415131 689397583 689921494
2167.9 689921494 689895859 689367828 689205856 689357224 689705582 689412155 689283676 689147415 689562302 690187912
2177.6 690187912 689905853 689731216 689833984 690075607 689884109 689697495 689443512 689150772 689138412 689143219
2187.2 689143219 689539032 689768066 690080795 690169601 690199966 690106735 689599609 689588013 689573212 689791489
2196.9 689791489 689671707 689445572 689812775 689811935 689663391 689888840 690329361 690335083 690240555 690175705 690115356
2207.5 690115356 690003815 689812317 689675293 689608002 689942245 689832230 690062943 690300217 690077438 690473404
2217.1 690473404 690750122 690782318 690333862 690372620 690561066 690225525 690099182 689977951 690193100 689856720
2226.8 689856720 689638824 689893723 690235901 690559616 690352631 690444565 690398788 690310440 689961395 689776230
2236.4 689776230 689891357 689701843 689835281 689709549 689844055 689818649 689674530 689779282 689761581 690092621
2246 690092621 690221863 690320206 690135040 689987106 689859924 689833679 690038910 689868240 689913101 689749908
2255.7 689749908 689918137 690255890 690620270 690506516 689898529 690201035 690126953 690138550 690059662 690050583
2265.3 690050583 690254211 690216217 690423584 689686203 689785995 690456009 690492172 690173111 689940186 690026398
2275 690026398 689512329 689868774 689821930 689655075 689636917 689052658 689347305 689319839 689645233 689728088 689587784
2285.6 689587784 689871216 689970551 690258179 689838028 689817352 689743729 689894562 690215073 690065536 690681305
2295.2 690681305 690741882 690952301 691149673 691116257 691238708 691281128 692019043 692047272 691744080 691779251
2304.9 691779251 692624512 693775558 694104843 694635391 694954224 695278549 695503616 695621109 695578003 695291595
2314.5 695291595 695904922 695932159 695597992 696452560 698344269 700187073 700622864 700868454 701575012
2323.2 701575012 701733856 702122955 702600708 702931061 704109116 704999924 704739075 704142838 703524628
2331.9 703524628 703260345 703089447 702906342 703707809 704542770 704683380 705574036 705651321 704980316 705195084
2341.5 705195084 705408630 704555969 703161469 702446289 701298981 699024963 696479874 697105408 700150452
2350.2 700150452 701180115 703175507 705163040 705857544 708466949 709415436 710636597 710317917 710359344
2358.9 710359344 711386719 710077133 709809265 710672760 710999603 708865662 707645950 707033539 704643555
2367.6 704643555 702037201 700252914 698923111 697579041 696694946 695088425 693926926 692733459
2375.3 692733459 690917130 689520798 688097687 687255936 686384659 685422516 684424973 683511658 682924500
2383.9 682924500 682038651 681198654 680496902 680506516 680516663 680188522 680149536 679864578 679894409 680012131
2393.6 680012131 679869614 679568939 679355850 679056549 678660278 678851776 678932953 678950043 678740768 678304749
2403.2 678304749 678143539 678212585 678366928 678082733 677563324 677034836 677309418 677757950 677446594 676954346
2412.9 676954346 676473694 676549759 676495514 676181107 676127472 675922165 675612106 675578232 675449982 674990387
2422.5 674990387 675064011 674979706 674673309 674494858 674276199 674264679 673868713 673653793 673577957 673405533
2432.2 673405533 673294296 673012543 672881393 672841034 672900848 672711868 672345200 671937637 671680527 671571579
2441.8 671571579 671068039 670731888 670919952 671188660 670737000 670136261 670003891 669857407 669685059 669584732
2451.5 669584732 669371185 668804855 668808899 668911285 668551865 668192596 667977295 668492279 668548965 668009338
2461.1 668009338 667552643 667248154 667241440 667050705 666843491 666490631 666155777 665689926 665299072 665285492
2470.7 665285492 665064545 664875259 664719772 664785843 664822845 664541702 664024658 663388214 663062744 662990875
2480.4 662990875 662799530 662174683 662048950 662095871 661705322 661564102 661432877 661248322 661043243 660669174
2490 660669174 660109406 659982910 659792328 659253922 659143753 658828888 658381653 658052368 657950211 657766724
2499.7 657766724 657680969 657732620 657215958 657036514 656566467 655832596 655610352 655626373 655525894 654854584
2509.3 654854584 654774399 655043411 654901047 654440002 653994370 653748093 653378220 653336182 653204803 652869263
2519 652869263 652468185 652018356 651741180 651722107 651703796 651429749 651628265 651730804 651610260 651030350
2528.6 651030350 649931717 649524918 649620743 649899597 649781342 649429092 648875046 648412552 648355103 648136902
2538.2 648136902 648330154 648292618 648029022 647597122 647046661 646942062 646666565 646281433 645644684 645588760
2547.9 645588760 645748062 645413361 645283813 644955444 644877930 645062103 644976807 644450684 643896790 643648758
2557.5 643648758 643216400 642745667 642518463 642287598 641803818 641674652 641537857 641464767 641385117 640903091
2567.2 640903091 641083755 640997467 640842209 640754547 639976196 639492340 639102211 639004250 639168777 639032860
2576.8 639032860 638746758 638509331 638387184 638253860 638032799 637677765 637413330 636926231 636591911 636432762
2586.5 636432762 635866661 635360909 635275612 635452194 635250816 634998970 634841385 634813423 634835472 634309692
2596.1 634309692 633757324 633424301 633486328 633160400 632274094 631802330 631642342 631693382 631600800 631514473
2605.7 631514473 631355362 630946503 630547714 630193443 629888039 629546051 629289360 628737907 628365059 628358841
2615.4 628358841 628110428 627725296 627431984 627352448 627073479 626766548 626629333 626557579 626065865 625310860
2625 625310860 625012932 624709740 624529533 624334221 624184074 624143715 624060440 623870697 623342209 623245010
2634.7 623245010 622870712 622105370 621361656 620833282 621106720 621161270 620864182 620241356 619756851 619864273
2644.3 619864273 619876633 619585762 618984566 618582344 618223801 617758026 617195511 616841583 616904297 616790810
2654 616790810 616675682 616434784 616080933 615891418 615865631 615447617 614622955 614145164 613912849 613960457
2663.6 613960457 613771019 613372803 613154907 613084869 613242111 613157120 612976265 612514572 611987228 611782494
2673.3 611782494 611337547 611056900 611271515 611005211 610464172 610393562 609925156 609604073 609722710 609456711
2682.9 609456711 609044952 608728256 608584976 607943344 607317581 607330399 607253990 606752205 606355362 606331062
2692.5 606331062 605938072 605834236 606028481 605988312 605652695 604999390 604507256 603939323 604056396 604117050
2702.2 604117050 603327446 603005066 603190804 603199883 603065948 603210526 602905121 602746162 602763672 602167892
2711.8 602167892 601608582 600920830 600590973 600356865 600398483 600473671 599908485 599850082 599590874 599123726
2721.5 599123726 599028168 599181442 599269676 599027061 598823891 598327293 597958145 597604752 597305679 597502136
2731.1 597502136 597721634 597379112 596535835 596536942 596996231 597257385 597228241 596678619 596349106 595943527
2740.8 595943527 595356789 595152359 595137405 595172653 595296326 595183525 594956131 594800148 594572792 594315453
2750.4 594315453 593945122 593550148 593166695 593325119 593554420 593419571 593531189 593458786 593290787 592671013
2760 592671013 591897850 591675758 591699219 591815720 591601334 591290092 590719223 590684700 591081161 590807800
2769.7 590807800 590622559 590256081 589945679 589956360 589969406 589585876 588915787 588590927 587981567 587666016
2779.3 587666016 587523041 587329597 587507133 587426224 587207756 586764450 586286697 585906982 585789413 585863304
2789 585863304 585696983 585506058 584764252 584126167 584221153 584117966 583785515 583544540 583241119 582830009
2798.6 582830009 582200813 581419373 581031303 580848579 580588036 580188828 579727249 579454918 578942261 578583488
2808.3 578583488 578630905 578272896 577720718 577294273 576639824 576098785 575808640 575536995 575247307 574518967
2817.9 574518967 573816376 573546104 573283386 572855759 572451553 572105675 571352692 570682640 570340691 570015297
2827.6 570015297 569492264 568509560 567722359 567380867 567259521 566755333 565792580 565218925 564924011 564498291
2837.2 564498291 563628426 562497520 561637993 560627670 559176750 557982101 556774788 555454369 554592361
2845.9 554592361 553230896 551665421 550306892 548448944 547281456 546905403 546048965 545237579 544975739
2854.6 544975739 544890518 544955902 544958267 544917984 544839020 544673615 544825630 544942551 544748611 544406204 544201508
2865.2 544201508 544167290 544216843 544042320 543087540 542126694 541536598 541336594 541171303 540691490 540635185
2874.8 540635185 540404816 539615974 538978424 538794289 538527565 538203697 537967186 537360306 536897125 536335640
2884.4 536335640 535749016 535306702 535078506 535059891 534068069 532810593 532126808 531922684 531398506 530683098
2894.1 530683098 530564346 529781494 528876190 528521118 528142891 527484856 526718788 526235046 525726166 525644226
2903.7 525644226 525643845 525243912 524453545 523532791 523058090 522382469 521439285 520696754 520174446 519258614
2913.4 519258614 518335304 517575111 516291275 515278015 514246407 513048973 512151451 511667938 511479645
2922.1 511479645 511140747 510956917 510564346 510334167 510443993 510717812 511343918 511542282 511491127 511625252
2931.7 511625252 511978683 512147598 512424164 513358231 513853912 513677330 513838615 514506378 514954834 515416870
2941.3 515416870 516198082 516802635 517257347 517679214 518156166 518623390 518796730 518945580 519380341 519602089
2951 519602089 519610023 519447556 519432907 520145760 520544090 520451660 520160255 520252571 521130676 521712914 522035751
2961.6 522035751 522134361 522287254 522625618 522713242 522945366 523333740 523847542 524324074 524654236 525173759
2971.2 525173759 526032410 526632996 526740303 526855469 527098503 527395744 527339554 527621193 528391724 528511200
2980.9 528511200 528244400 528431740 528907242 529072037 529327087 529395370 529352951 529615860 529315529 529247742
2990.5 529247742 529692230 529482384 529118538 529470901 529800491 529572411 529034348 528487968 528407555 528353424
3000.2 528353424 528320122 528366699 528301277 527937660 526928291 526082382 525754433 526000137 526141701 525786743
3009.8 525786743 525640640 525429611 525039825 524617500 524435730 524170647 523607635 522893410 522067757 521640511
3019.5 521640511 521323662 521259499 521233215 520734177 520518990 520613174 519998283 519044762 518452568 517881126
3029.1 517881126 518002052 517814560 517095718 517049141 516372833 515516891 515165291 514901619 514540176 514276810
3038.7 514276810 514267120 513877487 513233871 512323227 511719933 511351662 510746346 510051994 509344673 509129753
3048.4 509129753 508768005 508475685 508279266 507872581 507446747 506771584 506419373 506130943 505876160 505301170
3058 505301170 504661102 504301720 503411636 503114510 503085136 502616615 502248993 502034454 501997261 501580086
3067.7 501580086 500693169 499913712 499946556 499764709 498813515 498371353 498070412 497802505 497943001 497675209
3077.3 497675209 497005196 496404343 495610733 495303192 495323448 494764442 494334335 494166412 493826637 493141174
3087 493141174 492770844 492818642 492470589 492127495 491734200 491175537 490630493 490266151 490005455 489273529
3096.6 489273529 488669281 488506165 488320999 488063850 487808762 487265053 486487198 486042328 486002159 485836601
3106.2 485836601 485330963 484835739 484053993 483185349 482769585 482537537 482323036 482224045 482229004 481877441
3115.9 481877441 481206894 480385818 479970512 479699173 478755035 478218689 477806664 477245903 476839142 476208572
3125.5 476208572 475901451 475215988 474154549 474031029 474180489 473833008 473568497 473068047 472314110
3134.2 472314110 471809425 471176796 470789719 470382843 469915466 469557838 469179611 469142914 468427391 467638054
3143.9 467638054 467583809 467281647 466688614 465868797 465190277 464928665 464644165 464082947 463523254 463098526
3153.5 463098526 462437363 461581879 461251640 461469994 461155968 460057907 458949471 458601646 458442688
3162.2 458442688 457693481 456712723 456155548 456333389 456077995 455372353 454955406 454560204 453976288 452944069
3171.8 452944069 452086601 451736107 451799698 451399727 450547142 450375938 449921684 449247856 448810577 448420830
3181.5 448420830 448018608 447159996 446404991 445867767 445478745 445061798 444350319 443830223 443484993 443138008
3191.1 443138008 442640266 442070427 442055511 441928139 441169662 440892220 440552635 439831543 439112854 438387566
3200.8 438387566 438425255 437876396 436766739 436439896 436246376 436028328 435566673 435030632 434391365 433408813
3210.4 433408813 432816734 432907448 432755928 431641884 430718689 430441856 430270157 430185966 430269547 429900322
3220 429900322 429120598 428446350 427521439 427179146 427078285 426512909 426093750 425748558 425480576 424900856
3229.7 424900856 424426384 424339066 424059258 423538246 422799492 422176819 421764526 421447716 420978775 420581398
3239.3 420581398 420134430 419636002 419533157 419187622 418972816 418907013 418434143 417832527 417021408 416363983
3249 416363983 416130447 416080704 415674591 415289459 415448875 415037003 414217072 413969116 413445015 412861137
3258.6 412861137 412927704 412692261 412202759 411349525 410413208 410377235 410451851 410404320 410191383 409904060
3268.3 409904060 409988060 410106659 409615440 408437996 407983284 408228073 408114281 407763786 407066460 406161842
3277.9 406161842 405829582 405907631 405585022 405450478 405311089 404841576 404707870 404207726 403756790 404010620
3287.5 404010620 403881226 403332367 403046341 402847939 402570152 402146111 401700249 401656342 401499290 400752640
3297.2 400752640 400096321 399753380 399542732 399595642 399300194 398608437 398034744 397411995 396959457 396768150
3306.8 396768150 396807213 396567841 396173172 395931244 395326691 395177002 394891167 394143295 393521805 392869263
3316.5 392869263 392586174 392134132 391845970 391457138 390945511 390972137 390672646 390345116 389616127 388529968
3326.1 388529968 387890205 387519913 387053909 386254463 385757675 385308647 384789886 384481544 384238815 383689156
3335.8 383689156 382810211 382085648 381228981 380550575 380153580 380088120 379841232 378712234 377809982 377261772
3345.4 377261772 376611137 376171684 376258354 375960121 375102425 374337120 373460960 372954941 372568321 372514305
3355.1 372514305 372206116 371263199 371498108 372000351 371492462 370511780 369812393 369403076 369125023 368667450
3364.7 368667450 367991714 368037262 367507935 366129341 365699806 366274147 366457367 365597763 364538307
3373.4 364538307 363846283 363702316 363288574 362760162 362542877 361940651 361406555 361186714 361382713 361310692
3383 361310692 360984764 361009293 360446930 359579201 359193420 359503746 359759293 359256210 358723831 358305588
3392.7 358305588 357716103 357612267 357757263 357393608 357144928 357154655 357244415 356884956 356257057 356201553
3402.3 356201553 355661507 354905434 354709473 354902229 355263786 355433044 355200310 354698486 354871368 354993744
3412 354993744 354478722 354035873 353810081 353578529 353527107 353992882 354196205 354289970 354074287 353794212
3421.6 353794212 354172745 353999901 353655167 353563995 353565750 353808746 354009628 354003296 353941116 354007111 353972321
3432.2 353972321 354023132 354335022 354865303 354956779 354734459 354593544 354287262 354261208 354671974 355551567
3441.8 355551567 355607224 355492210 356163063 356924820 357632828 356604118 356485558 357529831 358119545
3450.5 358119545 358913307 358585701 358313751 358540878 358957291 359516220 359662628 360365257 360812683 361260948
3460.2 361260948 361972961 362084541 362133446 362691078 363411293 364218826 364877777 364774971 365365410 365831604
3469.8 365831604 365589676 365978622 366555290 367673569 368345795 368176537 368796463 369762230 370201225
3478.5 370201225 370711937 371457443 372006645 372066231 371551895 372261963 373434525 374212685 375026512 374598885
3488.1 374598885 374511566 375739594 377044983 377689629 377865219 378398399 379269409 379963264 379731331
3496.8 379731331 379974174 380982475 381447830 382060852 383285332 383976936 384360466 385290489 385594864
3505.5 385594864 385783195 386477852 388077278 389061584 388266907 388896370 389713478 390141602 390777588
3514.2 390777588 391457672 392351685 392725716 393538857 394339867 394948158 395890884 397440338 399015846
3522.9 399015846 398915024 399022827 399887619 400993195 401702271 402073059 402336693 402789879 403485146
3531.5 403485146 403742523 404605217 405656357 407982140 409278755 407935944 408946724 410628166 411489334
3540.2 411489334 411538658 412353554 414335480 415995369 416886711 416451225 417576447 417460175 418022957
3548.9 418022957 420299187 421864738 423546104 423088608 423942108 424720230 425039597 426939850 427893105
3557.6 427893105 429345093 430699921 431519432 431374931 432931824 434699211 434859886 439091873 440002098
3566.2 440002098 438168182 438876953 438844795 441962013 443461952 444117813 445153999 446778870 447980614
3574.9 447980614 448906212 451088181 451308327 453438721 455801964 455774002 456518555 458528748 460444946
3583.6 460444946 459997253 463298836 466797104 465841789 467117691 465447617 466976585 469500046 472644539
3592.3 472644539 475205002 475208549 478223763 477328949 478249321 482023354 482758064 485599670 486147003
3601 486147003 484733543 486503792 488788757 490299644 493060989 496094551 494798851 498082809 498478928
3609.6 498478928 496103134 503581505 506647644 503193130 507090988 506394081 509142609 514787827
3617.4 514787827 515874443 517567291 515822830 515548325 518875580 521218643 523401642 526243896
3625.1 526243896 528941269 531021729 537846107 543017883 530600243 531509972 535200500 540562363
3632.8 540562363 543270836 541141624 542711754 545859528 548907814 549378815 550031967 552890205 556014404
3641.5 556014404 557669830 557685585 559741249 563628387 569788132 569941559 565602913 570593834 570963173
3650.1 570963173 567995033 566349869 571633682 576298790 580183296 587942276 580924072 579857292
3657.9 579857292 585322800 587125359 589036751 589072571 590086555 591060028 592915268 595354576 595763016
3666.5 595763016 600265388 603789902 603704567 604329491 596127129 596943703 604751816 614770393 618289070
3675.2 618289070 602281837 601893005 607330742 612170677 610988693 610845451 613428955 615171051
3682.9 615171051 616629906 616590195 616608963 620800934 628213272 619654808 614163437 624034653 619407463
3691.6 619407463 617402573 622412682 622580414 624149323 625486603 625222054 625843658 625607529 627226753
3700.3 627226753 630692787 626797905 622740974 627264061 629836807 629735832 629827385 632361755 638298416
3709 638298416 632190132 633498421 638012657 623749847 626670341 631218834 631795769 632201767 634087601
3717.7 634087601 636154137 633477097 633594933 639385223 636759987 630951271 636261520 638161392
3725.4 638161392 638071442 635894623 634659729 638365860 639291077 645445709 644914322 633734322 641390076
3734 641390076 646140900 637627220 635464973 637740135 636886673 637519836 640633621 636670609 640022964
3742.7 640022964 654510803 649125137 626381874 634302101 639830246 646111984 645028229 633295479
3750.4 633295479 644598770 642060852 631709518 636239090 641017456 645054703 638616409 639723091
3758.2 639723091 647525101 640915604 637022247 640337448 641481171 641372910 645373688 643210297
3765.9 643210297 637121277 640523224 646332092 648382416 639410744 639259987 641814117 641554413 642851486
3774.5 642851486 643294830 643940125 643460312 645630341 647061081 639036179 640367584 643010712 644389114
3783.2 644389114 646972351 643616104 641743546 642884445 643124161 643158875 643262405 644168396 643912048
3791.9 643912048 643501205 642907486 643895187 647965775 645567932 640793762 642450409 646431351 653824310
3800.6 653824310 652817841 639329071 639257011 641379776 646213074 653871307 646525497 639695282
3808.3 639695282 643003616 644420242 644383087 644334412 644099503 645244904 652309647 655683517 638350487
3817 638350487 640203171 645934677 650705948 655543060 638895988 637955551 642791214 644197464 646848755
3825.7 646848755 648049316 643788681 642647781 644010010 647936096 651429901 642229919 643100510
3833.4 643100510 651310425 646639481 645061951 653601837 646405029 639523582 646187515 641459122
3841.1 641459122 640518570 647763062 646598206 642270660 644323120 645239716 645028763 647100220 646708069
3849.8 646708069 648774338 655693359 650522842 650928497 637535553 635384483 645492325 644885483
3857.5 644885483 641856461 643880844 646240158 649392319 644222565 643422394 651449890 646261520
3865.2 646261520 638923149 642092819 647654800 656557465 650028305 636949921 639535484 645649567
3872.9 645649567 650718918 641306763 640345078 643813019 643617477 645771484 651597977 648330765 638393173
3881.6 638393173 643229370 644622345 645426559 651712036 639228668 638649673 643137589 644002914 648110809
3890.3 648110809 648341980 640151596 640445404 643662567 642039566 642706451 644118423 647034912 650265961
3898.9 650265961 639620399 643858948 648130341 641657562 645800476 643947678 641753769 641255417
3906.7 641255417 640965271 643550262 643548508 643093033 642541733 642257385 642616806 642461853 643815613 646012421
3916.3 646012421 642400742 638413734 643481293 645361557 641327591 642418671 643399963 644638824
3924 644638824 643702774 640199509 641350937 643042603 643932266 642313004 641197586 643981857 642296906
3932.7 642296906 639939919 641611252 642067184 642180099 642852325 642454987 641838150 641328354 642511978
3941.4 642511978 643844147 639750938 638819389 641017075 642398071 643496094 640900269 641495285 642046967
3950.1 642046967 638946648 640477676 641248093 640541229 640396652 640936356 642041550 641195984 641235352
3958.7 641235352 640492935 640041351 641077194 640342636 640294418 640691452 640499115 640081558 639811859 640708923
3968.4 640708923 641039963 639924316 640254898 641203918 640033035 639290771 639837875 640000916 639957275
3977.1 639957275 640824356 641256790 640252991 640492249 641185684 640804825 640306854 639857025 639750519
3985.7 639750519 640322952 640506134 640320663 641170044 640915222 639696655 639682388 640100937 640345917 639583397
3995.4 639583397 638953056 639173775 639739304 640165100 639854660
4000.2 639854660
##END=$$ End of the data block
