##TITLE=$$ Begin of the data block
##JCAMP-DX=5.00 $$ ACD/SpecManager v 10.08
##SPECTROMETER/DATA SYSTEM=Varian
##DATE=08 Jan 2013 15:01:50
##DATA TYPE=INFRARED SPECTRUM
##DATA CLASS=XYDATA
##ORIGIN=
##OWNER=
##NPOINTS=3735
##FIRSTX=399.26403809
##LASTX=4000.35498047
##MAXX=4000.35498047
##MINX=399.26403809
##MAXY=71.43931580
##MINY=35.32131958
##XFACTOR=1.0000000000
##YFACTOR=0.000000100000000
##FIRSTY=51.94575500
##DELTAX=0.96440572
##XUNITS=1/CM
##YUNITS=TRANSMITTANCE
##XYDATA=(X++(Y..Y))
399.3E19457550j0798607N078850O583328P94754j038093o74019M191551r76944o02455
$$ 519457550 508658943 513737793 520321121 521115875 520077782 519403763 523595314 522618370 522015915
407.9E22015915K699127l263740j265793j871186n47332j809121n853691K900772Q155556
$$ 522015915 524715042 521451302 520185509 518314323 517766991 515957870 510104179 513004951 521160507
416.6E21160507L566780k043457j632805L591919j999511n669136n87731K18582J5602
$$ 521160507 524727287 522683830 521051025 524642944 522643433 516974297 516386566 516605148 516620750
425.3E16620750J74790j096115O490402K283592l921966k975197l598709L233223L778610
$$ 516620750 516795540 515699425 522189827 524473419 520551453 517576256 513977547 517210770 520989380
434E20989380J120872M651070L870201n879135r286079K155761O447640k302704m202042
$$ 520989380 522110252 526761322 530631523 524752388 515466309 517622070 524069710 521767006 517564964
442.7E17564964O70739K707176L067093o03943j299057L214264J902351j862411n653840
$$ 517564964 518235703 520942879 524009972 523406029 522106972 525321236 527223587 525361176 519707336
451.3E19707336j580696L236008k512932J555138M818001k616883l016624K240333
$$ 519707336 518126640 521362648 518849716 520404854 525222855 522605972 519589348 521829681
459.1E21829681j181984m957847o247597K030487N967255k280350j075478J786194
$$ 521829681 520647697 515689850 509442253 511472740 517439995 515159645 514084167 515870361
466.8E15870361k501678J88789M105606R66225J40800K322503m444695k525368n15022
$$ 515870361 513368683 513557472 517663078 518629303 518770103 521092606 516647911 514122543 513607521
475.5E13607521k985039J057816M272613J085892k743797k01569l05939l092727K724342
$$ 513607521 510622482 511680298 515952911 517038803 514295006 514093437 513787498 510694771 513419113
484.1E13419113O586456n83000p021866k600402j92070R45777R37729m123268N07584
$$ 513419113 520005569 519422569 512400703 509800301 509608231 510554008 511491737 507368469 507876053
492.8E07876053L062782p133o69556J278496K257576m72832j99013o97212j74217j599846
$$ 507876053 510938835 510931702 510262146 511540642 513798218 513325386 513126373 512429161 512254944 510655098
502.5E10655098l874359J820831K427063j875458j07841K800789j924515l114395Q99887
$$ 510655098 506780739 508601570 511028633 509153175 509045334 511846123 509921608 506807213 507707100
511.1E07707100O637J261406J287194k045403j591263j985588k363052K1629J634941
$$ 507707100 507713737 508975143 510262337 508216934 506625671 504640083 502277031 502298660 503933601
519.8E03933601J290207M98543K98615J059188L149186J135940m977226k683411J696129
$$ 503933601 505223808 505722351 506020966 507080154 510229340 511365280 506388054 503704643 505400772
528.5E05400772J449394j249160j878434r83009j617470N04723K510795O97251j328812
$$ 505400772 506850166 505601006 503722572 502739563 501122093 501626816 504137611 504834862 503506050
537.2E03506050j917190K70729j488r24301R51462k8191J21460O18629j635475m06875
$$ 503506050 501588860 501859589 501858101 500933800 501885262 501857071 501978531 502597160 500961685 500554810
546.8E00554810J590614L79295p46193j325988j543465o69556L54424L81012m29230
$$ 500554810 502145424 502524719 501778526 500452538 498909073 498239517 498593941 498974953 498545723
555.5D98545723j054840j355362k71759k05917k15798J906510R10758k54020J024399
$$ 498545723 497490883 496135521 495863762 495657845 495442047 497348557 498259315 498005295 499029694
564.2D99029694J03263j496200k42767j25199q86917J685486L40385o28051J801185
$$ 499029694 499132957 497636757 497393990 497268791 496381874 498067360 498407745 497779694 499580879
572.9D99580879N89905l26118j76926r55048j163635l18947o8436l24897J050033N7221
$$ 499580879 500170784 499844666 499667740 498712692 497549057 497230110 497161674 496836777 497886810 497944031
582.5D97944031o04058R0981l43437l56713L84827J060639O55250R55620l06015k306442
$$ 497944031 497339973 497430954 497087517 496730804 497115631 498176270 498831520 499787140 499481125 497174683
592.1D97174683l38784K91596L76777J888085J236572K07596P78580j41564p67326
$$ 497174683 496835899 497127495 497504272 499392357 500628929 500836525 501615105 501473541 500706215
600.8E00706215M69665k38723j781769j342278m24728j53008P26967q8272j173668
$$ 500706215 501175880 500937157 499155388 497813110 497388382 497235374 497962341 497874069 496700401
609.5D96700401n53131j04866J293068K96974j346435m18015J15891J16768L68042
$$ 496700401 496147270 496042404 497335472 497632446 496286011 495867996 495983887 496100655 496468697
618.2D96468697O00395p58972m55056J142350J282119J517563Q54759P33452P94716
$$ 496468697 497069092 496310120 495855064 496997414 498279533 499797096 500651855 501385307 502180023
626.9E02180023j14708l17840O27937J663780J668053M22478p54357J569290K191201
$$ 502180023 502065315 501747475 502375412 504039192 505707245 506129723 505375366 506944656 509135857
635.5E09135857l01705N66559J159706Q08907J040725O54107O14204J051025Q65670
$$ 509135857 508834152 509400711 510560417 511369324 512410049 513064156 513678360 514729385 515595055
644.2E15595055k62032N36270O66924l10784R41735J118965P32307R95255P90291R59014
$$ 515595055 515333023 515869293 516536217 516225433 517167168 518286133 519018440 520013695 520803986 521763000
653.9E21763000N90287q72994j254997o16455o22711j75095m19884j43241L88565M20265
$$ 521763000 522353287 521480293 520225296 519608841 518986130 518811035 518391151 518247910 518636475 519056740
663.5E19056740P18002K51389J221885L071671L968696j898345k382355j014595P19261
$$ 519056740 519774742 520026131 521248016 524319687 528288383 526390038 524007683 522993088 523712349
672.2E23712349Q30307L06663n97610p03888M52309J219978Q61664J045151J732025
$$ 523712349 524542656 524849319 524251709 523547821 524000130 525220108 526081772 527126923 528858948
680.9E28858948J082496j36795R8076M22058N50804J139374L47901L19900Q82149P286
$$ 528858948 529941444 529804649 529902725 530324783 530875587 532014961 532362862 532682762 533564911 533572197
690.5E33572197J28479J016388O55403K8610p6866k95029K31362L00522K55432L27759
$$ 533572197 533700676 534717064 535372467 535401077 535324211 535029182 535260544 535561066 535816498 536144257
700.2E36144257Q7471P98492N30014P94487N66902p50351J56441P39174N06325N28030
$$ 536144257 536231728 537030220 537560234 538354721 538921623 538171272 538327713 539066887 539573212 540101242
709.8E40101242J101303K58866p86934J211242K052574K98310q86345M60777P78389
$$ 540101242 541202545 541461411 540674477 541885719 543938293 544236603 543350258 543811035 544589424
718.5E44589424l88222K01073N4550m0321J009941J241112L70826o86O81648J441498
$$ 544589424 544201202 544402275 544456825 544416504 545426445 546667557 547038383 547037697 547719345 549160843
728.1E49160843Q59566j87493K20948m273N69458O72226K08511J605111K03323n17616
$$ 549160843 550020409 549832916 550053864 550049591 550619049 551291275 551499786 553104897 553308220 552790604
737.8E52790604J404495J163368r1362J09444K16636j55677N48172L28941J156197
$$ 552790604 554195099 555358467 555267105 555376549 555593185 555437508 555985680 556314621 557470818
746.5E57470818J813774q9989o81038L95279J514778R27925J16120j92948L7155R28841
$$ 557470818 559284592 559194603 558513565 558908844 560423622 561351547 561467667 561274719 561311874 562240715
756.1E62240715J090508J488876P78198N5351M75312K14462j755J115265J814537N96581
$$ 562240715 563331223 564820099 565598297 565653648 566128960 566343422 566341667 567456932 569271469 569868050
765.7E69868050m79241o84051n0888J39846L20931L26042j94473R1476L46794J216011
$$ 569868050 569388809 568704758 568653870 568793716 569114647 569440689 569246216 569337692 569684486 570900497
775.4E70900497L45803o81305q4648l18871l97186k5292N35164l46870j60294N64156
$$ 570900497 571246300 570564995 570480347 570161476 569764290 569738998 570274162 569927292 569766998 570331154
785E70331154L46641Q33512R00726J310272K82631q9760R690j19095K58179q06046
$$ 570331154 570677795 571511307 572412033 573722305 574004936 573915176 573924866 573805771 574063950 573257904
794.7E73257904J60217L69835k83088J9226K32963K77748k67944m08554k009125j861534
$$ 573257904 573418121 573787956 573504868 573524094 573757057 574034805 573766861 573358307 571349182 569487648
804.3E69487648p39326o9428K39945j556778j837121q60786J79710j70097l56789j69906
$$ 569487648 568748322 568678894 568918839 567362061 565524940 564664154 564843864 564673767 564316978 564147072
814E64147072j135178j004410j080780k67028N27343l3683K16941P85714L97720R50355
$$ 564147072 563011894 562007484 560926704 560659676 561187019 561153336 561370277 562155991 562553711 563504066
823.6E63504066K026825J120034J294479J652069J793099J265792Q98972K743645K140236
$$ 563504066 565530891 566650925 567945404 569597473 571390572 572656364 573555336 576298981 578439217
832.3E78439217J880493J669159J614761K206230J030541J503868J635895J372871
$$ 578439217 580319710 581988869 583603630 585809860 586840401 588344269 589980164 591353035
840E91353035M06685O15616J172752P10526J468162M88892L44162K8457L69454J086464
$$ 591353035 591759720 592375336 593548088 594258614 595726776 596215668 596559830 596588287 596957741 598044205
849.6E98044205R97085J343804j5679Q82759J333008L71704K29531R37614J180496
$$ 598044205 599041290 600385094 600369415 601252174 602585182 602956886 603186417 604124031 605304527
858.3F05304527J274605K907944N80787l98330N66559n5619k96554m84390N67092M45748
$$ 605304527 606579132 609487076 610067863 609669533 610236092 610180473 609883919 609399529 609966621 610412369
868F10412369R2163q84743r60388m97475n85251o675j641007j997452n80635N22194
$$ 610412369 610504532 609619789 608659401 608161926 607576675 607570000 605928993 603931541 603350906 603873100
877.6F03873100l42445k36435M84543j332932p65190l52020j46523R5444n96237q86345
$$ 603873100 603530655 603294220 603778763 602445831 601680641 601328621 601182098 601277542 600681305 599794960
887.3E99794960n22919J57318j406936j245766o36978j18408J135406K74735o80008
$$ 599794960 599272041 599429359 598022423 596776657 596139679 596021271 597156677 597431412 596751404
895.9E96751404n42031K98195m53529n34554m84962q00705j01547k25525K84271N40619
$$ 596751404 596209373 596507568 596054039 595519485 595034523 594233818 594132271 593906746 594191017 594731636
905.6E94731636J578217J461639J100349J828881K04887l79982j13983N30052K6550
$$ 594731636 596309853 597771492 598871841 600700722 600905609 600525627 600411644 600941696 600968246
914.3F00968246j152801q88710m23508j01051n53856p99561j960449j647415j328659
$$ 600968246 599815445 598926735 598503227 598402176 597848320 597048759 595088310 593440895 592112236
922.9E92112236k061653j282997j469574j493645j725502j268921n93414j129685j438102
$$ 592112236 590050583 588767586 587298012 585804367 584078865 582809944 582216530 581086845 579648743
931.6E79648743j692124j383171j472587j410180j240806n16167o4583o03561n46570
$$ 579648743 577956619 576573448 575100861 573690681 572449875 571933708 571869125 571265564 570718994
940.3E70718994q42743q72841q37631n51491j052627j444664j009941j533127p25632
$$ 570718994 569876251 569003410 568165779 567614288 566561661 565116997 564107056 562573929 561848297
949E61848297j24969m8447j23673m09202k35672q75092p63664m91981r23424j856880
$$ 561848297 561723328 561674881 561551208 561142006 560906334 560031242 559267578 558775597 557852173 555995293
958.6E55995293j846886j368904j460915q54683o57539m19579o60896j135216j401138
$$ 555995293 554148407 552779503 551318588 550463905 549806366 549386787 548725891 547590675 546189537
967.3E46189537j597671j166306j041794r52034j585541j689758j682510k008477j445236
$$ 546189537 544591866 543425560 542383766 541431732 539846191 538156433 536473923 534465446 533020210
976E33020210j291427p79000r46502k406998k994652k528686k637482k971726l167686
$$ 533020210 531728783 530949783 530003281 527596283 524601631 522072945 519435463 516463737 513296051
984.7E13296051l338737k381325k083130k187462j957588j972199j730232j851311
$$ 513296051 509957314 507575989 505492859 503305397 501347809 499375610 497645378 495794067
992.4D95794067j861381j822891k171784k959060l033143j300621p65648j374588j679306
$$ 495794067 493932686 492109795 489938011 486978951 483945808 482645187 481879539 480504951 478825645
1001.1D78825645k074432j196861j064987j548043j507759j685791j439819j913910
$$ 478825645 476751213 475554352 474489365 472941322 471433563 469747772 468307953 466394043
1008.8D66394043j685677j473617j474190j165466j652260r94339j251373j229210
$$ 466394043 464708366 463234749 461760559 460595093 458942833 457948494 456697121 455467911
1016.5D55467911p37648j633568k058258j807671j203613j691780j405830r80454r47952
$$ 455467911 454730263 453096695 451038437 449230766 448027153 446335373 444929543 443949089 443001137
1025.2D43001137q58422j276626r54895j146393k28920k06337r87091r13200m70009
$$ 443001137 442142715 440866089 439911194 438764801 438535881 438329544 437342453 436429253 435959244
1033.8D35959244L61290o71959j85738J390991K165490J497955J302757K119942P35741
$$ 435959244 436320534 435648575 435462837 436853828 439019318 440517273 441820030 443939972 444675713
1042.5D44675713J51977J28479R5291m67796o39381J38282o7749J25122k61688M959
$$ 444675713 444827690 444956169 445051460 444583664 443944283 444082565 444014816 444139938 443878250 443883209
1052.2D43883209k82974j348038j590881l21884Q92486q15773j012268j033363L19137
$$ 443883209 443600235 442252197 440661316 440339432 441231918 440416145 439403877 438370514 438689651
1060.9D38689651K103196J372642J117096N23873J399955J749420J487580J073684
$$ 438689651 440792847 442165489 443282585 443806458 445206413 446955833 448443413 449517097
1068.6D49517097P68776N09835j81313J100540J77727p0381M81186K6703O54106m10118
$$ 449517097 450285873 450795708 450614395 451714935 451892662 451822281 452303467 452330170 452984276 452574158
1078.2D52574158l50266M37203J030121Q70552J3198L89061P78695R86862J65748M8409
$$ 452574158 452223892 452661095 453691216 454561768 454574966 454964027 455742722 456729584 456895332 456943741
1087.9D56943741N57136P53060J270218J209221M29534O18325R58290l04413L53203
$$ 456943741 457500877 458253937 459524155 460733376 461162910 461781235 462739525 462435112 462788315
1096.5D62788315R95788M16947P70874O35223K42501K59895J317787J119347J96762
$$ 462788315 463784103 464201050 464971924 465607147 465849648 466109543 467427330 468546677 468743439
1105.2D68743439M67415J029815J149712Q52508O42586o81763k36473J188813Q63609
$$ 468743439 469210854 470240669 471390381 472242889 472885475 472203712 471967239 473156052 474019661
1113.9D74019661R09843R06868K98348j80550N6267M6921Q99544J006889m99077L01628
$$ 474019661 474929504 475836372 476134720 475954170 476010437 476057358 476956902 477963791 477464714 477766342
1123.5D77766342N45921J3276M29611N95894J001510J067200J052132J217003R50279
$$ 477766342 478312263 478325539 478755150 479351044 480352554 481419754 482471886 483688889 484639168
1132.2D84639168J164894J842270J496544J254768P71980Q87337J881218J359901J010285
$$ 484639168 485804062 487646332 489142876 490397644 491169624 492056961 493938179 495298080 496308365
1140.9D96308365O98776N83801Q64334L19710K15569O81763J066055R09729M79774
$$ 496308365 497007141 497590942 498455276 498774986 498990555 499672318 500738373 501648102 502127876
1149.6E02127876l1051k40326k57836l87039r5520o9466j41906k67220l11775k58026
$$ 502127876 502096825 501856499 501598663 501211624 501116104 501046638 500904732 500637512 500325737 500067711
1159.2E00067711l72810p5074k49977j78451K86903P40585J222458Q10700O47163J608315
$$ 500067711 499694901 499619827 499369850 499191399 499478302 500218887 501441345 502252045 502899208 504507523
1168.9E04507523K512016K120056K033463K280044K046852J693382J809006K566910
$$ 504507523 507019539 509139595 511173058 513453102 515499954 517193336 519002342 521569252
1176.6E21569252K053108J472512J965179J753769J410866J765594J875954J777878
$$ 521569252 523622360 525094872 527060051 528813820 530224686 531990280 533866234 535644112
1184.3E35644112J302948J429023J617928R49516J094971N18455o0615M921Q3122r4910
$$ 535644112 536947060 538376083 539994011 540943527 542038498 542556953 542496338 542501259 542584381 542489471
1193.9E42489471o08558j38703k31361m69322m55475l39241l69568j041450r57795
$$ 542489471 541880913 541742210 541510849 541041527 540586052 540246811 539877243 538835793 537877998
1202.6E37877998j112442r66339m13017j016502j029473k05154m38843n18913k7581
$$ 537877998 536765556 535799217 535386200 534369698 533340225 533135071 532696228 532177315 532149734
1211.3E32149734j37023j82076m35829r51195r87930l71819j12724k13623M6387k81868
$$ 532149734 532012711 531830635 531394806 530443611 529455681 529083862 528971138 528757515 528803902 528522034
1220.9E28522034k10686k49863o01349l55606n31883l92723o97937j068954m61655
$$ 528522034 528311348 528061485 527460136 527104530 526572647 526179924 525481987 524413033 523951378
1229.6E23951378l19176m39224m01268l59955O1760L69339j42975n06096k64396k02141
$$ 523951378 523632202 523192978 522791710 522431755 522493515 522862854 522719879 522213783 521949387 521747246
1239.3E21747246k61650K8000O3514m47883l39203K098K17514l2730n63011j75095
$$ 521747246 521485596 521513596 521577110 521129227 520790024 520792122 521009636 520976906 520413895 520238800
1248.9E20238800j97868k38800o1226l53890k99186k50245Q0834k5902n90744j02920
$$ 520238800 520040932 519802132 519740906 519387016 519087830 518837585 518918419 518892517 518301773 518198853
1258.5E18198853K45437J97258N52063M42963L3188R6435K91672M84314M55627K43225
$$ 518198853 518444290 518641548 519193611 519636574 519669762 519766197 520057869 520542183 520997810 521241035
1268.2E21241035N70107P99599O91452N33142N30128P18155P47223O49071L44276O67191
$$ 521241035 521811142 522610741 523302193 523835335 524365463 525083618 525830841 526479912 526824188 527491379
1277.8E27491379R38301P89375O45523N07775R50622Q57964P35588Q41675O73446N64499
$$ 527491379 528429680 529219055 529864578 530372353 531322975 532180939 532916527 533758202 534431648 534996147
1287.5E34996147O43311O49109K03857N00412O84586M97970K43111L90816Q53385M25797
$$ 534996147 535639458 536288567 536492424 536992836 537677422 538175392 538418503 538809319 539662704 540088501
1297.1E40088501J93787j53160j51825k02599k58446j3771l05K98386k43035j82190
$$ 540088501 540282288 540129128 539977303 539774704 539516258 539502487 539502182 539800568 539557533 539375343
1306.8E39375343P0687j60866m66843q05435l01132n66521p47452p97042m37508L92685
$$ 539375343 539446030 539285164 538818321 538012886 537711754 537145233 536397781 535600739 535163231 535555916
1316.4E35555916J64947L79982L27378J02501O12373N78537M16794N06744J37825N1117
$$ 535555916 535720863 536100845 536428223 536530724 537143097 537721634 538138428 538645172 538782997 538834114
1326E38834114K12326j29585K022m74549n63698r2887m807J4076n27000r3842l0555
$$ 538834114 539046440 538916855 538918877 538444328 537880630 537787743 537782936 537797012 537270012 537176170 537145615
1336.7E37145615r8877N32570R0103m82941l12042L39088N71747J035805Q92868J30577
$$ 537145615 537046738 537579308 537669411 537186470 536874428 537213516 537785263 538821068 539713936 539844513
1346.3E39844513P4310J68877O21033j79596l19405j5068l67622k60544m84314m05350
$$ 539844513 539918823 540087700 540708733 540529137 540209732 540194664 539827042 539566498 539082184 538676834
1355.9E38676834k68898P25l75939J14594L98636l41454L92304r11370m55513j04599
$$ 538676834 538407936 538408661 538032722 538147316 538545952 538204498 538596802 537685432 537229919 537125320
1365.6E37125320n80139j33400p72552o08559k39181K89955M06685J89590k632p94296
$$ 537125320 536545181 536411781 535639229 535030670 534791489 535081444 535488129 535677719 535675087 534880791
1375.2E34880791K98080L33595k90947n20553m85344o80122o31447n40390r26743m63867
$$ 534880791 535178871 535512466 535221519 534700966 534215622 533535500 532904053 532363663 531436920 530973053
1384.9E30973053J41525N41191r73167j161842n10483j017685r34906j496277p57790
$$ 530973053 531114578 531655769 530682602 529520760 529010277 527992592 527057686 525561409 524803619
1393.6E24803619j434860l183060r18273l33138n69420k454109j586647m70238j353493
$$ 524803619 523368759 520185699 519267426 518934288 518364868 515910759 514324112 513853874 512500381
1402.2E12500381j474456j111756j997490k030639q19092j213799j269416r18236p73926
$$ 512500381 511025925 509914169 507916679 505886040 505066948 503853149 502583733 501665497 500891571
1410.9E00891571m32053q69751o42776q03986o69860j53618o08292j3046l493729j129608
$$ 500891571 500459518 499589767 498946991 498143005 497473145 497319527 496711235 496698189 493204460 492074852
1420.6D92074852J478615R29642J045303o83441j06468P19757J27220O48384M68635
$$ 492074852 493553467 494483109 495528412 494844971 494738503 495458260 495585480 496233864 496702499
1429.2D96702499P8736k05345Q16459Q40416O70815K299003K547913O9771l47481J837006
$$ 496702499 496781235 496575890 497392349 498232765 498903580 501202583 503750496 503820267 503472786 505309792
1438.9E05309792J154365O67801J050148O14967J038552O70051J076470J744194J619453
$$ 505309792 506464157 507131958 508182106 508797073 509835625 510505676 511582146 513326340 514945793
1447.6E14945793K54212P26547J662216P57523J075553J168404J729469J887970Q53882
$$ 514945793 515200005 515926552 517588768 518346291 519421844 520590248 522319717 524207687 525061569
1456.2E25061569r97238j327057L059006J031418J683578J806755J614495K844123
$$ 525061569 524064331 522737274 525796280 526827698 528511276 530318031 531932526 534776649
1464E34776649l15971P1182K057724J692467J404038J614952K957687L036613K219353
$$ 534776649 534460678 534531860 536589584 538282051 539686089 541301041 544258728 547295341 549514694
1472.6E49514694l31878J663436L373642J208954P20978J781197J424942J443329P79495
$$ 549514694 549182816 550846252 554219894 555428848 556149826 557931023 559355965 560799294 561578789
1481.3E61578789M80690R33456R93996P87201J379471O68907q04711J641236q3123
$$ 561578789 562059479 562992935 563986931 564774132 566153603 566822510 566017799 567659035 567575912
1490E67575912k913475k42004M54674n5733L16849J009903m749031L58124L96118l117180
$$ 567575912 564662437 564420433 564875107 564819374 565136223 566146126 561397095 561755219 562151337 559034157
1499.6E59034157J89247n56755q82149P9727J952591K207756k417755n291977k264747
$$ 559034157 559223404 558666649 557784500 557864227 559816818 562024574 559606819 554314842 552050095
1508.3E52050095J551017k81295N71937o48079j896629O50825k7008J71318Q5030l912315
$$ 552050095 553601112 553319817 553891754 553243675 551347046 551997871 551970863 552142181 552227211 548314896
1518E48314896K77786K980652O09359m725265j173248P65419J798896j673736k74468
$$ 548314896 548592682 551573334 552182693 547457428 546284180 547049599 548848495 547174759 546900291
1526.6E46900291Q24967j094017l75328J88522N68085O63299l23066m191170R45663
$$ 546900291 547725258 546631241 546255913 546444435 547012520 547675819 547352753 543161583 544107246
1535.3E44107246J153222P49473K726784j530075n443382J202430O59943j477547J010781
$$ 544107246 545260468 546009941 548736725 547206650 541763268 542965698 543625641 542148094 543158875
1544E43158875J089630l064194O69975O25878J493110P24221k296563M19846P29446
$$ 543158875 544248505 541184311 541854286 542480164 543973274 544697495 542400932 542820778 543550224
1552.7E43550224J623688k622642j507302K177048L627167K098083j5314102j031227
$$ 543550224 545173912 542551270 541043968 543221016 546848183 548946266 533632164 532600937
1560.4E32600937K596283K100792L17688j00022k660331k042427J80664p03507L58086
$$ 532600937 535197220 537298012 537615700 537515678 534855347 532812920 532993584 532290077 532648163
1569.1E32648163p112580j739959m51431k037278j192245o56548J096878r562072j669465
$$ 532648163 525535583 523795624 523344193 521306915 520114670 519458122 520555000 510992928 509323463
1577.7E09323463j350250k124252j958885l229103j918068l466950k025490l104133
$$ 509323463 507973213 505848961 503890076 500660973 498742905 495275955 493250465 490146332
1585.5D90146332k512017k578125l475456j534996l208580j560211l264999j895867
$$ 490146332 487634315 485056190 481580734 480045738 476837158 475276947 472011948 470116081
1593.2D70116081k025337l483887j434784k912292j435661k597123j224594k218399
$$ 470116081 468090744 464606857 463172073 460259781 458824120 456226997 455002403 452784004
1600.9D52784004k145614q17261k477989q85163k271423l02887j960411j213265p73391
$$ 452784004 450638390 449821129 447343140 446457977 444186554 443883667 441923256 440709991 439936600
1609.6D39936600k721901k92244j889191J12648j198616N35813J038665o542282J295967
$$ 439936600 437214699 436922455 435033264 435145912 433947296 434483109 435521774 428979492 430275459
1618.2D30275459k08816P77435j131935Q27331R24683l166084J95007l21426J946983
$$ 430275459 430066643 430844078 429712143 430539474 431464157 428298073 428493080 428171654 430118637
1626.9D30118637r55086n71251P35436O81267R14726m9286J720314J421852M85916
$$ 430118637 429163551 428592300 429327736 430009003 430923729 430874443 432594757 434016609 434502525
1635.6D34502525k276725J822815J67312K83890J569252K4910J770325J45950J839905
$$ 434502525 432225800 434048615 434215927 434499817 436069069 436093979 437864304 438010254 439850159
1644.3D39850159K646827N49164J631775j726608J610756J212921L297386M760017
$$ 439850159 442496986 443046150 444677925 442951317 444562073 445774994 449072380 453832397
1652D53832397Q550721j1687508k871704L862419J910362J721001R71298J564408J809120
$$ 453832397 462383118 450695610 447823906 451686325 453596687 455317688 456288986 457853394 459662514
1660.7D59662514J804962J785507j001358K234154J717071J789475J869659K155800
$$ 459662514 461467476 463252983 462251625 464485779 466202850 467992325 469861984 472017784
1668.4D72017784J104279P19528M357109Q09860K240143L821602K544136j073532J833267
$$ 472017784 473122063 473841591 478198700 479008560 481248703 485070305 487614441 486540909 488374176
1677.1D88374176L024406J831589K979241J039962L193970N182533L140679j27182
$$ 488374176 491398582 493230171 496209412 497249374 500443344 505625877 508766556 508639374
1684.8E08639374q2054M637184L332252K212906K829514K441978K945938K634468L240166
$$ 508639374 508557320 513194504 516526756 518739662 521569176 524011154 526957092 529591560 532831726
1693.5E32831726M348183N363617j602974K829895N733604O355248N291137p962951
$$ 532831726 537179909 542543526 540940552 543770447 549504051 555859299 561150436 553187485
1701.2E53187485N633812N069503L743706J806526K045823J510009J917076L936272
$$ 553187485 558821297 563890800 567634506 569441032 571486855 572996864 574913940 578850212
1708.9E78850212K237015J256103K299767K522659K921601R37233P54737M255600M475747
$$ 578850212 581087227 582343330 584643097 587165756 590087357 591024590 591779327 596034927 600510674
1717.6F00510674n796128K39907K777633J746788K008743J387940N81856J350975J355018
$$ 600510674 594714546 594954453 597732086 599478874 601487617 602875557 603457413 604808388 606163406
1726.3F06163406R16863J165352K268562P0190p89756L536834M358979k82975o036911
$$ 606163406 607080269 608245621 610514183 610584373 609794617 613331451 617690430 617407455 611370544
1734.9F11370544K685395L532219J941490L056488P55615k841797L149910L270912
$$ 611370544 614055939 617588158 619529648 622586136 623341751 620499954 623649864 626920776
1742.7F26920776K28730L39088K837029K730865K232819K103309M97399L592224J483230
$$ 626920776 627149506 627488594 630325623 633056488 635289307 637392616 637890015 641482239 642965469
1751.3F42965469p20138L486633K228165K365951L613663k2736K68174K003860K088776
$$ 642965469 642245331 645731964 647960129 650326080 653939743 653917007 654185181 656189041 658277817
1760F58277817M077453J16501j775970K391815J714859J175766J816025K505111k223358
$$ 658277817 662355270 662471771 660695801 663087616 664802475 665978241 667794266 670299377 668076019
1768.7F68076019Q13980M599228K054825j574936l485565L230972K593003j131897
$$ 668076019 668889999 673489227 675544052 673969116 670483551 673714523 676307526 675175629
1776.4F75175629J461486Q29087J295776P12967j147003P48520J859131J868362o06308
$$ 675175629 676637115 677466202 678761978 679474945 678327942 679076462 680935593 682803955 682197647
1785.1F82197647o99768J422501J177063L34625J536331J385269J045609j729813k154770
$$ 682197647 681497879 682920380 684097443 684432068 685968399 687353668 688399277 686669464 684514694
1793.8F84514694K918549J458664q10166O01120K162323R43375j742477J538085J96457
$$ 684514694 687433243 688891907 688081741 688682861 690845184 691788559 690046082 691584167 691780624
1802.4F91780624k04544J298218O64063O26525R6817j88522M30832J370010p42034
$$ 691780624 691576080 692874298 693538361 694164886 694261703 694073181 694504013 695874023 695131989
1811.1F95131989k9908J235657L60260P79877J50451Q59528k46811m85763N08499Q9187
$$ 695131989 695102081 696337738 696697998 697477875 697628326 698487854 698241043 697755280 698263779 698352966
1820.8F98352966J133271L9138Q92258J735764k012787n47028K057648K313843J066665
$$ 698352966 699486237 699525375 700417633 702153397 700140610 699593582 701651230 703965073 705031738
1829.4G05031738l830642q74711K027283K95868J79596M16184N17959L83301q70743
$$ 705031738 701201096 700326385 702353668 702649536 702829132 703245316 703763275 704146576 703275833
1838.1G03275833O31180L28293O10199M10995J317978K059631n088958J04522J786271
$$ 703275833 703907013 704235306 704845505 705256500 706574478 708634109 703545151 703649673 705435944
1846.8G05435944M39376o2408K05841P85065J5487N46036l4637K23007K47116k09656
$$ 705435944 705875320 705812912 706018753 706803818 706819305 707365341 707330704 707553711 707800827 707591171
1856.4G07591171o3400n58090L79867K20948N89981M26101L67737J73721q8577J003342
$$ 707591171 707527771 706969681 707349548 707570496 708160477 708586578 708954315 709128036 709039459 710042801
1866.1G10042801q8806R02710m17023k618332J48621R04770R35287J6785J82800J60675
$$ 710042801 709953995 710856705 710439682 707821350 707969971 708874741 709810028 709826813 710009613 710170288
1875.7G10170288Q4305J28937L83911K64663n89141N951l30430M22898K50091l61480
$$ 710170288 710254593 710383530 710767441 711032104 710442963 710448914 710118484 710541382 710791473 710429993
1885.4G10429993K81830q3237J176910L59421k063293j27411J132354J08643J2054
$$ 710429993 710711823 710628586 711805496 712164917 710101624 709974213 711106567 711215210 711227264
1894.1G11227264O4621r23233L82080J48011J97448M01612K35748O32629l49121L3875
$$ 711227264 711291885 710368652 710750732 710898743 711096191 711497803 711733551 712366180 712017059 712050934
1903.7G12050934j49307k43988L41720K94953K13470K1973n61219r95102N33143L99093
$$ 712050934 711901627 711657639 711999359 712294312 712507782 712529755 711968536 710973434 711506577 711905670
1913.3G11905670L22266j18180K9145K254257j240158j988754P34939L06854N31083
$$ 711905670 712227936 712109756 712138901 714393158 713153000 711164246 711899185 712206039 712737122
1922G12737122m56086r06524K20031K67792m40903M6006L28903K55814O1874k54746
$$ 712737122 712281036 711374512 711594543 711862335 711421432 711467438 711796341 712052155 712114029 711859283
1931.7G11859283M39911k24380j72653m8600k73895n7525l02353Q3618N5542J265182
$$ 711859283 712299194 712074814 711902161 711853561 711579666 711522141 711219788 711303406 711358948 712624130
1941.3G12624130M09546k294082L1509P29523k14539k48871J15738l25928m88281l3874
$$ 712624130 713033676 710739594 710771103 711500626 711286087 711037216 711152954 710827026 710338745 710304871
1951G10304871J92031Q5831O6071R6817l80783J09405q6975l26767j7929k22244L4714
$$ 710304871 710496902 710582733 710648804 710745621 710364838 710474243 710387268 710060501 710042572 709820328 709855042
1961.6G09855042j42518R7962K8915J8921M76837q850o08597m33197R2163j69906q2016
$$ 709855042 709712524 709810486 709839401 709858322 710335159 710326309 709717712 709284515 709376678 709206772 709124756
1972.2G09124756P7591J91650J74942k43072k25449m32129P6981P1258J31531R1019
$$ 709124756 709202347 709393997 709568939 709325867 709100418 708668289 708745270 708816528 708948059 709039078
1981.8G09039078l67966J13373k01950p0038l204j03302n61676p53785Q41446P35550
$$ 709039078 708671112 708784485 708582535 708512497 708509293 708405991 707844315 707090530 707931976 708667526
1991.5G08667526p25479n26123L45154K8534p9346j29318m58832K03323j9989k16674
$$ 708667526 707942047 707415924 707761078 707789612 707710266 707580948 707122116 707325439 707305450 707088776
2001.1G07088776m27933k96326l8681k19421k136j73798N44662O5537n09567N9433
$$ 707088776 706660843 706364517 706325836 706106415 706104279 705930481 706475143 706540680 706031113 706090546
2010.7G06090546l21427l24402j88446j8386O5689o6300o68564k46124L84674l0670
$$ 706090546 705769119 705444717 705256271 705237885 705303574 705237274 704568710 704322586 704707260 704676590
2020.4G04676590j4801j99966O0653l58581k95182n8059o18592P9117j82724j99966
$$ 704676590 704661789 704461823 704522476 704163895 703868713 703810654 703192062 703271179 703088455 702888489
2030G02888489r2621j19934K43301k51693l74299l58200j65023k31476j57395K3423
$$ 702888489 702795868 702675934 702919235 702667542 702293243 701935043 701770020 701538544 701381149 701404572
2039.7G01404572J11694j19248k20947K82135m00314k10190j64871k87094l05k59324
$$ 701404572 701516266 701397018 701176071 701458206 701057892 700847702 700682831 700395737 700395432 700136108
2049.3G00136108K42997k63596k37732J65329L9673l00675m64630L80402O9885k27813
$$ 700136108 700379105 700115509 699877777 700043106 700082779 699782104 699317474 699697876 699767761 699539948
2059F99539948m34647k9373K19345k89841K02408j82114m30603j77002K12250K51541
$$ 699539948 699105301 699075928 699295273 699005432 699207840 699025726 698595123 698418121 698630371 698881912
2068.6F98881912p2937J23673j984j07269k60697n7373m38461k64282K73208o1721
$$ 698881912 698808975 698932648 698930664 698823395 698562698 698505325 698066864 697802582 698075790 698014069
2078.2F98014069O8893j93558j74026k86484L7689P2327l61786J36948k27661k80304
$$ 698014069 698082962 697889404 697715378 697428894 697466583 697538910 697177124 697314072 697086411 696806107
2087.9F96806107j61438j4649k12173k23008K02332k43759P934j93328m5853M3716
$$ 696806107 696644669 696630020 696417847 696194839 696397171 696153412 696161346 695968018 695922165 695965881
2097.5F95965881m02527j68151k70081j59225j39084K28348R4757j89133j93176k31552
$$ 695965881 695563354 695395203 695125122 694965897 694826813 695055161 695149918 694960785 694767609 694536057
2107.2F94536057O6223m9439K82669j50833k01034r3003k28805K23160l97034k07138
$$ 694536057 694602280 694552841 694835510 694684677 694483643 694390640 694161835 694384995 693987961 693780823
2116.8F93780823l3341j75628k09198R4146K67868p05337m03290k7771M74396M06036
$$ 693780823 693747482 693571854 693362656 693456802 693724670 693019333 692616043 692588272 693062668 693468704
2126.5F93468704n25284j28250L55759L64685o1188k23007l19138k91137k65427k30789
$$ 693468704 692943420 692815170 693170929 693535614 693474426 693251419 692932281 692641144 692375717 692144928
2136.1F92144928r2468J32675N43289l06473r8419K53754j65940Q1864r7351k09198
$$ 692144928 692052460 692185135 692728424 692421951 692323532 692577286 692411346 692493210 692395859 692186661
2145.8F92186661k37961J23672r2468J07422J38168k44217L95508J5030J18866m4784
$$ 692186661 691948700 692072372 691979904 692087326 692225494 691981277 692376785 692391815 692510681 692465897
2155.4F92465897q7662j12305o95343q3084O2103J33362m10538J29853N42297q6594
$$ 692465897 692378235 692265930 691570587 691487503 691549606 691682968 691272430 691402283 691944580 691857986
2165F91857986L31574n7755K09885k18658o05622q5983R7885M13361r8191J15128O0272
$$ 691857986 692189560 692131805 692341690 692123032 691517410 691431427 691529312 691942673 691844482 691959610 692019882
2175.6F92019882K18048M04587o8283K1286l7384J48315j45263j07575m4784j15738
$$ 692019882 692237930 692642517 692574234 692595520 692558136 692706451 692561188 692453613 692408829 692293091
2185.3F92293091o9428n0201K64130k4033K52075J99661J62735L2120j59073R3155
$$ 692293091 692223663 692173462 692437592 692413559 692665634 692865295 693028030 693060150 692901077 692994232
2194.9F92994232l73230j55105k93198j3657M13590L24478J33972m95987O8207J98135
$$ 692994232 692621002 692465897 692172699 692159042 692572632 692897110 693031082 692535095 692603302 692801437
2204.6F92801437J15509L128o0195L2959n9433J39770k97699j22528k65045K70691
$$ 692801437 692916946 692920074 692859879 692892838 692833405 692973175 692675476 692552948 692287903 692558594
2214.2F92558594O35223o9198K59323k9831r995j43814o9046j29928l41645J54038
$$ 692558594 693193817 693124619 693383942 693354111 693344116 693200302 693131256 693001328 692659683 692813721
2223.9F92813721k89688N2032M4174L4409K80685K31934J70822l36227K69393l4484
$$ 692813721 692524033 692576065 692620239 692654648 692935333 693167267 693338089 693001862 693271255 693236771
2233.5F93236771l02887o7368q2245j8921k76870K82211L2043k13470L0517J73874
$$ 693236771 692933884 692866516 692784271 692765350 692488480 692770691 692802734 692589264 692619781 692793655
2243.2F92793655J15891l2730L09830L9749j86234l36075J16272K9450k96860J50909
$$ 692793655 692909546 692876816 693186646 693226395 693040161 692704086 692820358 692849808 692552948 692703857
2252.8F92703857M6006J24664J23062M26178q6822j85242J16348k43454J74408l36532
$$ 692703857 692749863 692874527 692997589 693423767 693336945 693151703 693268051 693024597 693199005 692862473
2262.4F92862473j48545j64108K9373N66635j5640K47574j55869j6174q9645l39890
$$ 692862473 692713928 692549820 692579193 693145828 693130188 693377762 693221893 693205719 693116074 692776184
2272.1F92776184j4877n4779J11694l33939L6316R6741J74942l11203o11954M31443
$$ 692776184 692761307 692706528 692818222 692484283 692520599 692617340 692792282 692481079 691869125 692300568
2281.7F92300568N9127K29569k54440k85416M84161N01938N29099n82123j86157J98517
$$ 692300568 692359695 692589264 692334824 692049408 692533569 693035507 693564606 692982483 692796326 692994843
2291.4F92994843J22756K12555j9607L32107J29166M07867j6250J30997L16772l55301
$$ 692994843 693117599 693330154 693310547 693642654 693771820 694179687 694163437 694294434 694611206 694255905
2301F94255905M20303L78190J12304J05820L31497N39627N46875Q98819M50058K86408
$$ 694255905 694676208 695054398 695166702 695272522 695604019 696143646 696690521 697589340 698039398 698325806
2310.7F98325806N2108q5449L4485L17307O35833n111M0130N18189J100158J292649
$$ 698325806 698377914 698292465 698326950 698644257 699280090 699274979 699315109 699833298 700933456 702226105
2320.3G02226105O77337O17905Q51059O33392K89307q6899j06582R88159J603317O80008
$$ 702226105 702903442 703521347 704372406 705005798 705295105 705208206 705101624 706089783 707693100 708373108
2329.9G08373108o53915r65271p09839j98136J264191J727447L56675m47846M83246
$$ 708373108 707719193 706753922 706044083 705845947 707110138 708837585 709194260 708746414 709229660
2338.6G09229660l82004n83572J344681N25818j108552j398925j608658j708145k213211
$$ 709229660 708847656 708264084 709608765 710134583 709026031 707627106 706018448 704310303 702097092
2347.3G02097092k532196Q00781L580246J584473J487197J288147Q84400K840423R68933
$$ 702097092 699564896 700365677 703945923 705530396 707017593 708305740 709190140 712030563 712999496
2356G12999496O04172q07800N66330O78787j260605K78473m27246O60553j21460j675873
$$ 712999496 713603668 712795868 713362198 714040985 712780380 713058853 712631607 713292160 713170700 711494827
2365.6G11494827j883392j485596j896133k888565j461792r14307p86667j584701j599579
$$ 711494827 709611435 708125839 706229706 703341141 701879349 700965042 700178375 698593674 696994095
2374.3F96994095q95004j357651j392746j479645j463699j369629q44650p23343q07877
$$ 696994095 696099091 694741440 693348694 691869049 690405350 689035721 688191071 687467728 686659851
2383F86659851p60803p54547m59214o82983j26800l86200n30701M80347j9150m8981
$$ 686659851 685899048 685144501 684685287 684002304 683875504 683489304 682958603 683438950 683419800 683370819
2392.6F83370819n0888k23236j50223m03976l78266k89688R3308m2496n9052j52435
$$ 683370819 683319931 683096695 682946472 682542496 682164230 681874542 681967850 681925354 681866302 681713867
2402.3F81713867m12369k05612o103K58102k29874l72161q9264j51902j20620k17209
$$ 681713867 681301498 681095886 681089783 681347885 681118011 680745850 680656586 680504684 680384064 680166855
2411.9F80166855m25339m09241O8589J76010n6916j56250L7537l48358q68683o0577
$$ 680166855 679741516 679332275 679400864 679576874 679519958 679363708 679401245 679052887 678184204 678123627
2421.6F78123627L88412j50604n85327k20413j35422l14408j43280k81829p2327j03531
$$ 678123627 678512039 678361435 677776108 677555695 677420273 677105865 676962585 676680756 676608429 676504898
2431.2F76504898R9716M4709n65262j61133l2272k77405j90735j98441m36554j78604
$$ 676504898 676604614 676649323 676084061 675922928 675890656 675613251 675422516 675224075 674787521 674608917
2440.8F74608917k4109l16314j72196j66473r0561p4539o7902k22015k01874l815l97949
$$ 674608917 674584808 674268494 674096298 673929825 673839264 673764725 673696823 673474808 673272934 673269119 672871170
2451.5F72871170l79639n38559k98309J0300l72010l09066N5160M06113j74866n10254
$$ 672871170 672491531 671952972 671654663 671664963 671292953 670983887 671039047 671445160 671270294 670760040
2461.1F70760040l50952q9340K86713j77994n66101o21033l60947n97686m27933K75040
$$ 670760040 670409088 670319748 670606461 670428467 669862366 669241333 668880386 668282700 667854767 668129807
2470.7F68129807j70136k13623Q469M6386n2719l36838l79257l82614k20718k94800
$$ 668129807 667959671 667746048 667754517 667800903 667748184 667411346 667032089 666649475 666428757 666133957
2480.4F66133957o50025o59103k212J41449q0643J221n0660j78833n35888m75769m79584
$$ 666133957 665483932 664824829 664822617 664964066 664883423 664884644 664833984 664655151 664119263 663643494 663163910
2491F63163910m64478j72424j35345l21503n26352o8588j12305k11716n8670k94037
$$ 663163910 662699432 662527008 662391663 662070160 661543808 661475220 661362915 661151199 661092529 660798492
2500.6F60798492k81829j58234j69144o77490m48151l75747n92881l6621k23846k31857
$$ 660798492 660516663 660358429 660189285 659511795 659063644 658687897 658095016 658058395 657834549 657602692
2510.3F57602692J08032J19781l03192n24750k56500k79464j65711k90604k42919k38419
$$ 657602692 657710724 657830505 657527313 657002563 656746063 656466599 656300888 656010284 655767365 655528946
2519.9F55528946m39529k19651j04599k28271k31323R6817l8453j70135l92761p37076
$$ 655528946 655089417 654869766 654765167 654536896 654305573 654402390 654363937 654193802 653801041 653063965
2529.6F53063965m30069j77994k35519k90985J21307j90811n15366O3095P2861k28271
$$ 653063965 652633896 652455902 652220383 651929398 652050705 651859894 651344528 651407623 651480484 651252213
2539.2F51252213n21012n23147l18833K3880r2239l36151k96326m15955o2332l45001
$$ 651252213 650731201 650208054 649889221 649913101 649820862 649484711 649188385 648772430 648710098 648365097
2548.9F48365097k93426Q0871r1629L1815k02637l02353m79431l88413k69851m17023
$$ 648365097 648071671 648152542 648060913 648092728 647890091 647587738 647108307 646719894 646450043 646033020
2558.5F46033020k43454j51443k83738n88379o1798k06146j74789M06494j13907m3335
$$ 646033020 645789566 645638123 645354385 644766006 644704208 644498062 644323273 644729767 644615860 644572525
2568.1F44572525k62375m14047o13403q18177o2790m501j37558m97742n15670R3994
$$ 644572525 644310150 643896103 643282700 642464523 642401733 642397232 642259674 641761932 641246262 641340256
2577.8F41340256K49176j02616n75943m00390j08338j05896l29017l78037l03726n5695
$$ 641340256 641589432 641486816 640910873 640510483 640402145 640296249 639967232 639589195 639285469 639229774
2587.4F39229774J63231l08761q12989n79681J88217k67j13525j030n29900n27687
$$ 639229774 639393005 639084244 638271255 637691574 637879791 637879524 637765999 637764969 637235069 636707382
2597.1F36707382l77502j51024k73361m30451n22079m56276K01988R1667l17230l27797
$$ 636707382 636329880 636178856 635905495 635475044 634952965 634496689 634698677 634790344 634473114 634145317
2606.7F34145317M4670j88484o04935n69954m96444K2850l96462o67496k29187n1116
$$ 634145317 634189987 634001503 633396568 632826614 632330170 632353020 631956558 631289062 631059875 631008759
2616.4F31008759j34278n30052m49524j35384J44959k29950l33977l62358n71518j46827
$$ 631008759 630874481 630344429 629894905 629759521 629904480 629674530 629340553 628978195 628406677 628259850
2626F28259850k01722l5858l15246m41552k22435k34565R1781n55649n36956l05023
$$ 628259850 628058128 628022270 627707024 627265472 627043037 626808472 626900253 626344604 625807648 625502625
2635.6F25502625n20630n32265n93948j61515l32145l75443j45111k0065O4773o9732
$$ 625502625 624981995 624449730 623855782 623694267 623362122 622986679 622841568 622821503 622886276 622816544
2645.3F22816544k03400n07698m50401n76630m85954j63079K213k40402n95513J0147
$$ 622816544 622613144 622105446 621655045 621078415 620592461 620429382 620431595 620191193 619595680 619605827
2654.9F19605827j00250l87421k99339m84352m26674l98788l55454m03747J14784L72581
$$ 619605827 619505577 619118156 618818817 618334465 617907791 617509003 617153549 616749802 616864586 617237167
2664.6F17237167m54254o77109j69830k41012k80610O6796l04566o42433n26962j18752
$$ 617237167 616782913 616105804 615935974 615694962 615414352 615481148 615176582 614534149 614007187 613888435
2674.2F13888435j16691j24932Q5679n46189k77786k12631m13933m9210n30929j32294
$$ 613888435 613771744 613646812 613732491 613186302 612908516 612695885 612281952 612232742 611701813 611569519
2683.9F11569519J93710l57551m48075n44014m01268j8234o5384j79252j76163k13242
$$ 611569519 611763229 611405678 610957603 610413589 610012321 609994087 609928703 609749451 609573288 609360046
2693.5F09360046k9831l27186m94385l21159m14658m79545o17218k10801r575j7738
$$ 609360046 609330215 609003029 608508644 608187485 607772827 607293282 606676064 606465263 606455688 606437950
2703.1F06437950L0403j32942j71661m53377l27225n3253M4937k13203m77257p80525
$$ 606437950 606468353 606335411 606163750 605710373 605383148 605329895 605374832 605161629 604684372 603903847
2712.8F03903847q94890J09253K68440K15759j7433o32782m01916k91481J30691R7923
$$ 603903847 603008957 603118210 603386650 603602409 603584976 602952194 602550278 602258797 602389488 602487411
2722.4F02487411j60942j29394j07994l68004j030808l68499J10473K2927J26342p1449
$$ 602487411 602326469 602197075 602089081 601721077 600690269 600321770 600432243 600455170 600581512 600510063
2732.1F00510063j05171j76430j31798k98080m27399l92456k82554m5700r5864k71530
$$ 600510063 600404892 600228462 600096664 599798584 599371185 598978729 598696175 598650475 598554611 598283081
2741.7E98283081j81313J45913q164K24838K48757m95491o55632l34053R5863j55716
$$ 598283081 598101768 598247681 598239517 598464355 598713112 598217621 597561989 597227936 597323799 597168083
2751.4E97168083m76074n27191j37520N09682q126l80134r3460j14975k71874j62735
$$ 597168083 596692009 596164818 596027298 596536980 596528854 596148720 596055260 595940285 595668411 595505676
2761E95505676l17459m00314o0158j5335o5269m36783l10326k48070n25017j17416
$$ 595505676 595188217 594787903 594727745 594712410 594647141 594210358 593900032 593651962 593126945 593009529
2770.7E93009529o3324q049K0409j21727n60990q10737l02353k37923l13072l91083
$$ 593009529 592946205 592938156 592958565 592836838 592275848 591465111 591162758 590924835 590611763 590220680
2780.3E90220680r6512J4420l15781j56707r0867k9830k14196k63405k62565l27645
$$ 590220680 590124168 590138588 589822807 589666100 589575233 589545403 589331207 589067802 588805237 588477592
2789.9E88477592j57241p58782q66890R3613L68843l27644n51224l20206o58455o87790
$$ 588477592 588320351 587561569 586694679 586788292 587157135 586829491 586278267 585958061 585299606 584611816
2799.6E84611816j40152q5029m43268m12903l39775m08554m09660o57463o26374M1275
$$ 584611816 584471664 584386635 583943367 583530464 583190689 582782135 582372475 581715012 581088638 581129913
2809.2E81129913j0681p00874m85306j90926l75518p66487p28264k57187l94974l59878
$$ 581129913 581119232 580418358 579933052 579742126 579366608 578600121 577871857 577614670 577219696 576859818
2818.9E76859818m94919o44837m17900j95274j20392p47871p13463l52783k33956n19104
$$ 576859818 576364899 575720062 575302162 575106888 574986496 574238625 573525162 573172379 572938423 572419319
2828.5E72419319j009521n27153m43306p14379q74252q42934m21180j53847l20969
$$ 572419319 571409798 570882645 570439339 569724960 568850708 568007774 567586594 567432747 567111778
2837.2E67111778p21092p45544j076928j187896j198807j270866j264954j582832j277657
$$ 567111778 566390686 565645142 564568214 563380318 562181511 560910645 559645691 558062859 556785202
2845.9E56785202j305046j265945j299401j533470q31375p03545q32061o86265n36880
$$ 556785202 555480156 554214211 552914810 551381340 550549965 549846420 549014359 548328094 547791214
2854.6E47791214m09927L4523K91175j80587m0474J07918P4539q78j99432k08015k04812
$$ 547791214 547381287 547415810 547706985 547526398 547485924 547593842 547668381 547667503 547468071 547260056 547055244
2865.2E47055244l17840p16019p86819m63066O3057k20452l60946L6659m49600k74277
$$ 547055244 546737404 546021385 545234566 544771500 544834557 544614105 544253159 544289818 543840218 543565941
2874.8E43565941k26822m77409l38936l90663l68309q31528q79250k47726K5215o52580
$$ 543565941 543339119 542861710 542522774 542132111 541763802 540932274 540053024 539805298 539830513 539177933
2884.4E39177933j048775l21922j04103o24390p24068k06947m54750n93758m18472
$$ 539177933 538129158 537807236 537703133 537078743 536354675 536147728 535692978 535099220 534680748
2893.1E34680748p11174m91562p90672j032067m13322k97699n99709m92057p59774
$$ 534680748 533969574 533478012 532687340 531655273 531241951 530944252 530344543 529852486 529092712
2901.8E29092712n58433M06761l17078o19163m75731j004562o47812o46630q88977
$$ 529092712 528534279 528941040 528623962 528004799 527529068 526524506 525876694 525230064 524341087
2910.5E24341087p91435o21643j007194r57947o97632j311150j032028r67789r43527
$$ 524341087 523549652 522928009 521920815 520962868 520265236 518954086 517922058 516954269 516010742
2919.2E16010742o94923q08754n24254l89252l6773K35748L39584k28119l14979M45137
$$ 516010742 515315819 514507065 513982811 513593559 513556786 513792534 514132118 513903999 513589020 514034157
2928.8E14034157J8158q6556L52783K47612n874N21316R75609O25267M30145J54534
$$ 514034157 514052315 513965759 514318542 514566154 514560280 515081596 516057205 516682472 517112617 517267151
2938.5E17267151p5226l4981O85997J021080P17125L20778J23024R99031O13747j39237
$$ 517267151 517191925 517156944 517842941 518864021 519581146 519901924 520024948 521023979 521637726 521498489
2948.1E21498489m9934j24817K86369M85306M13361k66991l83987N37185O90613M75578
$$ 521498489 521448555 521323738 521610107 522095413 522508774 522241783 521857796 522394981 523085594 523561172
2957.7E23561172L66898L60527N20287O00967N1079k43569l9215L01209O59981J18370
$$ 523561172 523928070 524288597 524808884 525409851 525460930 525217361 525178146 525479355 526139336 526257706
2967.4E26257706o6834L60489N22194M98695R12514J328278N86128m921j3275L03421
$$ 526257706 526190872 526551361 527073555 527572250 528484764 529813042 530399170 530394249 530380974 530684395
2977E30684395J02386l87420K28119L04260J8501K49062J06468K34070O67000M36592
$$ 530684395 530786781 530399361 530627480 530931740 530950241 531199303 531305771 531539841 532206841 532643433
2986.7E32643433K250k60315k60505j526K1171N1728j2207L8948M6119M8523K12708
$$ 532643433 532645683 532385368 532124863 532123337 532144508 532196236 532184029 532222977 532269096 532317619 532530327
2997.3E32530327l38974n50537l32833k44636j13869j00365l82156p63283l06587k50053
$$ 532530327 532191353 531640816 531307983 531063347 530949478 530849113 530466957 529703674 529397087 529147034
3006.9E29147034m78440n5847J33591k5292l9291N570m98276p14875j024055p32155
$$ 529147034 528668594 528612747 528746338 528721046 528681755 528687325 528189049 527474174 526450119 525717964
3016.6E25717964r9525p45240l33824M32778l9444r04503q81043j20010Q6250K89116
$$ 525717964 525618439 524873199 524539375 524972153 524932709 524028206 523147163 523027153 523113403 523402519
3026.2E23402519n09033j470070j133499l815L37410o07719k26059j57280p25632l71513
$$ 523402519 522893486 521423416 520289917 520286102 520623512 520015793 519789734 519632454 518906822 518535309
3035.9E18535309n07012o56623p6561J33552q11691p76253m8904n87349p85599k73437
$$ 518535309 518028297 517371674 517295113 517428665 516616974 515840721 515791817 515204468 514418869 514145432
3045.5E14145432j86844n67513n57976m39987r74617j110763j15853L77503k41280
$$ 514145432 513958588 513391075 512833099 512393112 511418495 510307732 510191879 510569382 510328102
3054.2E10328102l75252m04129p38449j023865p19070j88408n21927j94854J97715
$$ 510328102 509952850 509548721 508810272 507786407 507067337 506878929 506357002 506162148 506359863
3062.9E06359863k36129n23453o05011l06168m90608o82106l77655k19383j49117p09801
$$ 506359863 506123734 505600281 504995270 504689102 504198494 503516388 503138733 502919350 502770233 502060432
3072.5E02060432q81805l45955l03535k03095j25847k53563l42712o24657l32641Q4266
$$ 502060432 501178627 500832672 500529137 500326042 500200195 499946632 499603920 498979263 498646622 498730888
3082.1D98730888n38101j037102m43763k56424n99060p3967L10402k20795r54666r19380
$$ 498730888 498192787 497155685 496711922 496455498 495856438 495782471 496092873 495872078 494917412 493998032
3091.8D93998032m71573l69377n34k90566q87718n00374K7275j30234m75578k60200
$$ 493998032 493526459 493157082 493156548 492865982 491978264 491477890 491505165 491374931 490899353 490639153
3101.4D90639153m27857m80537m19617k86331J57356n55534j001358q04367p30324
$$ 490639153 490211296 489730759 489311142 489024811 489182167 488626633 487625275 486820908 486090584
3110.1D86090584l31383k07977n85633o55059L4752J29814m0322k59666r83124j339836
$$ 486090584 485759201 485551224 484965591 484310532 484345284 484475098 484434776 484175110 483191986 481852150
3119.8D81852150r39255J36833J85128o00167q21952m37279j00594n40428o48003o39877
$$ 481852150 480912895 481049728 481234856 480634689 479812737 479375458 479274864 478734436 478086433 477446556
3129.4D77446556k03400J7167o33469o88210p73735p67288l49808l96347q00857m09775
$$ 477446556 477243156 477260323 476626854 475938644 475164909 474397621 474047813 473651466 472850609 472440834
3139D72440834j03073k33994R1820o81763r55696m01077p79190p57408l63617k16065
$$ 472440834 472337761 472103767 472195587 471513824 470558128 470157051 469377861 468620453 468256836 468040771
3148.7D68040771k64740j50604o42051j230927o77948k73247j00860l77121p87430
$$ 468040771 467776031 467625427 466983376 465752449 465074501 464801254 464700394 464323273 463535843
3157.4D63535843l68691l18527q76541p58629m01420m32511r6206k51885o89049k45857
$$ 463535843 463167152 462848625 461972084 461213455 460812035 460379524 460283318 460031433 459342384 459096527
3167D59096527k64015q80928j033669q91876n28564l60031m21067l98216p01408j34316
$$ 459096527 458832512 457951584 456917915 456026039 455497475 455137444 454716377 454318161 453616753 453482437
3176.6D53482437J55182q01163r43031q29926k61726j68075n28222k43301o51093n80825
$$ 453482437 453637619 452836456 451893425 451063499 450801773 450633698 450105476 449862175 449211082 448630257
3186.3D48630257o57387j067581q16384m03328j18713m18129l33595m85077n99899
$$ 448630257 447972870 446905289 446088905 445685577 445566864 445148735 444815140 444330063 443730164
3195D43730164l63427m52423m12521n95551l80706m67263p15255n92308k80114J95847
$$ 443730164 443366737 442914314 442501793 441906242 441525536 441058273 440343018 439750710 439470596 439666443
3204.6D39666443m22478r42955p30934k03781k57950r01909o64177n09147k21367l06511
$$ 439666443 439243965 438301010 437570076 437366295 437108345 436206436 435542259 435033112 434811745 434505234
3214.3D34505234r87511p97081k05192J97105l61443q41674k24572m35638r53522m20341
$$ 434505234 433517723 432720642 432515450 432712555 432351112 431509438 431284866 430849228 429895706 429475365
3223.9D29475365m11797m81758j55754m38118m58222m55017l28025j10932l53164m81339
$$ 429475365 429063568 428581810 428426056 427987938 427529716 427074699 426746674 426635742 426282578 425801239
3233.5D25801239l68042k28882o24046p57828n81856l97224l61900p07016l14827Q3541
$$ 425801239 425433197 425204315 424580269 423822441 423240585 422843361 422481461 421774445 421459618 421543159
3243.2D21543159L12005k65809j225357q03184n66673m00048j14097l11890o79741
$$ 421543159 421855164 421589355 420363998 419560814 418994141 418594093 418479996 418168106 417488365
3251.9D17488365m00123R7503j79481j66626o28433q42553M0131k27966p48902o4201
$$ 417488365 417088242 417185745 417006264 416839638 416211205 415368652 415408783 415180817 414431915 414367714
3261.5D14367714J38321p47643p86514k51732q7700k43797q04100n10826K20375j32675
$$ 414367714 414506035 413758392 412971878 412720146 412632446 412388649 411584549 411073723 411294098 411161423
3271.2D11161423n48973R91l18946n88036K74620k87018j021538r97123l91731L00979
$$ 411161423 410612450 410613441 410294495 409706459 409981079 409694061 408672523 407675400 407283669 407584648
3280.8D07584648l04680k94151O6757l6812m87098q81081l11851N0468J61514k71263
$$ 407584648 407279968 406985817 407052574 407015762 406528664 405647583 405335732 405386200 405547714 405276451
3290.4D05276451o00090m22516n72700j18485L3951k25716n85136o30646r1018l99170
$$ 405276451 404676361 404253845 403681145 403562660 403596611 403370895 402785759 402155113 402064095 401664925
3300.1D01664925n12238l36304k14500k76527n32380j38244k82440m51470l25622l663
$$ 401664925 401152687 400816383 400601883 400325356 399792976 399654732 399372292 398920822 398595200 398591537
3309.7C98591537j88407j119042o08330p75756j085740j93748m13590l93524K17476
$$ 398591537 398403130 397284088 396675758 395900002 394814262 394620514 394206924 393813400 394030876
3318.4C94030876J07041o92902p90062m15573l38936p9880l93448l87954q89244j160622
$$ 394030876 394137917 393445015 392654953 392239380 391900444 391820564 391427116 391039162 390149918 388989296
3328.1C88989296l13797p61185p51266o57654p06482q1863m24729k54402k06947r77288
$$ 388989296 388675499 387914314 387163048 386505394 385798912 385717049 385292320 385037918 384830971 383853683
3337.7C83853683p65037o39343q62618m98733m82331p15141n41878q63380p95708r8266
$$ 383853683 383088646 382449303 381586685 381087952 380605621 379890480 379348602 378485222 377689514 377591248
3347.3C77591248j78109m68788l41453m78363p87888r19113j004067j28517K90222
$$ 377591248 377413139 376944351 376602898 376124535 375336647 374417534 373413467 373284950 373575172
3356C73575172n97038o25381k81449k37312o46248j177902p03926L853j15433l79067
$$ 373575172 372978134 372352753 372071304 371833992 371187744 370009842 369305916 369309769 369194336 368815269
3365.7C68815269l26576r57565r92699K9679K30293j41258n74646q59757l71780m8294
$$ 368815269 368488693 367531128 366538429 366568108 366798401 366657143 366082497 365222740 364850960 364802666
3375.3C64802666p44362p87583k54516k91100o55021q11463m0169J60981j61820k58560
$$ 364802666 364058304 363270721 363016205 362725105 362070084 361258621 361218452 361379433 361217613 360959053
3384.9C60959053n06325m30755n52445j80168K03209j48087m05769p15561n85823q583
$$ 360959053 360452728 360021973 359469528 359289360 359492569 359344482 358938713 358223152 357637329 357628746
3394.6C57628746n2338l47137k8038m80232n20401N0316m34342K11945J9264j095696
$$ 357628746 357576408 357229271 357201233 356721001 356200600 356250916 355816574 356028519 356047783 354952087
3404.2C54952087o20079q3999N80063K26287k91023O9733k04201k04010j66321j70669
$$ 354952087 354332008 354248009 354828072 355054359 354763336 354833069 354628868 354424858 354258537 354087868
3413.9C54087868k22588l77273K51693j1902l40919M14124R7045j06582O5307l69072
$$ 354087868 353865280 353488007 353739700 353727798 353386879 353801003 353898048 353791466 353856773 353487701
3423.5C53487701q7242J77460J97144L9749m63982j37634L77960N3978o8855J57318
$$ 353487701 353400459 353577919 353775063 353814812 353350830 353213196 353591156 353645134 353576279 353733597
3433.2C53733597M31251N93033l34778l28636K87857k06070R9297O86035N50728l18909
$$ 353733597 354164848 354757881 354423103 354094467 354382324 354176254 354275551 354961586 355512314 355193405
3442.8C55193405k36091M54597P05872J089744l65715l75404M28810J2703P21969Q43583
$$ 355193405 354957314 355411911 356117783 357207527 356841812 356466408 356895218 356907921 357629890 358473473
3452.5C58473473M96215l9787O8359Q47931L38478L6774O218K86789R19075P95441
$$ 358473473 358969688 358929901 358998260 359846191 360184669 360221443 360227661 360514450 361433525 362228966
3462.1C62228966K76565L57590O56967O73027N51949K08969M74358L67393k1896L05290
$$ 362228966 362505531 362863121 363520088 364193115 364745064 364954033 365428391 365795784 365773888 366079178
3471.7C66079178O38962Q04138O44378N95780L90434K04773K46506P71866J163749
$$ 366079178 366718140 367522278 368166656 368762436 369152870 369357643 369604149 370376015 371539764
3480.4C71539764O42968K13585k33040R72595J360054Q1558O08292M56505k33193L84522
$$ 371539764 372182732 372396317 372163277 373135872 374495926 374577484 375185776 375642281 375409088 375793610
3490.1C75793610R79919Q72078O31371R02481Q99963N91507o8932M84620J008529N3635
$$ 375793610 376773529 377645607 378276978 379179459 380079422 380670929 380601997 381086617 382095146 382148781
3499.7C82148781O25648J833077J067123j16615r7580K33688N34935Q01545J780624
$$ 382148781 382774429 384607506 385674629 385558014 385460434 385694122 386229057 387030602 388811226
3508.4C88811226J439552n34859L38555P13768M44603J040649K45629k61841Q80661
$$ 388811226 390250778 389715919 390054474 390768242 391212845 392253494 392499123 392237282 393117943
3517.1C93117943J319122R05953Q13751N49278J525803J469993j77803L80631Q79364
$$ 393117943 394437065 395343018 396156769 396706047 398231850 399701843 399524040 399904671 400784035
3525.7D00784035J179123R37576N05295k8610Q1863O11038O60324J327858P68624J701545
$$ 400784035 401963158 402900734 403406029 403377419 403459282 404070320 404730644 406058502 406827126 408528671
3535.4D08528671J536789n20363P80754J117783R33723P29561J726418J956863J066704
$$ 408528671 410065460 409545097 410325851 411443634 412377357 413106918 414833336 416790199 417856903
3544.1D17856903O60133m77981J445007M11720N08461J129952Q81538K274857l83186
$$ 417856903 418517036 418039055 419484062 419895782 420404243 421534195 422415733 424690590 424307404
3552.7D24307404R48219J446457R43336J831665j0452J414032J408386O24314M45480
$$ 424307404 425255623 426702080 427645416 429477081 429466629 430880661 432289047 432913361 433358841
3561.4D33358841J523666J687470M06875M356728Q17108j790924J265526q81767L164024
$$ 433358841 434882507 436569977 436976852 441333580 442150688 440359764 441625290 440743523 443907547
3570.1D43907547J980476M66195J323013J834946J510925N56488J364670O44874K207794
$$ 443907547 445888023 446354218 447677231 449512177 451023102 451579590 452944260 453589134 455796928
3578.8D55796928K222062P56149J323700J432800J360588J8387L126907K868653r79233
$$ 455796928 458018990 458775139 460098839 461531639 462892227 462910614 466037521 468906174 467926941
3587.5D67926941J795921r25522J408806K547989K987099K055206L16010L060302j085395
$$ 467926941 469722862 468797340 470206146 472754135 475741234 477796440 478112450 481172752 480087357
3596.1D80087357J247596M025650Q07038K359428N45273J80054K185325J175614J460952
$$ 480087357 481334953 485360603 486167641 488527069 489072342 489252396 491437721 492613335 494074287
3604.8D94074287L457642L442574j703644J925010K02065j292610P496528K876206
$$ 494074287 497531929 500974503 499270859 501195869 501397934 500105324 507601852 510478058
3612.5E10478058l714066L599358N03158L301316N230560M96025J589165j25847q9645
$$ 510478058 506763992 510363350 510866508 514167824 519398384 519894409 521483574 521357727 521268082
3621.2E21268082K642860K105103J871872K567596K182770K248955P356872N588951
$$ 521268082 523910942 526016045 527887917 530455513 532638283 534887238 542244110 547833061
3628.9E47833061j2368278K250M199372N752868K231026k155228J851044L321610K816238
$$ 547833061 535464783 535467033 539666405 545419273 547650299 545495071 547346115 550667725 553483963
3637.6E53483963R54514P88841K076530L177605J927986J5183J792793L860817P154884
$$ 553483963 554438477 555227318 557303848 560481453 562409439 562424622 564217415 568078232 575233116
3646.3E75233116J336785l832436O575470J677437m455338l191719M423790M168778
$$ 575233116 576569901 572737465 579312935 580990372 576535034 573343315 577767105 581935883
3654E81935883L570861P285462o334953r27735N268746J903381J279488K08702K113189
$$ 581935883 585506744 592792206 586457253 585529518 590798264 592701645 593981133 594189835 596303024
3662.7E96303024Q25043J008186K114945N48057N150071M275474l10211J268845p576371
$$ 596303024 597128067 598136253 600251198 600799255 605949326 610224800 609914589 611183434 603607063
3671.4F03607063J02349Q093681J0897293L721237j9190941r49669O761666N098228
$$ 603607063 603709412 611803093 622700386 626421623 607230682 606281013 613042679 618140907
3679.1F18140907k402420L9521K839241J426086J670380M03785J4763M063149P446479
$$ 618140907 615738487 615778008 618617249 620043335 621713715 622117500 622132263 626195412 633641891
3687.8F33641891p780456n078087R352341n003205k395362M759597R33571J653366
$$ 633641891 625861435 620783348 630135689 625132484 622737122 627496719 628430290 630083656
3695.5F30083656L57018m80957P31430j28021K437439M413566l842392m448280L958473
$$ 630083656 630440674 629959717 630691147 630563126 633000565 637414131 633571739 629123459 633081932
3704.1F33081932K042885J81847Q30116K579422M467087p302704K722015P072983j4403916
$$ 633081932 635124817 635306664 636136780 638716202 643183289 635880585 638602600 645675583 631271667
3712.8F31271667J137467M624481J119728L59650K455940K392120l876190j30729O741523
$$ 631271667 632409134 637033615 638153343 638512993 640968933 643361053 639484863 639354134 646095657
3721.5F46095657j558609o509132M266090K084809o02570l806801j075859M098740
$$ 646095657 644537048 638027916 642294006 644378815 643776245 639969444 638893585 642992325
3729.2F42992325R12628N377350n99365p565918R383468L073731j0620804j654663
$$ 642992325 643904953 649282303 648682938 641117020 650500488 653574219 642953415 641298752
3736.9F41298752J666717o54297J614838L309937m802323K413254J3760071o027756
$$ 641298752 642965469 642311172 643926010 647235947 642433624 644846878 658606949 652579193
3744.7F52579193k0839004Q419799N829163P291489O34308j1515275J0370484m121018
$$ 652579193 631740189 640159988 645989151 653280640 653914948 642399673 652770157 648649139
3752.4F48649139j1037979M351502M685364M284439n827179Q25576P035599p227096
$$ 648649139 637611160 641962662 646648026 650932465 645105286 645930862 652966461 645739365
3760.1F45739365l556900M192123J432495l66363L499069k474594m991379L944778
$$ 645739365 642182465 646374588 647807083 647440720 650939789 648465195 643473816 647418594
3767.8F47418594N817643J985931r726105l21502K691955n06515J128311M89044Q94470
$$ 647418594 653236237 655222168 645496063 645174561 647866516 647360001 648488312 648977356 649871826
3776.5F49871826l15475J673431J082764q235779J423340L029327J437607L291931
$$ 649871826 649556351 651229782 652312546 644076767 645500107 648529434 649967041 653258972
3784.2F53258972l057327k334671J373520J27487l19519l59802P32040K23694m3335
$$ 653258972 650201645 647866974 649240494 649367981 649048462 648688660 649420700 649644394 649601059
3792.9F49601059o87943R47419M639511j944580n171357Q38776L685684P973557j072083
$$ 649601059 648913116 649860535 654500046 652555466 647384109 648222885 651908569 659882126 658810043
3801.5F58810043j3019256j15204J731644N454788Q310318r226990p846222M270783
$$ 658810043 645790787 645675583 647407227 652862015 661172333 651945343 644099121 648369904
3809.3F48369904K101364L12423M87137K1591J288987O663360J920471j7446975K796631
$$ 648369904 650471268 650783691 651270828 651292419 652581406 659244766 661165237 643718262 646514893
3817.9F46514893O404953M699783M944229j5920410k089081M305191J936493L004913
$$ 646514893 652919846 657619629 662563858 646643448 644554367 648859558 650796051 653800964
3825.7F53800964J011811m525757j168366J225357L286667L210526r005661Q42819
$$ 653800964 654812775 650287018 649118652 650344009 653630676 656841202 647835541 648678360
3833.4F48678360Q090439n251465j073761R944534p892685q369903R121475l023148
$$ 648678360 656768799 651517334 650443573 660388107 652495422 644125519 653246994 650223846
3841.1F50223846k754669P060776j404190n309372K075424R08051k64740K541046j03531
$$ 650223846 647469177 654529953 653125763 647816391 649891815 650799866 650535126 653076172 652972641
3849.8F52972641J001968O125336l781052J912156j3691788k813873J0560760p25937
$$ 652972641 653974609 660099945 656318893 658231049 644539261 641725388 652286148 651560211
3857.5F51560211l445282K352219K108307K282257n494156n68924Q290863m169235
$$ 651560211 648114929 650467148 652575455 654857712 649363556 648794632 657085495 652916260
3865.2F52916260p382660K827301N168533P574692n769882j1723938K134933O914063
$$ 652916260 645533600 648360901 653529434 661104126 655334244 643610306 645745239 652659302
3872.9F52659302N861282j0643158j885986L065872r689K806015O277313k861176j0105819
$$ 652659302 658520584 647877426 645991440 649057312 649047623 651853638 658130951 655269775 645163956
3881.6F45163956M666214J443405N32913O738968j1274490j211853L504943O27289
$$ 645163956 649830170 651273575 651806488 658545456 647270966 646059113 649564056 650191345
3889.3F50191345M917908J8921r970017O23856L740692j387787J603165J629715K178116
$$ 650191345 655109253 655128174 645158157 645782013 649522705 648134918 649738083 651367798 653545914
3898F53545914L675842r882431L703766L280487o703797M419861k670440k366562O57272
$$ 653545914 657221756 647339325 651043091 654323578 647619781 652039642 649369202 647002640 647659912
3906.7F47659912N09338K142334m76837k56424q5220L41263k20795j094513J576996
$$ 647659912 648169250 650311584 649834747 649578323 649493103 649834366 649613571 648519058 650096054
3915.3F50096054K573013l286743m114151M926148J726455n048828J109085J885300
$$ 650096054 652669067 649382324 645268173 650194321 651920776 646871948 647981033 649866333
3923.1F49866333J370850p82166l402405K92282J536103J836395r53445p42493K303772
$$ 649866333 651237183 650455017 647052612 647344894 648880997 650717392 649763947 649021454 651325226
3931.7F51325226l215866k523041J930466O15997M1122J31379l052J74789m34036Q37631
$$ 651325226 648109360 645586319 647516785 648132782 648173904 648305283 648302231 648477020 648042984 648880615
3941.4F48880615J718521l120727j290131J249390M04205J503372j754531K01187O27212
$$ 648880615 650599136 647478409 646188278 647437668 647841873 649345245 647590714 647791901 648419113
3950.1F48419113l125992J932602J054154j192169R0789K96326Q71506o24161l33481
$$ 648419113 645293121 647225723 648279877 647087708 647178497 647474823 648346329 647722168 647388687
3958.7F47388687n74341J62049Q83255j308899l25470L47442M36631M31594j61590
$$ 647388687 646814346 646976395 647859650 646550751 646225281 646572723 647009354 647440948 647279358
3967.4F47279358K24152l82157r31320K12326P36542j6175k86254m48609l6316N24445
$$ 647279358 647503510 647121353 646190033 646402359 647138901 647122726 646836472 646387863 646351547 646875992
3977.1F46875992N52749j1138m60358m7760o37970k43836P68586M90951l42254n14603
$$ 646875992 647428741 647417603 646957245 646909485 646271515 646027679 646796265 647287216 646944962 646430359
3986.7F46430359j47095k72751P11823K41165k69547M8981o12106J66550l40958q48236
$$ 646430359 646283264 646010513 646722336 646963501 646693954 646742935 646130829 646297379 645956421 645108185
3996.3F45108185l00141M21982J613236M94919
$$ 645108185 644808044 645230026 646843262 647338181
4000.2F47338181
$$ 647338181
##END=$$ End of the data block
