##TITLE=$$ Begin of the data block
##JCAMP-DX=5.00 $$ ACD/SpecManager v 10.08
##SPECTROMETER/DATA SYSTEM=Varian
##DATE=08 Jan 2013 15:30:30
##DATA TYPE=INFRARED SPECTRUM
##DATA CLASS=XYDATA
##ORIGIN=
##OWNER=
##NPOINTS=3735
##FIRSTX=399.26403809
##LASTX=4000.35498047
##MAXX=4000.35498047
##MINX=399.26403809
##MAXY=78.87498474
##MINY=36.57224655
##XFACTOR=1.0000000000
##YFACTOR=0.000000100000000
##FIRSTY=57.73078156
##DELTAX=0.96440572
##XUNITS=1/CM
##YUNITS=TRANSMITTANCE
##XYDATA=(X++(Y..Y))
$$ plain form
399.3 577307816 566217384 557624321 556360245 557580299 553036995 548434982 551575584 553467865
407 553467865 556650429 559806595 558004646 554602280 553945503 556083374 554486923 552784843 554929619
415.7 554929619 555833435 547821198 533881035 542428589 554959145 559191628 552879257 545572853
423.4 545572853 547604485 553196144 560360069 558495979 553750954 550329132 549461632 548451500 546754837
432.1 546754837 549926987 550218010 550664787 555635223 555797691 551637535 550804787 551058846 544770889
440.7 544770889 542488022 550920677 554040031 556829491 561232262 561093559 556073952 551926689 551846542
449.4 551846542 552804298 550590172 548039436 549801559 551941299 550274086 551161690 551682739 546319580
458.1 546319580 548955078 550409813 551109161 554435196 557450104 559415092 558668060 553729668 546579514
$$ packed form
399.3E77307816j1090432q593063j264076J220054m543304m602013L140602J892281
407E53467865L182564L156166j801949l402366o56777K137871j596451j702080K144776
415.7E54929619R03816q012237j3940163Q547554J2530556M232483o312371p306404
423.4E45572853K031632N591659P163925j864090m745025l421822q67500j010132j696663
432.1E46754837L172150K91023M46777M970436J62468m160156q32748K54059o287957
440.7E44770889k282867Q432655L119354K789460M402771j38703n019607m147263q0147
449.4E51846542R57756k214126k550736J762123K139740j667213Q87604N21049n363159
458.1E46319580K635498J454735O99348L326035L014908J964988p47032m938392p150154
$$ plain form
466.8 546579514 546001282 548718872 545388603 544162827 546753197 549198189 547248993 545897064 546075935
475.5 546075935 543358307 540397644 541687202 541832619 540966187 544695702 547628632 549263191 547329750
484.1 547329750 543809776 546374435 547035065 545620003 544757576 543946953 544216919 547030754 552115326
492.8 552115326 550895882 546665344 543430214 541105804 541506310 541660004 543281250 544685516 543736916
501.5 543736916 544840393 544067039 538701591 536410408 540476570 542183380 542161179 543089027 542013206
510.2 542013206 545149002 547552452 542384605 537497940 535179367 533267212 532566872 535187454 539330406
518.9 539330406 540263672 538773346 537370338 535639725 534739189 535217819 534658546 533822556 536652641
527.5 536652641 538730049 537361069 534887238 533953133 534902534 535126762 534093971 533025894 534103127
$$ packed form
466.8E46579514n78232K717590l330269j225776K590370K444992j949196j351929J78871
475.5E46075935k717628k960663J289558J45417q66432L729515K932930J634559j933441
484.1E47329750l519974K564659O60630j415062q62427q10623K69966K813835N084572
492.8E52115326j219444m230538l235130k324410M00506J53694J621246J404266r48600
501.5E43736916J103477p73354n365448k291183M066162J706810k2201R27848j075821
510.2E42013206L135796K403450n167847m886665k318573j912155p00340K620582M142952
518.9E39330406R33266j490326j403008j730613r00536M78630n59273q35990K830085
527.5E36652641K077408j368980k473831r34105R49401K24228j032791j068077J077233
$$ plain form
536.2 534103127 535338516 535096855 534797859 533622055 532956848 531930885 530513878 530473557 531687431
544.9 531687431 533785095 534026909 532709160 530781822 529733276 530805588 531602020 530402565 527675819
553.6 527675819 526058922 526304054 527987862 529289246 529539413 528879814 526433868 524069939 523215332
562.3 523215332 524395981 526364822 528618240 529794693 529869194 530658379 529737282 528994751 530218925
570.9 530218925 530079269 528749886 527833519 527565384 527694283 528131752 527874603 527233734 527473221 527855644
580.6 527855644 526990128 527002449 527848129 528092461 529524078 529513588 528712044 530072975 530371284 528905220
590.2 528905220 528108215 528175278 528234367 529311981 530294189 530661316 531211319 531030693 530335846 528464241
599.9 528464241 528063202 528931122 527933998 528169594 530944672 531915054 529388809 527644997 526954498
$$ packed form
536.2E34103127J235389k41661k98996j175804o65207j025963j417007m0321J213874
544.9E31687431K097664K41814j317749j927338j048546J072312P96432j199455k726746
553.6E27675819j616897K45132J683808J301384K50167o59599k445946k363929q54607
562.3E23215332J180649J968841K253418J176453P4501P89185r21097p42531J224174
570.9E30218925j39656j329383r16367k68135J28899M37469k57149o40869K39487L82423
580.6E27855644q65516J2321Q45680K44332J431617j0490q01544J360931K98309j466064
590.2E28905220p97005O7063N9089J077614R82208L67127N50003j80626o94847j871605
599.9E28464241m01039Q67920r97124K35596K775078R70382k526245j743812o90499
$$ plain form
608.5 526954498 525644379 524195976 523872719 524947243 523844643 524035225 526128998 526332321 525865288
617.2 525865288 524523621 525023041 526966820 527738724 528171501 528062859 528132782 528796730 530056152
625.9 530056152 531669998 532221985 532032433 532137222 533702736 536375961 537046852 537273979 539292336
634.6 539292336 541121979 541924515 541666069 541324043 541982460 544110146 546623764 547723656 548032455
643.3 548032455 548130226 548358879 549777222 552589531 554140129 553845177 553489532 553642006 554271736
651.9 554271736 554228973 554558945 555132637 555453758 555978928 555391197 554818459 554972229 555050735 554135742
661.6 554135742 553228035 553572617 553476753 554680748 557103195 557677536 555726242 557057571 556730270
670.3 556730270 556214523 556815796 556954575 558095207 559812584 560696068 561683960 562560425 563895302
$$ packed form
608.5E26954498j310119j448403l23257J074524j102600J90582K093773K03323m67033
617.2E25865288j341667M99420J943779P71904M32777j08642O9923O63948J259422
625.9E30056152J613846N51987j89552J04789J565514K673225O70891K27127K018357
634.6E39292336J829643Q02536k58446l42026O58417K127686K513618J099892L08799
643.3E48032455R7771K28653J418343K812309J550598k94952l55645J52474O29730
651.9E54271736m2763L29972N73692L21121N25170n87731n72738J53770P8506r14993
661.6E54135742r07707L44582r5864J203995K422447N74341j951294J331329l27301
670.3E56730270n15747O01273J38779J140632J717377Q83484R87892Q76465J334877
$$ plain form
678.9 563895302 563854675 562385788 562229195 563454666 565063133 567087212 569767303 570455856 569548302
687.6 569548302 569526749 569728127 569831123 569553146 569744797 571083908 572536583 573121986 572743530 572280006
697.3 572280006 571952744 572178421 572362938 572114677 573120155 574648972 575313911 575763893 576568336
705.9 576568336 577800064 578326378 578025780 577897797 578034706 578811340 579140320 579449692 581521759
714.6 581521759 582771835 582762451 583002853 583241005 584256783 584168472 583169174 584393158 586384010 587892914
724.3 587892914 589186859 589796944 589841118 590200691 590396652 589672508 590539894 593319473 595497398
733 595497398 596676979 597178230 597160110 596434746 595861206 596331291 596512375 595975342 596172752 597436943
742.6 597436943 599483795 601063576 600708923 599874420 600126686 601156082 602269897 603276138 604038353
$$ packed form
678.9E63895302m0627j468887j56593J225471J608467K024079K680091O88553r07554
687.6E69548302k1553K01378J02996k77977J91651J339111J452675N85403l78456m63524
697.3E72280006l27262K25677J84517k48261J005478J528817O64939M49982Q04443
705.9E76568336J231728N26314l00598j27983J36909P76634L28980L09372K072067
714.6E81521759J250076r384K40402K38152J015778q8311r99298J223984J990852J508904
724.3E87892914J293945O10085M4174L59573J95961p24144Q67386K779579K177925
733E95497398J179581N01251j8120p25364n73540M70085J81084n37033J97410J264191
742.6E97436943K046852J579781l54653q34503K52266J029396J113815J006241P62215
$$ plain form
751.3 604038353 605290260 606756821 607026443 607304268 607517624 607450523 607263107 607646370 609769669
760 609769669 611414452 613297501 614332352 613669624 614520569 614961128 614175301 613701019 613873444 614252663
769.6 614252663 615674248 617609138 617907829 617770271 617287865 617213516 616664085 615188370 615312386
778.3 615312386 616368561 617462883 618146362 619653931 620908546 620394630 619857025 618855972 618506889
787 618506889 619633446 620803261 621615410 622858772 624474335 625251160 624768410 623727264 622907448
795.6 622907448 620940704 619384727 620675201 623155594 624732933 625029182 623831787 621667366 619843750
804.3 619843750 617783813 616571999 616046715 616410408 617882042 617684402 617480888 617170029 615190163
813 615190163 612324562 609161034 607430801 607816010 608932419 609711571 611045227 611938629 611888275
$$ packed form
751.3F04038353J251907J466561K69622K77825K13356o7101j87416L83263K123299
760F09769669J644783J883049J034851o62728Q50945M40559p85827m74282J72425L79219
769.6F14252663J421585J934890K98691j37558m82406p4349n49431j475715J24016
778.3F15312386J056175J094322O83479J507569J254615n13916n37605j001053l49083
787F18506889J126557J169815Q12149J243362J615563P76825m82750j041146q19816
795.6F22907448j966744j555977J290474K480393J577339K96249j197395k164421j823616
804.3F19843750k059937j211814n25284L63693J471634j97640k03514l10859j979866
813F15190163k865601l163528j730233L85209J116409P79152J333656Q93402n0354
$$ plain form
821.7 611888275 611472511 611204109 611731987 611890755 613513756 616352577 619638329 623559723 626088791
830.4 626088791 628299332 629684219 629706192 629306374 630198212 633017960 636244812 638939209 640723267
839 640723267 643336639 645046539 645139389 643980789 642474976 642971039 644130554 646576462 648563690
847.7 648563690 650053864 652406540 653517685 652906952 651427841 651175766 650878143 651712036 654769745
856.4 654769745 658779373 662958374 664249573 663936768 663384781 662341690 661605835 661246490 660663528
865.1 660663528 661839371 664440536 665936584 666557693 664260864 660925140 657755814 655094223 653585968
873.8 653585968 652141418 652684402 653942032 655671310 656646118 656104050 654891052 652664108 650932541
882.4 650932541 649338226 650460205 653108597 654352112 654167023 653403091 653209686 650921936 648384933
$$ packed form
821.7F11888275m15764k68402N27878J58768J623001K838821L285752L921394K529068
830.4F26088791K210541J384887K1973l99818Q91838K819748L226852K694397J784058
839F40723267K613372J709900R2850j158600j505813M96063J159515K445908J987228
847.7F48563690J490174K352676J111145o10733j479111k52075k97623Q33893L057709
856.4F54769745M009628M179001J291199l12805n51987j043091p35855l59345n82962
865.1F60663528J175843K601165J496048O21109k296829l335724l169326k661591j508255
873.8F53585968j444550N42984J257630J729278R74808n42068j212998k226944j731567
882.4F50932541j594315J121979K648392J243515j85089p63932j93405k287750k537003
$$ plain form
891.1 648384933 646713715 646171570 647021103 648747635 651722412 653140488 653437195 652447739 650304871
899.8 650304871 647756500 645043259 643400650 643451004 645980453 648524857 651081543 652846375 653087463
908.5 653087463 652943115 651766663 651354828 651333237 652521057 654257507 655388641 655899048 654562759
917.2 654562759 652750320 649561081 646191940 643678284 641295776 639949455 640068893 639961281 638200836
925.8 638200836 636453629 633339500 629083290 625117950 620972824 618118362 617791100 619551582 621038284
934.5 621038284 621562843 621103897 619593658 618191299 616313858 613600349 611981316 612758827 614128418
943.2 614128418 615323029 616233139 616449471 615572472 612835274 610059738 608572350 608219185 608390160
951.9 608390160 609670029 611495667 612371178 612201614 609436226 605536842 602046623 599237366 597778969
$$ packed form
891.1F48384933j671218n42145Q49533J726532K974777J418076K96707r89456k142868
899.8F50304871k548371k713241j642609N0354K529449K544404K556686J764832K41088
908.5F53087463j44348j176452m11835k1591J187820J736450J131134N10407j336289
917.2F54562759j812439l189239l369141k513656k382508j346321J19438j07612j760445
925.8F38200836j747207l114129m256210l965340m145126k854462l27262J760482J486702
934.5F21038284N24559m58946j510239j402359j877441k713509j619033P77511J369591
943.2F14128418J194611R10110K16332q76999k737198k775536j487388l53165J70975
951.9F08390160J279869J825638Q75511j69564k765388l899384l490219k809257j458397
$$ plain form
960.6 597778969 596900444 596745758 597153893 597272530 596205597 594030609 590729675 587140007 585006218
969.2 585006218 583551025 582410393 581996231 582384720 582367935 580650787 577669525 573526230 569152336
977.9 569152336 565417137 562170677 559766693 558124886 556410255 554480858 551441574 547164879
985.6 547164879 542469559 537108536 532583656 530367393 528965111 527122612 525781136 524637032
993.3 524637032 523095703 520875092 517449646 513213615 509696617 507730026 506277771 505859337 505450897
1002 505450897 504310684 502749977 499933243 496785812 493345642 490267525 488347015 488020935 488099022
1010.7 488099022 487203178 486408882 485197334 483143387 479841385 476559868 473406143 470316277 468168793
1019.4 468168793 466559868 466645699 466402397 465285759 462164841 457798233 455014648 452846031 452314339
$$ packed form
960.6E97778969q78525j54686M08135J18637j066933k174988l300934l589668k133789
969.2E85006218j455193j140632m14162L88489j6785j717148k981262m143295m373894
977.9E69152336l735199l246460k403984j641807j714631j929397l039284m276695
985.6E47164879m695320n361023m524880k216263j402282j842499j341476j144104
993.3E24637032j541329k220611l425446m236031l516998j966591j452255m18434m08440
1002E05450897j140213j560707k816734l147431l440170l078117j920510l26080P8087
1010.7D88099022q95844p94296j211548k053947l302002l281517l153725l089866k147484
1019.4D68168793j608925Q5831k43302j116638l120918m366608k783585k168617n31692
$$ plain form
1028.1 452314339 452098579 452732697 453855019 454724693 455566139 455142326 454385529 452830658 452478027
1036.7 452478027 453292847 455121803 457619095 459709167 462712555 465094376 466133347 464942818
1044.5 464942818 463384056 461870689 460214462 459991531 459971008 460481834 460061378 459710579 458362198
1053.1 458362198 456085854 454407463 451605301 450693474 450736580 451614609 453011971 455304909 458758507
1061.8 458758507 460222282 461230316 461008797 460483055 461329231 463259926 465942726 468658295 471378059
1070.5 471378059 472412529 471554375 469542465 468523827 467687798 466176224 466723938 468780479 470714035
1079.2 470714035 471407280 471794548 471480293 469987869 467934418 466809502 467546043 468304176 469725952
1087.9 469725952 471968651 475159264 477063980 477259636 477142525 475781593 474724846 475129852 477507629
$$ packed form
1028.1D52314339k15760O34118J122322Q69674Q41446m23813p56797j554871l52631
1036.7D52478027Q14820J828956K497292K090072L003388K381821J038971j190529
1044.5D64942818j558762j513367j656227k22931k0523N10826m20456l50799j348381
1053.1D58362198k276344j678391k802162r11827M3106Q78029J397362K292938L453598
1061.8D58758507J463775J008034k21519n25742Q46176J930695K682800K715569K719764
1070.5D71378059J034470q58154k011910j018638q36029j511574N47714K056541J933556
1079.2D70714035O93245L87268l14255j492424k053451j124916P36541P58133J421776
1087.9D69725952K242699L190613J904716J95656j17111j360932j056747M05006K377777
$$ plain form
1096.5 477507629 479413681 481713409 485470734 488145561 489217949 488170013 487232590 486448059 486820717
1105.2 486820717 488559151 490715523 494197769 496207466 497453804 497203445 495301323 494326630 494175415
1113.9 494175415 494696198 495435066 497330360 499695358 502099419 503597984 503950958 503383865 500922585
1122.6 500922585 498440208 497085228 497869492 499795876 502258759 505111580 507519722 510036812
1130.3 510036812 510556641 509439507 508141899 508315392 510775146 513713074 517073822 520675430 523530006
1139 523530006 524370346 524203377 523811264 523040352 522690048 523069572 524393616 526489182 529133911
1147.6 529133911 530610962 531153259 530677719 528541069 526606865 524959450 525028610 526519585 527417908
1156.3 527417908 528378601 529221497 528954849 527265701 525290451 523405457 522289276 522257347 523573685
$$ packed form
1096.5D77507629J906052K299728L757325K674827J072388j047936r37423p84531L72658
1105.2D86820717J738434K156372L482246K009697J246338k50359j902122r74693j51215
1113.9D94175415N20783P38868J895294K364998K404061J498565L52974n67093k461280
1122.6E00922585k482377j354980P84264J926384K462883K852821K408142K517090
1130.3E10036812N19829j117134j297608J73493K459754K937928L360748L601608K854576
1139E23530006Q40340j66969l92113p70912l50304L79524J324044K095566K644729
1147.6E29133911J477051N42297m75540k136650j934204j647415O9160J490975Q98323
1156.3E27417908R60693Q42896k66648j689148j975250j884994j116181l1929J316338
$$ plain form
1165 523573685 526667747 529901581 533391457 536000748 536872292 537061615 537154732 537944489 539930420
1173.7 539930420 543063774 547222748 552359467 556183167 557830353 558824348 559385490 559352684 559457321
1182.4 559457321 560638618 563273964 567072144 570824471 572971916 573378181 573119087 572170334 570698967
1191 570698967 569621048 569999886 571407623 572898903 574830551 576340141 576244965 574802361 572409401
1199.7 572409401 569269676 566804123 565777206 566416779 569001503 571280746 571619034 570595169 568780861
1208.4 568780861 566731377 564528580 562527466 561705360 562668877 564795074 566765137 567543488 567100182
1217.1 567100182 565877991 563747597 561246376 559538918 559155121 559800415 561410980 563495483 564831734
1225.8 564831734 564660759 562606850 559468002 556905403 555376320 554576721 555088882 557191429 559588928
$$ packed form
1165E23573685L094062L233834L489876K609291Q71544J89323R3117P89757J985931
1173.7E39930420L133354M158974N136719L823700J647186R93995N61142l2806J04637
1182.4E59457321J181297K635346L798180L752327K147445M06265k59094r48753j471367
1191E70698967j077919L78838J407737J491280J931648J509590r5176j442604k392960
1199.7E72409401l139725k465553j026917O39573K584724K279243L38288j023865j814308
1208.4E68780861k049484k202797k001114q22106R63517K126197J970063P78351m43306
1217.1E67100182j222191k130394k501221j707458l83797O45294J610565K084503J336251
1225.8E64831734j70975k053909l138848k562599j529083p99599N12161K102547K397499
$$ plain form
1234.4 559588928 560673981 560395470 559248848 557290230 555027161 553435783 553036652 553785591 555424957
1243.1 555424957 557289200 558560104 558549385 557251244 555236320 552935753 550961418 550227737 551228180
1251.8 551228180 553367767 555653191 557419052 557703552 556407280 554505844 552516670 550707817
1259.5 550707817 550242500 551488113 553544846 556122818 558273354 559594650 559149017 557586021 556549034
1268.2 556549034 555533142 555361671 556843643 559379883 562392769 565118752 566519051 566313820 564945641
1276.9 564945641 563395157 563106651 563824158 564905815 567118759 570158730 572819061 574949150 575740700
1285.5 575740700 574674149 573179779 572437592 572944374 574429817 576725464 579677811 582436104 583717346
1294.2 583717346 582742805 580476265 578306007 577393456 577397079 578156662 580298386 582888527 584702415
$$ packed form
1234.4E59588928J085053k78511j146622j958618k263069j591378l99131P48939J639366
1243.1E55424957J864243J270904j0719j298141k014924k300567j974335p33681J000443
1251.8E51228180K139587K285424J765861K84500j296272j901436j989174j808853
1259.5E50707817m65317J245613K056733K577972K150536J321296m45633j562996j036987
1268.2E56549034j015892j71471J481972K536240L012886K725983J400299k05231j368179
1276.9E64945641j550484k88506P17507J081657K212944L039971K660331K130089P91550
1285.5E75740700j066551j494370p42187N06782J485443K295647K952347K758293J281242
1294.2E83717346r74541k266540k170258r12551L623P59583K141724K590141J813888
$$ plain form
1302.9 584702415 585218086 584211082 582343712 580275612 577733841 576405869 576985321 578531685 580150604
1311.6 580150604 580629272 580356522 579613800 577719078 574791603 572679596 572507858 573664932 575872345
1320.3 575872345 578496361 580809669 581765862 581447639 580017891 577950478 576792107 576338081 576635475
1328.9 576635475 578016090 579821625 581263809 581467552 580223083 578091698 575602989 572993240
1336.7 572993240 572198372 572637939 573646164 576248550 579281349 581454086 581548882 580028992 578369942
1345.3 578369942 577193031 576965752 577626381 579184151 581150284 582934799 583477478 582789154 581055450
1354 581055450 578342819 576599998 575864334 576134796 577428665 579135208 580389671 580879250 579912605
1362.7 579912605 576584549 575643768 574479446 573359146 573507195 573559456 574995689 576351738 576773071
$$ packed form
1302.9E84702415N15671j007004j867370k068100k541771j327972N79452J546364J618919
1311.6E80150604M78668k72750p42722j894722k927475k112007j71738J157074K207413
1320.3E75872345K624016K313308R56193l18223j429748k067413j158371m54026K97394
1328.9E76635475J380615J805535J442184K03743j244469k131385k488709k609749
1336.7E72993240p94868M39567J008225K602386L032799K172737R4796j519890j659050
1345.3E78369942j176911k27279O60629J557770J966133J784515N42679o88324j733704
1354E81055450k712631j742821p35664K70462J293869J706543J254463M89579r66645
1362.7E79912605l328056r40781j164322j120300J48049N2261J436233J356049M21333
$$ plain form
1371.4 576773071 576475220 575174675 571603699 569154320 569637909 570121002 571428261 573561172 575631485
1380.1 575631485 576458054 575294647 573117294 570526543 568694878 567861748 567264175 566485062 568420639
1388.7 568420639 570332489 570180244 568904762 566340790 563750458 558850861 555055923 555660477 556214256
1397.4 556214256 556789131 555149307 554301033 553791542 551267014 548487282 545504684 541780357 540839958
1406.1 540839958 541834068 542246933 542040100 541472664 539935417 537699738 534557762 532299042 531114197
1414.8 531114197 530520821 530248985 531096687 532696724 529781265 529344330 529757690 528122597 526109314
1423.4 526109314 523949814 525561562 527706108 529051208 531260567 532599945 532231026 531457481 531293755
1432.1 531293755 530485840 530517654 532592773 533891335 533544769 536407280 540144348 541729889 541942368
$$ packed form
1371.4E76773071k97851j300545l570976k449379M83589M83093J307259K132911K070313
1380.1E75631485Q26569j163407k177353k590751j831665q33130n97573p79113J935577
1388.7E68420639J911850j52245j275482k563972k590332m899597l794938O04554N53779
1397.4E56214256N74875j639824q48274n09491k524528k779732k982598l724327r40399
1406.1E40839958R94110M12865k06833n67436j537247k235679l141976k258720j184845
1414.8E31114197n93376k71836Q47702J600037k915459m36935M13360j635093k013283
1423.4E26109314k159500J611748K144546J345100K209359J339378l68919p73545j63726
1432.1E31293755q07915L1814K075119J298562l46566K862511L737068J585541K12479
$$ plain form
1440.8 541942368 541786728 541310158 542001648 542777596 544736061 546729927 548082657 549242897 550927582
1449.5 550927582 552078285 551122284 550790939 551200790 552758446 554404297 554598351 551920128 552816162
1458.2 552816162 559967308 562340813 563809471 564541473 565371284 566971054 566055641 569862556 574129715
1466.8 574129715 577758331 580132256 581604233 582987938 581910591 580804253 583561783 589508133
1474.6 589508133 593135452 595281105 599509659 602537994 603765221 603811455 603179779 603406906 605271187
1483.2 605271187 607409706 609570923 611996536 612432289 612118530 612522812 608674088 606561623 608626404
1491.9 608626404 610374870 611221962 611850243 611040878 606968384 609532852 608886833 605242424 604780731
1500.6 604780731 602957497 602559814 603297539 605034409 605297241 595932121 592771301 595113220 596628342
$$ packed form
1440.8E41942368j55640m76570O91490P75948J958465J993866J352730J160240J684685
1449.5E50927582J150703r56001l31345M09851J557656J645851J94054k678223Q96034
1458.2E52816162P151146K373505J468658P32002Q29811J599770r15413L806915M267159
1466.8E74129715L628616K373925J471977J383705j077347j106338K757530N946350
1474.6E89508133L627319K145653M228554L028335J227227M6234o31676K27127J864281
1483.2F05271187K138519K161217K425613M35753l13759M04282l848724k112465K064781
1491.9F08626404J748466Q47092O28281q09365m072494K564468o46019l644409m61693
1500.6F04780731j823234l97683P37725J736870K62832r365120l160820K341919J515122
$$ plain form
1509.3 596628342 595991821 596740570 595760384 595722351 597616920 597600365 597947960 595055923 591610870
1518 591610870 593785362 594219398 590013771 586500473 589845085 594032326 596531105 595321083 595801620
1526.6 595801620 596035576 594484138 594921951 595337753 595101700 594793930 593707771 593083801 596272202
1535.3 596272202 598035698 598359871 599090729 592132645 584026337 588346672 590328484 592157059 595631485
1544 595631485 596605377 595529213 597926750 598381691 597772713 594920654 593905220 597270126 599062500
1552.7 599062500 599977722 597114029 598234100 600081635 598540993 591410027 576597710 586955223
1560.4 586955223 593652763 597191429 598531113 598457031 595436668 593218727 592416420 589885826 586997223
1569.1 586997223 579836159 581553841 582371521 581336441 580587502 578914948 576684952 563411674
$$ packed form
1509.3E96628342o36521P48749r80186l8033J894569j6555L47595k892037l445053
1518E91610870K174492M34036m205627l513298L344612M187241K498779j210022M80537
1526.6E95801620K33956j551438M37813M15802k36053l07770j086159o23970L188401
1535.3E96272202J763496L24173P30858o958084q106308M320335J981812J828575L474426
1544E95631485R73892j076164K397537M54941o08978k852059j015434L364906J792374
1552.7E99062500R15222k863693J120071J847535j540642p130966j4812317J0357513
1560.4E86955223O697540L538666J339684p4082l020363k217941q02307k530594k888603
1569.1E86997223p161064J717682Q17680j035080p48939j672554k229996j3273278
$$ plain form
1576.8 563411674 563989563 563242607 560341225 558146172 555210075 553541527 549884567 547089043 542709084
1585.5 542709084 538551521 534712677 530576134 528151054 523780899 521699829 518261032 516209755
1593.2 516209755 513199005 508581924 505869904 501415215 498932610 494744415 492854881 490574379
1600.9 490574379 488565025 487392044 483456383 481677132 478072662 476247711 473318100 471798363
1608.6 471798363 470518608 468335342 468899803 466442146 465868912 463537674 463024673 461406937 453035698
1617.3 453035698 456335831 456203156 457198944 456232262 456911507 455552216 451596184 453498344 453253403
1626 453253403 454172440 451497231 452674294 454137192 454752960 455762367 455532379 457267990 456343880
1634.6 456343880 452057152 451254692 454969749 457828140 459579887 461976891 462388802 464487305 464742393
$$ packed form
1576.8E63411674N77889p46956k901382k195053k936097j668548l656960k795524m379959
1585.5E42709084m157563l838844m136543k425080m370155k081070l438797k051277
1593.2E16209755l010750m617081k712020m454689k482605m188195j889534k280502
1600.9D90574379k009354j172981l935661j779251l604470j824951k929611j519737
1608.6D71798363j279755k183266N64461k457657n73234k331238n13001j617736q371239
1617.3D53035698L300133j32675R95788r66682O79245j359291l956032J902160k44941
1626D53253403R19037k675209J177063J462898O15768J009407k29988J735611r24110
1634.6D56343880m286728q02460L715057K858391J751747K397004M11911K098503K55088
$$ plain form
1643.3 464742393 466621666 467446251 464787064 466659126 467080078 472566566 475110130 479100380 483335190
1652 483335190 484785652 477463684 478537178 483638077 485988655 489120369 491367569 493871689 496587563
1660.7 496587563 498866577 499909859 499208794 503384018 505966492 508484535 511016617 513039551
1668.4 513039551 514731560 516855850 520939751 522591934 526441727 529709511 530135231 530942116 535588951
1677.1 535588951 540477028 543367462 546601830 548110542 552546768 556507874 554253883 553385620
1684.8 553385620 557936325 565440865 569776764 572846794 575989571 578431358 582319527 585860519
1692.5 585860519 589378662 592592812 594805260 593031616 599205208 605333939 609995193 609192581
1700.2 609192581 605955887 614981651 620335922 622985077 623668365 624998817 628120918 632559242
$$ packed form
1643.3D64742393J879273Q24585k659187J872062M20952N486488K543564L990250M234810
1652D83335190J450462p321968J073494N100899K350578L131714K247200K504120K715874
1660.7D96587563K279014J043282p01065M175224K582474K518043K532082K022934
1668.4E13039551J692009K124290M083901J652183L849793L267784M25720Q06885M646835
1677.1E35588951M888077K890434L234368J508712M436226L961106k253991q68263
1684.8E53385620M550705P504540M335899L070030L142777K441787L888169L540992
1692.5E85860519L518143L214150K212448j773644O173592O128731M661254q02612
1700.2F09192581l236694R025764N354271K649155O83288J330452L122101M438324
$$ plain form
1707.9 632559242 637162132 638471603 638621483 640811691 642780075 643971176 643330841 644641418 648579865
1716.6 648579865 649737091 644720840 649104156 652840958 654379730 655271072 655419083 656332474 658292618
1725.3 658292618 660200729 661614227 663230743 664883499 662770996 662511597 665853195 667370453
1733 667370453 662423477 659890823 667265396 671989365 674358978 676830063 674608765 673255539 677695923
1741.7 677695923 679668350 679508514 682129135 686755829 689703827 691043854 692803192 694427414
1749.4 694427414 698753128 698740692 699212799 704622116 708059692 711370468 713624725 713226395 715899734
1758.1 715899734 718683929 720823364 723327637 721474762 722116394 726353683 728517685 730333557
1765.8 730333557 732748871 733478470 730716629 733110657 736351089 733733215 730098648 732385330
$$ packed form
1707.9F32559242M602890J309471J49880K190208J968384J191101o40335J310577L938447
1716.6F48579865J157226n016251M383316L736802J538772Q91342J48011R13391J960144
1725.3F58292618J908111J413498J616516J652756k112503k59399L341598J517258
1733F67370453m946976k532654P374573M723969K369613K471085k221298j353226M440384
1741.7F77695923J972427j59836K620621M626694K947998J340027J759338J624222
1749.4F94427414M325714j2436M72107N409317L437576L310776K254257l98330K673339
1758.1G15899734K784195K139435K504273j852875O41632M237289K164002J815872
1765.8G30333557K415314P29599k761841K394028L240432k617874l634567K286682
$$ plain form
1773.5 732385330 738116608 740338211 740266037 743189240 743974533 744465561 743917084 742500305 744314041
1782.2 744314041 746827011 748372269 747647476 748470612 750279846 750821304 751004181 751612320 751100159
1790.9 751100159 750502930 749071808 750581970 755041122 755978241 755472107 756987915 758229294 757193298
1799.5 757193298 755367355 757201385 757770233 759687881 762071075 762696609 763806763 763575974 762883453
1808.2 762883453 763407898 763841629 762432251 762913895 765012436 766626663 767997360 768044968 768257675
1816.9 768257675 767322693 767220306 768152237 768290710 769390411 769870071 771790085 772887268 769253693
1825.6 769253693 769339142 771555328 772683640 770580978 766756439 769605331 773276596 774100571 774510345
1834.3 774510345 775295563 775405579 774328079 773224869 774200745 774504013 775411911 776537247 777867126
$$ packed form
1773.5G32385330N731278K221603p2174K923203P85293M91028n48477j416779J813736
1782.2G44314041K512970J545258p24793Q23136J809234N41458J82877O08139n12161
1790.9G51100159n97229j431122J510162M459152R37119n06134J515808J241379j035996
1799.5G57193298j825943J834030N68848J917648K383194O25534J110154k30789o92521
1808.2G62883453N24445M33731j409378M81644K098541J614227J370697M7608K12707
1816.9G68257675r34982j02387R31931J38473J099701M79660J920014J097183l633575
1825.6G69253693Q5449K216186J128312k102662l824539K848892L671265Q23975M09774
1834.3G74510345P85218J10016j077500j103210R75876L03268R07898J125336J329879
$$ plain form
1842.9 777867126 777034607 771180878 774546661 776782303 775858307 775697250 776656647 778136597 778999634
1851.6 778999634 780187988 780526352 780656128 780192184 779178391 778621826 777971954 778531494 779456558
1860.3 779456558 780944061 781621094 781866455 782014313 781826477 781860275 780452652 780004959 778188095
1869 778188095 777399368 779941788 782296219 783925323 784015961 783856277 782965546 782315140 781846848 781658096
1878.6 781658096 782363968 783162613 784754791 785107346 785212402 784686050 783451004 782898483 782361221
1887.3 782361221 783288269 783018799 782636108 784848862 786447372 786333160 785846939 784664383 783207779
1896 783207779 783971024 783957748 784135208 785375900 786188049 786820602 786652374 786425171 785408783 784547195
1905.6 784547195 784093475 784041901 784964447 785570145 786069412 786861191 787990799 787328339 786270981
$$ packed form
1842.9G77867126q32519n853729L365783K235642r23996j61057R59397J479950Q63037
1851.6G78999634J188354L38364J29776m63944j013793n56565o49872N59540R25064
1860.3G79456558J487503O77033K45361J47858j87836L3798j407623m47693j816864
1869G78188095p88727K542420K354431J629104R0638j59684q90731o50406m68292j88752
1878.6G81658096P05872P98645J592178L52555J05056n26352j235046n52521n37262
1887.3G82361221R27048k69470l82691K212754J598510j14212m86221j182556j456604
1896G83207779P63245j3276J77460J240692Q12149O32553j68228k27203j016388q61588
1905.6G84547195m53720n1574R22546O05698M99267P91779J129608o62460j057358
$$ plain form
1914.3 786270981 785440292 785228577 786080170 784206238 784652863 786701279 787871170 788041992 785627899
1923 785627899 784544144 784909286 784801559 784661789 785833282 787090225 787521667 787981110 788175201
1931.7 788175201 787864685 786498184 785828400 785289917 785131226 785761642 786500854 788038254 788582840
1940.3 788582840 788749847 786879654 784189148 784995041 785106812 784496689 784837265 786188278 787303696
1949 787303696 787805176 787576447 786658707 785743790 784876862 784426956 784209671 784955826 786063309 787081223
1958.7 787081223 787486801 787186050 786915131 785520706 784484634 784005127 784128036 784669724 784660339 785619278
1968.3 785619278 786540833 786888199 786267700 785281601 784410400 783812790 784089279 784660645 785531769 785975037
1978 785975037 786539917 786881866 786478806 785475845 784046555 783330002 783002167 783824844 784866180
$$ packed form
1914.3G86270981q30689k11715Q51593j873932M46625K048416J169891J70822k414093
1923G85627899j083755L65142j07727j39770J171493J256943M31442M59443J94091
1931.7G88175201l10516j366501o69784n38483j58691O30416P39212J537400N44586
1940.3G88582840J67007j870193k690506Q05893J11771o10123L40576J351013J115418
1949G87303696N01480k28729r17740r14917q66928m49906k17285P46155J107483J017914
1958.7G87081223M05578l00751k70919j394425j036072m79507J22909N41688r385R58939
1968.3G85619278R21555L47366o20499r86099q71201n97610K76489N71366Q71124M43268
1978G85975037N64880L41949m03060j002961j429290p16553l27835Q22677J041336
$$ plain form
1986.6 784866180 785313873 785420227 785329819 785748825 784616089 782228012 781594772 782432632 783398056
1995.3 783398056 784355240 785131073 785139847 785160065 784531403 783645325 782531052 781731339 781671219 781890564
2005 781890564 783281555 784393005 784697571 784261932 783561935 782806396 781691360 781112671 780766296
2013.6 780766296 781365509 782494125 783115311 783145065 783250961 782992783 781506119 780402374 779540329
2022.3 779540329 779150467 779597626 780582504 781682434 782215958 782363510 781679001 780682068 779593582
2031 779593582 779155121 778796616 778583984 779628143 780336227 781040726 781181717 780457687 779629211 778604813
2040.6 778604813 777455215 777070541 778125610 778858719 779625626 779982758 779800797 779540024 778305435
2049.3 778305435 777623672 777105865 776906052 777286835 778270493 779479599 779888916 779864578 778707809
$$ packed form
1986.6G84866180M47693J06354r0408M19006j132736k388077o33240Q37860R65424
1995.3G83398056R57184P75833Q774K0218o28662q86078j114273p99713o0120K19345
2005G81890564J390991J111450L04566m35639o99997p55539j115036n78689l46375
2013.6G80766296N99213J128616O21186K9754J05896k58178j486664j103745q62045
2022.3G79540329l89862M47159R84878J099930N33524J47552o84509r96933j088486
2031G79593582m38461l58505k12632J044159P08084P04499J40991p24030q28476j024398
2040.6G78604813j149598l84674J055069P33109P66907L57132j81961k60773j234589
2049.3G78305435o81763n17807j99813L80783R83658J209106M09317k4338j156769
$$ plain form
2058 778707809 777498550 776223297 775514908 775901794 776386642 777705841 778667679 779038010 778875427
2066.7 778875427 778121567 777150879 776072845 775270081 775065384 775760727 776322861 777357941 778240433
2075.4 778240433 778162613 777730865 776845398 776021423 775166092 775042343 775252304 776020966 777165375 777580109
2085 777580109 777874832 777328644 776181793 774834747 773968353 773890305 774477005 775453339 776203079 777180557
2094.6 777180557 777227859 776516724 775187912 773846664 773113632 772937546 774011459 774702301 775492172
2103.3 775492172 776069946 776191940 776103516 774782944 773550339 772537384 772399445 772861023 773656235
2112 773656235 774959259 775857010 776017685 775003357 773880386 772399673 771414261 771634064 772459717
2120.7 772459717 773629684 774239807 774830933 774791870 774379959 773595047 772271194 771349869 771035843
$$ packed form
2058G78707809j209259j275253p08389L86886M84848J319199R61838L70331j62583
2066.7G78875427p53860r70688j078034q02764k04697O95343N62134J035080Q82492
2075.4G78240433p7820m31748q85467q23975q55331j23749K09961P68662J144409M14734
2085G77580109K94723n46188j146851j347046q66394p8048N86700R76334P49740R77478
2094.6G77180557M7302p11135j328812j341248p33032j76086J073913O90842P89871
2103.3G75492172N77774J21994q8424j320572j232605j012955j37939M61578P95212
2112G73656235J303024Q97751J60675j014328j122971j480713r85412K19803Q25653
2120.7G72459717J169967O10123N91126l9063m11911p84912j323853r21325l14026
$$ plain form
2129.4 771035843 771782837 772649078 773697433 774541779 774613495 773924484 772679901 772021179 771531982
2138 771531982 771382904 771836395 772919235 773901138 774358368 774107437 773330460 773077850 772217712 771420212
2147.7 771420212 771149673 771554642 772657013 773820648 774960022 774701767 774199753 773171997 771839142
2156.4 771839142 771396713 771302185 771903610 772509537 773512115 774249954 774506836 774208450 773117599
2165 773117599 772457581 771986465 771924133 772068253 773116608 774209595 774750977 775307846 774947891 774027405
2174.7 774027405 772393036 771678314 771705017 772141113 773410492 774556046 775860062 775728912 774960937
2183.4 774960937 773968658 772727051 772191010 772207870 772986374 773656616 774877853 775502548 775479050 775527725
2193 775527725 774548721 773423996 772520218 772267761 772411652 773621216 775204926 776153183 776718521
$$ packed form
2129.4G71035843P46994Q66241J048355Q44346P1716o89011j244583o58722m89197
2138G71531982j49078M53491J082840R81903M57230k50931p76977k52610q60138p97500
2147.7G71420212k70539M04969J102371J163635J139374k58255n02014j027756j332855
2156.4G71839142m42429r4528O01425O05927J002578P37839K56882k98386j090851
2165G73117599o60018m71116o2332J44120J048355J092987N41382N56869l59955r20486
2174.7G74027405j634369p14722K6703M36096J269379J145554J304016j31150p67975
2183.4G74960937r92279j241607n36041J6860P78504O70242J221237O24695k3498M8675
2193G75527725r79004j124725r03778k52457J43891J209564J583710R48257N65338
$$ plain form
2201.7 776718521 776015625 775106888 774083862 773313675 772808609 773075562 774483109 775568466 776492004
2210.4 776492004 776827927 776705933 775563812 774354248 773720322 773035965 773381348 774279251 775914917
2219 775914917 776897049 777047501 776635056 775240784 774172134 772902527 772577820 773318558 774435806
2227.7 774435806 775616302 776467590 777087708 776818695 776057358 774556732 773403931 772854767 773043060
2236.4 773043060 774372482 775722656 776921310 777277603 777111740 775811310 774168167 773275452 772755737
2245.1 772755737 773221283 774036713 775753250 777300491 777608871 776829147 775342941 774205399 773180161
2253.8 773180161 773009949 773409195 774518738 775927887 777086334 777502975 776446991 775668182 774547043
2262.4 774547043 773321762 772779999 772975769 774069061 775585251 777150269 777475662 777012711 775616379
$$ packed form
2201.7G76718521p02896r08737j023026p70187n05066K66953J407547J085357R23538
2210.4G76492004L35923j21994j142121j209564o33926o84357L45383Q97903J635666
2219G75914917R82132J50452m12445j394272j068650j269607l24707P40738J117248
2227.7G74435806J180496Q51288O20118k69013p61337j500626j152801n49164J88293
2236.4G73043060J329422J350174J198654L56293j65863j300430j643143q92715n19715
2245.1G72755737M65546Q15430J716537J547241L08380p79724j486206j137542j025238
2253.8G73180161j70212L99246J109543J409149J158447M16641j055984p78809j121139
2262.4G74547043j225281n41763J95770J093292J516190J565018L25393m62951j396332
$$ plain form
2271.1 775616379 774320145 773503876 772695999 772953873 773635559 775149765 776253281 776790390 776858902
2279.8 776858902 775639343 774215851 772735062 772519455 772944794 773989410 775518188 776361847 776955109
2288.5 776955109 776580429 775678787 774204483 773014069 772378540 772482452 774052658 775550308 776754913
2297.2 776754913 777397232 777587051 776957474 775299377 773836136 773093185 773358688 774280167 776427536
2305.8 776427536 778068085 778651810 778351669 776591034 775575333 774890594 774540634 774620895 775363159
2314.5 775363159 777050171 778337021 779801865 781079712 780588455 778819046 777134171 776175919 776467361
2323.2 776467361 777309265 778988571 781557159 783051300 783542786 781687241 779704285 778897400 777097549
2331.9 777097549 776418381 777029190 778291855 779619980 781326141 782070694 781506958 780662842 779156265
$$ packed form
2271.1G75616379j296234q16269q07877K57874O81686J514206J103516N37109O8512
2279.8G76858902j219559j423492j480789k15607M25339J044616J528778Q43659N93262
2288.5G76955109l74680r01642j474304j190414o35529J03912J570206J497650J204605
2297.2G76754913O42319J89819o29577j658097j463241p42951K65503R21479K147369
2305.8G76427536J640549N83725l00141j760635j015701o84739l49960Q0261P42264
2314.5G75363159J687012J286850J464844J277847m91257j769409j684875r58252K91442
2323.2G76467361Q41904J679306K568588J494141M91486j855545j982956q06885j799851
2331.9G77097549o79168O10809J262665J328125J706161P44553n63736q44116j506577
$$ plain form
2340.6 779156265 778593369 779088516 779556503 779339218 779546738 779978561 779119720 777083282 775904465
2349.2 775904465 776191330 776376877 777811737 779586029 780927734 782673645 783339005 784765396 783588257
2357.9 783588257 781610413 779608383 778156738 779127502 780105591 781138382 780594254 781841202 782976837
2366.6 782976837 781576920 778445358 775650101 774700775 773728943 773974075 773558044 773582916 774479675
2375.3 774479675 774607849 773798523 771471710 769571075 767479248 766198578 766844025 768109741 769077148
2383.9 769077148 769136810 769043121 768156357 766817551 765274506 763955688 763700638 763996658 765206604
2392.6 765206604 766555786 767690735 767775497 766687622 765142059 763581238 762977676 762358704 762424011
2401.3 762424011 763625259 765032578 765729446 765483017 764925537 763548584 762250443 761301498 760881577
$$ packed form
2340.6G79156265n62896M95147M67987k17285K07520M31823q58841k036438j178817
2349.2G75904465K86865J85547J434860J774292J341705J745911O65360J426391j177139
2357.9G83588257j977844k002030j451645R70764R78089J032791n44128J246948J135635
2366.6G82976837j399917l131562k795257r49326r71832K45132m16031K4872Q96759
2375.3G74479675J28174q09326k326813j900635k091827j280670O45447J265716R67407
2383.9G69077148N9662r3689q86764j338806j543045j318818k55050K96020J209946
2392.6G65206604J349182J134949Q4762j087875j545563j560821o03562o18972O5307
2401.3G62424011J201248J407319O96868k46429n57480j376953j298141r48945m19921
$$ plain form
2410 760881577 761268311 762180862 763487091 764409256 764819870 764120483 762700882 760912170 759416580
2418.7 759416580 759033813 759683685 761065140 761958389 762773666 762727280 761587219 760272064 758867264
2427.3 758867264 758037262 757526093 757933044 758943100 760057907 760809631 760686264 760093079 758761520
2436 758761520 757385635 756069031 755447693 755526886 756129227 757566376 758548508 758947525 758249207 756729050
2445.7 756729050 755269165 754221268 753538666 753140182 753966904 755394211 756619263 756965561 756558609
2454.3 756558609 755374603 753339996 751785889 751194458 751761551 752445145 753161240 754094162 754470444
2463 754470444 754104385 752701416 751047134 749680634 749206848 749449158 750004807 750886841 751757584
2471.7 751757584 752327271 751622238 750373764 749022217 747666168 746720810 746353378 747085266 748329773
$$ packed form
2410G60881577L86734R12551J306229R22165M10614o99387j419601j788712j495590
2418.7G59416580l82767O49872J381455Q93249Q15277m6386j140061j315155j404800
2427.3G58867264q30002n11169M06951J010056J114807P51724j23367n93185j331559
2436G58761520j375885j316604o21338P9193O02341J437149R82132L99017o98318j520157
2445.7G56729050j459885j047897o82602l98484Q26722J427307J225052L46298m06952
2454.3G56558609j184006k034607j554107n91431N67093O83594P16095R32922L76282
2463G54470444l66059j402969j654282j366500m73786K42310N55649Q82034Q70743
2471.7G51757584N69687p05033j248474j351547j356049r45358l67432P31888J244507
$$ plain form
2480.4 748329773 749475403 749915848 749778519 748480530 746414642 744954681 744017258 744029236 744367447
2489.1 744367447 745263596 746261215 746564407 746331024 744990311 743461380 742003479 741275940 741429520
2497.7 741429520 741896210 742617950 743272552 743910522 743483734 742356644 741137390 739814148 738531418
2506.4 738531418 737929993 738546295 739241104 740170059 740586700 740087204 739282684 737974777 736926651
2515.1 736926651 736280594 735946426 736005783 736739197 737660065 738157196 738027496 737201385 736031647 734225235
2524.7 734225235 732895813 732535706 732944260 734042206 734871902 735289078 735252304 734718018 733497238
2533.4 733497238 732135239 731095047 730588913 730863876 731820908 732976837 733114090 732801361 731869736
2542.1 731869736 730443192 729397583 728413162 728005753 728183441 729069519 729788971 730069427 730231247
$$ packed form
2480.4G48329773J145630M40445j37329j297989k065888j459961r37423J1978L38211
2489.1G44367447Q96149R97619L03192k33383j340713j528931j457901p27539J53580
2497.7G41429520M66690P21740O54602O37970m26788j127090j219254j323242j282730
2506.4G38531418o01425O16302O94809R28955M16641m99496q04520j307907j048126
2515.1G36926651o46057l34168N9357P33414R20868M97131j29700q26111j169738j806412
2524.7G34225235j329422l60107M08554J097946Q29696M17176l6774n34286j220780
2533.4G33497238j361999j040192n06134K74963R57032J155929J37253l12729r31625
2542.1G31869736j426544j045609r84421m07409J77688Q86078P19452K80456J61820
$$ plain form
2550.8 730231247 729602661 728623123 727465820 726400375 725443726 725414124 726313400 727104034 727590714
2559.5 727590714 727514420 727222900 726030884 724744492 724063187 723557587 723565445 723935623 724809952 725318527
2569.1 725318527 725247192 724437332 723445053 722574463 721173859 720632401 720825653 721436310 721986923 722327576
2578.7 722327576 722500839 721652908 720609207 719512787 718651581 717985992 718033676 719150772 719868088
2587.4 719868088 720013351 719804001 719480286 718375244 716987000 716223221 715713043 715680389 715904388
2596.1 715904388 716707382 717628403 717717361 716902466 715431213 713939590 713155975 712926102 712666016
2604.8 712666016 713056717 713810196 714525452 714739380 713995819 712748260 711340408 710533600 709822617
2613.5 709822617 709434586 709714890 710339737 710872803 710898437 710794144 709528198 708226395 707681503
$$ packed form
2550.8G30231247o28586r79538j157303j065445r56649k9602Q99276P90634M86680
2559.5G27590714p6294k91520j192016j286392o81305n05600P858L70178Q74329N08575
2569.1G25318527p1335q09860r92279q70590j400604n41458J93252O10657N50613L40653
2578.7G22327576J73263q47931j043701j096420q61206o65589M7684J117096P17316
2587.4G19868088J45263k09350l23715j105042j388244p63779n10178l2654K23999
2596.1G15904388Q02994R21021Q8958q14895j471253j491623p83615k29873k60086
2604.8G12666016L90701P53479P15256K13928p43561j247559j407852q06808p10983
2613.5G09822617l88031K80304O24847N33066K5634j04293j265946j301803n44892
$$ plain form
2622.1 707681503 706958771 706615677 706945419 707686234 707813187 707469482 706657257 705648575 704795303
2630.8 704795303 703847046 703146973 702755051 703364334 703754501 704017868 704160309 703122025 702553253
2639.5 702553253 702062454 701235962 700097122 699433746 699910736 700435410 700924911 700817108 700358734
2648.2 700358734 699352951 697895203 696919556 696641769 697030334 697236023 697404480 697273102 697027664
2656.9 697027664 697007446 696669388 695865631 694466248 693099442 692465973 693177719 694203415 694842834
2665.5 694842834 695065536 694261322 693170776 692297058 691963577 691366653 691059265 691692200 691814194
2674.2 691814194 692168274 692268372 691307907 690314026 689431915 688805542 688468704 688088837 688201599 688802338
2683.9 688802338 688967972 689102402 689029236 688439941 687534714 686413345 685687180 685161667 685329742 686030045
$$ packed form
2622.1G07681503p22732l43094L29742P40815J26953l43705q12225j008682q53272
2630.8G04795303r48257p00073l91922O09283L90167K63367J42441j038284n68772
2639.5G02553253m90799q26492j138840o63376M76990N24674M89501j07803m58374
2648.2G00358734j005783j457748r75647k77787L88565K05689J68457j31378k45438
2656.9F97027664k0218l38058q03757j399383j366806o33469P11746J025696O39419
2665.5F94842834K22702q04214j090546q73718l33481n96924l07388O32935J21994
2674.2F91814194L54080J00098r60465r93881q82111o26373l36838l79867J12762O00739
2683.9F88802338J65634J34430p3166n89295r05227j121369p26165n25513J68075P00303
$$ plain form
2693.5 686030045 686364975 686362000 685928040 685417404 684829559 684024277 683301544 682913589 682913589 683356094 683863449
2704.1 683863449 683966980 683573837 682660446 681713104 680734940 680280228 680410156 680571671 681091919 681470261
2713.8 681470261 681712723 681566162 680539856 679433212 678673630 677950058 677845612 678592987 679024963
2722.4 679024963 679268036 679135132 678619308 677990952 676962509 676182861 675655594 675805206 676119919
2731.1 676119919 676447144 677244110 677136002 676527557 676077728 675606766 675131073 674498062 674145355 674393234
2740.8 674393234 674614410 674873657 675254135 674666748 673898849 673265991 672594223 672227707 671932602 672388153
2750.4 672388153 673083572 673379898 673016052 672492905 672244415 671666641 671140137 670661316 670789261 671068115
2760 671068115 671123810 671458588 671305389 671002274 670679779 669963455 668902969 668154984 667874069 668083115
$$ packed form
2693.5F86030045L34930k975m33960n10636n87845q05282p22733l87955%M42505N07355
2704.1F83863449J03531l93143r13391r47342r78164m54712J29928J61515N20248L78342
2713.8F81470261K42462j46561j026306j106644p59582p23572j04446P47375M31976
2722.4F79024963K43073j32904n15824o28356j028443p79648n27267J49612L14713
2731.1F76119919L27225P96966j08108o08445m49829m70962m75693o33011l52707K47879
2740.8F74393234K21176K59247L80478n87387p67899o32858o71768l66516k95105M55551
2750.4F72388153O95419K96326l63846n23147k48490n77774n26504m78821J27945K78854
2760F71068115N5695L34778j53199l03115l22495p16324j060486p47985k80915K09046
$$ plain form
2769.7 668083115 668766861 669052277 669168930 668853607 668404617 667638168 666483994 666303177 666373138 666156387
2779.3 666156387 665925369 666339493 666558151 665908585 665247955 664085999 663278656 662951431 662765961
2788 662765961 663081284 663509598 663827591 663457870 662781906 661992111 661103821 660424118 659858322 659579010
2797.7 659579010 659550476 659597702 659483261 659169693 658524704 657776260 657041550 656071320 655157852 654702148
2807.3 654702148 654793396 655093842 655270691 654742050 653864975 652770615 651403885 650646286 650008469
2816 650008469 649685669 649881668 649935074 649765472 649013748 648047104 647328415 646241989 644851379 644205246
2825.6 644205246 643804169 643290253 643067169 643069229 643117294 642293777 640670471 638939629 637922592 637224579
2835.3 637224579 636456490 636171913 635549088 635139542 634267082 632298088 630379906 628519821 626884232
$$ packed form
2769.7F68083115O83746K85416J16653l15323m48990p66449j154174j80817O9961k16751
2779.3F66156387k31018M14124K18658o49566o60630j161956q07343l27225j85470
2788F62765961L15323M28314L17993l69721o75964p89795q88290o79703n65796k79312
2797.7F59579010k8534M7226j14441l13568o44989p48444p34710r70230r13468m55704
2807.3F54702148R1248L00446J76849n28641q77075j094360j366730p57599o37817
2816F50008469l22800J95999N3406j69602p51724r66644p18689j086426j390610o46133
2825.6F44205246m01077n13916k23084K060M8065q23517j623306j730842j017037o98013
2835.3F37224579p68089k84577o22825m09546q72460j968994j918182j860085j635589
$$ plain form
2843.9 626884232 624756622 622917938 622137451 621458397 619987259 617517166 615584030 613867607 612086220
2852.6 612086220 610880890 610277328 610558662 611187935 611995697 612604218 612646103 612128906 611206093 610606194
2862.3 610606194 610331650 610059891 610048294 610055428 609504089 608871117 608294067 607745781 607286224 606627045
2871.9 606627045 605867424 605310287 605270500 605280762 605365372 605368958 605101280 604818649 603676262 602364502
2881.6 602364502 601757774 601220284 600774307 600967674 601118126 600372429 599200249 598145294 597464714
2890.2 597464714 596281204 595015640 594396820 593787689 593556137 593102760 592401543 591749191 590927086
2898.9 590927086 589974785 588598976 587653656 587242432 586896935 586470184 586156845 586027565 585744743
2907.6 585744743 585179672 583400078 581391983 580251732 579289474 578385963 577384109 576418571 575560455
$$ packed form
2843.9F26884232k127610j838684p80487o79054j471138k470093j933136j716423j781387
2852.6F12086220j205330o03562K81334O29273Q07762O08521M1885n17197r22813n99899
2862.3F10606194k74544k71759j1597P134n51339o32972n77050n48286m59557o59179
2871.9F06627045p59621n57137l9787J0262Q4610L586k67678k82631j142387j311760
2881.6F02364502o06728n37490m45977J93367J50452p45697j172180j054955o80580
2890.2E97464714j183510j265564o18820o09131k31552m53377p01217o52352q22105
2898.9E90927086r52301j375809r45320m11224l45497m26751l13339j29280k82822
2907.6E85744743n65071j779594k008095j140251r62258r03511j001854r65538q58116
$$ plain form
2916.3 575560455 574456062 572812691 570870132 568936958 567442780 566789970 566500626 566640320 566940117
2925 566940117 567010422 567007446 566670113 566287994 566259232 566145554 566228752 566931953 567288818 567690125 568522377
2935.6 568522377 569284210 570024071 570245323 570440979 571106720 572272606 573606682 574611130 575414200
2944.2 575414200 575744324 576201401 576702194 576512184 576300774 576911392 577903061 578280830 578717728 579621925
2953.9 579621925 580259018 580190964 579917870 580015984 579811630 579577370 580008011 580920906 582449875 583710937
2963.5 583710937 584131126 584953117 585670700 585713196 585661964 585464706 586228409 587647514 588751106 589933891
2973.2 589933891 591064720 592028847 592459755 592430649 592092094 591933441 592409286 592866020 593454437 594115028
2982.8 594115028 594781189 595459557 595427475 595098343 594764748 594221077 594318504 594962425 595799217 596809845
$$ packed form
2916.3E75560455j104393j643371j942559j933174j494178o52810k89344J39694K99797
2925E66940117P0305k976l37333l82119k8762j13678Q3198P03201L56865M01307Q32252
2935.6E68522377P61833P39861K21252J95656O65741J165886J334076J004448Q03070
2944.2E75414200L30124M57077N00793j90010k11410O10618R91669L77769M36898R04197
2953.9E79621925O37093o8054k73094R8114k04354k34260M30641R12895J528969J261062
2963.5E83710937M20189Q21991P17583M2496n1232j97258P63703J419105J103592J182785
2973.2E89933891J130829R64127M30908k9106l38555j58653M75845M56734N88417O60591
2982.8E94115028O66161O78368l2082l29132l33595n43671R7427O43921Q36792J010628
$$ plain form
2992.5 596809845 596932907 596765709 596856155 596414032 595462570 594434738 594096565 594207497 594441605 594839325
3002.1 594839325 594819794 594008980 592909813 592057228 591209869 590868568 590846329 590705910 590682793 590791779
3011.7 590791779 590919266 590535583 590194511 589436913 588013420 587073250 586604462 586528473 586594849 586740723
3021.4 586740723 586842575 586811333 586117325 584632072 583568802 582805595 582145958 581495247 581137085
3030.1 581137085 581313438 581322746 581357307 581019745 579803734 578378639 577387276 576478691 575843544 575881844
3039.7 575881844 575934029 576106300 575993652 575155563 573981056 572714729 571823273 571170540 570667343
3048.4 570667343 570768890 570955162 570519257 569785881 568794365 567941360 567214851 565881500 564786758
3057.1 564786758 564287148 564134827 564143906 563932571 563657417 563328056 562369766 560978813 560512238 560157471
$$ packed form
2992.5E96809845J23062j67198R0446m42123r51462j027832l38173J10932K34108L97720
3002.1E94839325j9531q10814j099167q52585q47359l41301k2239j40419k3117J08986
3011.7E90791779J27487l83683l41072p57598j423493r40170m68788p5989O6376J45874
3021.4E86740723J01852l1242o94008j485253j063270p63207o59637o50711l58162
3030.1E81137085J76353R308L4561l37562j216011j425095r91363r08585o35147L8300
3039.7E75881844N2185J72271j12648q38089j174507j266327q91456o52733n03197
3048.4E70667343J01547J86272m35905p33376r91516q53005p26509j333351j094742
3057.1E64786758m99610j52321R079k11335k75154l29361r58290j390953m66575l54767
$$ plain form
3066.7 560157471 559412117 559183006 559101982 558795509 558482018 558317146 557419090 555885239 554608078
3075.4 554608078 554076576 554142075 554144783 554211311 553824425 553553963 553407440 552442245 551135712 549917603
3085 549917603 549418144 548996544 548556557 548471718 548528671 548548050 547865715 546782913 545424728 544579086
3094.7 544579086 544166183 543479309 543120346 543223839 543732185 543620300 542740822 541538162 540426979
3103.4 540426979 539317017 538108826 537999535 538105659 538135567 538149948 537483597 536670952 535753479 534672470
3113 534672470 533545456 532816849 532175980 531841049 531866341 531626396 531642570 531286201 530293198 528718338
3122.6 528718338 527422562 526955528 526135292 525720558 525920792 525709076 524889297 523893051 523128662
3131.3 523128662 522214355 521169662 520168266 519421768 519275970 519208183 518987083 519105568 518581657
$$ packed form
3066.7E60157471p45354k29111q1024l06473l13491j64872q98056j533851j277161
3075.4E54608078n31502O5499K708O6528l86886k70462j46523r65195j306533j218109
3085E49917603m99459m21600m39987q4839N6953J9379o82335j082802j358185q45642
3094.7E44579086m12903o86874l58963J03493N08346j11885q79478j202660j111183
3103.4E40426979j109962j208191j09291J06124K9908J4381o66351q12645r17473j081009
3113E34672470j127014p28607o40869l34931K5292k39945J6174l56369r93003j574860
3122.6E28718338j295776m67034q20236m14734K00234k11716q19779r96246p64389
3131.3E23128662r14307j044693j001396p46498j45798o7787k21100J18485n23911
$$ plain form
3140 518581657 517151909 515849152 514686813 514130974 513736877 512814217 512243309 512350197 512290268 511648026
3149.6 511648026 510763092 509608040 508263702 507017975 506485901 506073799 505328979 505194130 505022469
3158.3 505022469 504170609 502838669 501890869 501112709 500037956 499586449 499269600 498986397 498747787
3167 498747787 498354111 497507896 496259727 495353584 494177971 493077164 492483864 492168579 491488991
3175.7 491488991 490913239 491064110 490424309 489713516 488836632 487351227 486340942 485482368 484765358
3184.4 484765358 484425163 484593925 484243355 483222046 482281990 481461449 480782623 479635048 478769379
3193 478769379 478281784 477762070 477683945 477382622 476620598 475777397 474886780 473945465 472974358 471799240
3202.7 471799240 471227379 471552353 471785393 471595497 470892639 469777222 468317032 467343788 466748886
$$ packed form
3140E18581657j429748j302757j162339n55839l94097r22660n70908J06888n9929o42242
3149.6E11648026q84934j155052j344338j245727n32074m12102p44820j34849j71661
3158.3E05022469q51860j331940r47800p78160j074753m51507l16849k83203k38610
3167D98747787l93676q46215j248169r06143j175613j100807n93300l15285o79588
3175.7D91488991n75752J50871o39801p10793q76884j485405j010285q58574p17010
3184.4D84765358l40195J68762l50570j021309r40056q20541o78826j147575q65669
3193D78769379m87595n19714p8125l01323p62024q43201q90617r41315r71107j175118
3202.7D71799240n71861L24974K33040j89896p02858j115417j460190r73244n94902
$$ plain form
3211.4 466748886 466122856 465997772 465381355 464928970 465113983 464525185 463533592 462527885 461106148
3220 461106148 460271416 460306015 459753036 459099503 459013710 458737869 458057861 457238655 456475792 455621490
3229.7 455621490 454870644 454260864 453996239 453497086 453015022 453309250 452730942 451699905 450655937
3238.4 450655937 449343643 448731308 448240471 447795486 447711029 447766495 447424393 446913567 446577263 445473938
3248 445473938 444192543 443478889 443049927 442718849 442492714 442369194 442042465 441684151 441222191 440457306
3257.7 440457306 439480858 438222389 437499313 437627373 437850189 438128891 437669945 436671677 436426239
3266.3 436426239 436069908 434919968 433480263 432895050 433199387 433662949 433769073 432813339 432263870
3275 432263870 432041206 431463394 430992851 430098000 429450150 429035530 428787842 428944855 428856239 428592567
$$ packed form
3211.4D66748886o26030j25084o16417m52385J85013n88798r91593j005707j421737
3220D61106148q34732L4599n52979o53533q5793k75841o80008q19206p62863q54302
3229.7D55621490p50846o09780k64625m99153m82064K94228n78308j031037j043968
3238.4D50655937j312294o12335m90837m44985q4457N5466l42102n10826l36304j103325
3248D45473938j281395p13654m28962l31078k26135j23520l26729l58314m61960p64885
3257.7D40457306r76448j258469p23076J28060K22816K78702m58946r98268k45438
3266.3D36426239l56331j149940j439705n85213L04337M63562J06124r55734n49469
3275D32263870k22664n77812m70543q94851o47850m14620k47688J57013q8616k63672
$$ plain form
3284.7 428592567 428474236 428346939 427711868 426884689 425928612 425245781 425557671 425887299 425724220 425463829
3294.3 425463829 424972305 424369698 423764725 422515793 421471176 421278839 421419830 421889877 421863060
3303 421863060 421368637 420889587 420320015 419510384 418800697 418245277 417333717 417305832 417641411 417461929
3312.6 417461929 417296066 416900139 416121864 414868050 414003296 413222656 412701607 412801857 412553864
3321.3 412553864 412682419 412668724 411734505 410525322 409684753 408880844 407631683 406460419 405485535
3330 405485535 405414734 405702667 405686111 405088005 403639069 402796097 401808510 400574799 400262489 399742813
3339.6 399742813 399071503 398915291 398453598 397530632 396632423 395631523 394656448 393440399 392599220
3348.3 392599220 392950211 393416367 393094292 391886444 390878448 390245514 389553413 389077377 388288994
$$ packed form
3284.7D28592567j18331j27297o35071q27179r56077o82831L11890L29628j63079k60391
3294.3D25463829m91524o02607o04973j248932j044617j92337J40991M70047k6817
3303D21863060m94423m79050n69572q09631p09687n55420r11560k7885L35579j79482
3312.6D17461929j65863l95927p78275j253814q64754p80640n21049J00250k47993
3321.3D12553864J28555j3695r34219j209183q40569q03909j249161j171264r74884
3330D05485535p0801K87933j6556n98106j448936q42972r87587j233711l12310n19676
3339.6C99742813o71310j56212m61693r22966q98209j000900r75075j216049q41179
3348.3C92599220L50991M66156l22075j207848j007996o32934o92101m76036p88383
$$ plain form
3357 388288994 387430725 386846199 386822853 387102013 386533241 385834045 385490532 384847221 384290352 383384972
3366.6 383384972 382012138 381292953 380810432 380641327 380569267 380044518 379785767 379057274 378146362 377820282
3376.3 377820282 377273140 376661949 376370811 375985107 375577660 375288734 374762077 374716454 374362602 373172569
3385.9 373172569 372774582 372524147 372306557 372584991 372769661 372606430 371687965 370726318 370342636 369758720
3395.6 369758720 369155655 368976784 368698463 368730812 369036942 369014320 368907814 368494987 368124886 367857780
3405.2 367857780 367497101 367493324 367650719 367657089 367671089 367494431 366722450 366127815 366234131 366558838
3414.8 366558838 366424141 366148071 366326714 366578026 366566849 365967484 365929909 366287422 366310196 366212845
3424.5 366212845 365722466 366122208 366725349 366942863 367448730 367756653 367692719 367262115 367431335 367574539
$$ packed form
3357C88288994q58269n84526k3346K79160n68772o99196l43513o43311n56869r05380
3366.6C83384972j372834p19185m82521j69105p2060n24749k58751p28493r10912l26080
3376.3C77820282n47142o11191k91138l85704m07447k88926n26657m5623l53852j190033
3385.9C73172569l97987k50435k17590K78434J84670j63231r18465r61647l83682n83916
3395.6C69758720o03065j78871k78321L2349L06130k2622j06506m12827l70101k67106
3405.2C67857780l60679l777J57395O370J4000j76658p71981n94635J06316L24707
3414.8C66558838j34697k76070J78643K51312j1177n99365l7575L57513K2774r7351
3424.5C66212845m90379L99742O03141K17514N05867L07923o3934m30604J69220J43204
$$ plain form
3434.1 367574539 367870102 368525276 368370323 368326378 368535309 369011078 369831200 370324097 370005379 369629631
3443.8 369629631 369612617 370181427 371629066 371576080 371294823 372236633 373169823 373549919 373252106 373829422
3453.4 373829422 374679985 375254555 376213875 377051125 377333260 377713623 378686943 379144020 379494705 379485435
3463.1 379485435 379452095 379946136 380694923 382166176 383041954 383808441 384069061 384014816 385026817 385488548
3472.7 385488548 385463676 385695763 386561432 387785568 388964348 389830589 390427666 391045761 391311989
3481.4 391311989 391721840 392191162 393395615 394083862 394064178 395228233 395797310 396236763 397503166
3490.1 397503166 398685493 399482422 400171318 400787544 401060295 401548729 402250900 404105988 405803986
3498.7 405803986 406120453 406362343 406948280 407712669 407930832 408772278 410113335 411022682 412091484
$$ packed form
3434.1C67574539K95563O55174j54953m3945K08931M75769Q20122M92897l18718l75748
3443.8C69629631j7014N68810J447639n2986k81257R41810R33190L80096k97813N77316
3453.4C73829422Q50563N74570R59320Q37250K82135L80363R73320M57077L50685r270
3463.1C79485435l3340M94041P48787J471253Q75778P66487K60620n4245J012001M61731
3472.7C85488548k4872K32087Q65669J224136J178780Q66241N97077O18095K66228
3481.4C91311989M09851M69322J204453O88247j9684J164055N69077M39453J266403
3490.1C97503166J182327P96929O88896O16226K72751M88434P02171J855088J697998
3498.7D05803986L16467K41890N85937P64389K18163Q41446J341057R09347J068802
$$ plain form
3507.4 412091484 413605614 414533958 414369888 414919739 415615730 416672783 417804108 418849258 420329323
3516.1 420329323 421208534 421852608 422063599 423105240 424842873 425912819 426018867 425459595 426907082
3524.8 426907082 428651466 429735336 430245323 430691948 432061272 433068695 433997269 435138092 436511765
3533.5 436511765 437698479 439577179 440939789 441197395 442724304 443487434 444227638 445392380 446554337
3542.1 446554337 448234291 449816818 450646591 451136436 452603951 452695656 454126129 456031876 457375641
3550.8 457375641 459240303 459262123 461179886 462702866 463878975 465961723 467116089 468590393 469081306
3559.5 469081306 469964676 470728912 473055267 474950714 475292854 478701782 478293419 478580704 479734764
3568.2 479734764 480270462 483938560 485295830 487126732 489286385 491295547 492911263 494559021
$$ packed form
3507.4D12091484J514130R28344j64070N49851O95991J057053J131325J045150J480065
3516.1D20329323Q79211O44074K10991J041641J737633J069946J06048n59272J447487
3524.8D26907082J744384J083870N09987M46625J369324J007423R28574J140823J373673
3533.5D36511765J186714J878700J362610K57606J526909P63130P40204J164742J161957
3542.1D46554337J679954J582527Q29773M89845J467515R1705J430473J905747J343765
3550.8D57375641J864662K1820J917763J522980J176109K082748J154366J474304M90913
3559.5D69081306Q83370P64236K326355J895447L42140L408928m08363K87285J154060
3568.2D79734764N35698L668098J357270J830902K159653K009162J615716J647758
$$ plain form
3575.9 494559021 496938591 497470818 499577484 501003838 501847191 503910217 505847664 507628365 508835678
3584.6 508835678 512997360 513927765 511162033 513565254 514595528 517732239 521254272 524396133
3592.3 524396133 525648575 526520653 529447517 528912277 530967293 534179878 536132317 538968277 539261017
3601 539261017 540551605 543491096 545882912 548584251 552146225 554168968 552500801 555458107 555520439
3609.6 555520439 556009750 562979240 563676872 562976303 567506027 567562790 571927376 576129608 575567970
3618.3 575567970 577253418 577421341 578928566 583016205 587078667 590168724 592792740 594881821
3626 594881821 597286186 602392006 599810143 592329369 598531609 604988823 610723381 611703682 610661087
3634.7 610661087 613782310 617617035 620155983 620600395 622339211 625224724 627650833 629175720
$$ packed form
3575.9D94559021K379570N32227K106666J426354Q43353K063026J937447J780701J207313
3584.6E08835678M161682R30405k765732K403221J030274L136711L522033L141861
3592.3E24396133J252442Q72078K926864n35240K055016L212585J952439K835960K92740
3601E39261017J290588K939491K391816K701339L561974K022743j668167K957306O2332
3609.6E55520439M89311O969490O97632p00569M529724N6763M364586M202232n61638
3618.3E75567970J685448J67923J507225M087639M062462L090057K624016K089081
3626E94881821K404365N105820k581863p480774O202240O457214N734558R80301j042595
3634.7F10661087L121223L834725K538948M44412J738816K885513K426109J524887
$$ plain form
3642.4 629175720 630878105 633897247 637967033 643175430 640507355 637682076 643263626 642957306
3650.1 642957306 641585159 643632660 650130386 654865723 658924942 662292404 653787079 657145920
3657.9 657145920 663332062 665344543 667596588 668860245 671128311 672498703 674348450 676366348
3665.6 676366348 677194748 681170578 682706604 680934677 680299072 676056290 681043701 689465179 696169205
3674.3 696169205 689455109 671272964 679328842 688978882 693546753 692152557 693771591 697082443
3682 697082443 699048157 700403366 700585556 701267853 705462875 710892029 701677322 698486633 705129166
3690.6 705129166 700317764 702532501 707959824 708439560 709916611 709760895 709291534 711069641 712571335
3699.3 712571335 715249100 716300888 710020523 709918060 715445786 716267014 716755295 718553772 720763168
$$ packed form
3642.4F29175720J702385L019142M069786N208397k668075k825279N581550l06320
3650.1F42957306j372147K047501O497726M735337M059219L367462q505325L358841
3657.9F57145920O186142K012481K252045J263657K268066J370392J849747K017898
3665.6F76366348Q28400L975830J536026j771927o35605m242782M987411Q421478O704026
3674.3F96169205o714096j8182145Q055878R650040M567871j394196J619034L310852
3682F97082443J965714J355209J82190O82297M195022N429154r214707l190689O642533
3690.6G05129166m811402K214737N427323M79736J477051j55716m69361J778107J501694
3699.3G12571335K677765J051788o280365j02463N527726Q21228M88281J798477K209396
$$ plain form
3708 720763168 723119431 715025101 718441925 721775436 709429626 714891739 719351501 720012283 721217957
3716.7 721217957 723681717 724797058 721500168 723862152 729456253 724184952 720312271 726190262
3724.4 726190262 727192764 725599289 722551422 723763962 728098450 728699417 733112106 729732895
3732.1 729732895 723072205 730323181 727371292 718558502 720632858 724438400 726424866 729763184
3739.8 729763184 732801971 729014206 732086182 742056046 726274490 711283264 724648819 731971359
3747.5 731971359 736032791 731081009 721973495 732688599 726761017 720797501 728404236 733810730
3755.3 733810730 735830307 729797134 733126907 738903198 731237869 730231247 733930511 734658661
3763 734658661 734850922 738002701 735000229 731363144 735514832 739739609 737846298 728581161 732113647
$$ packed form
3708G20763168K356263q094330L416824L333511j2345810N462113M459762O60782J205674
3716.7G21217957K463760J115341l296890K361984N594101n271301l872681N877991
3724.4G26190262J002502j593475l047867J212540M334488O00967M412689l379211
3732.1G29732895o660690P250976k951889q812790K074356L805542J986466L338318
3739.8G29763184L038787l787765L071976R969864j5781556j4991226J3365555P322540
3747.5G31971359M061432m951782r107514J0715104n927582n963516P606735N406494
3755.3G33810730K019577o033173L329773N776291p665329j006622L699264P28150
3763G34658661J92261L151779l002472l637085M151688M224777j893311r265137L532486
$$ plain form
3771.7 732113647 736106720 736188812 736576920 736215591 737770538 738783875 741656494 740940170 733043900
3780.3 733043900 735912399 737907486 738340988 739235153 735328751 734878769 737239914 738233719 738515778
3789 738515778 739089127 739714355 739312515 739207001 738987350 740388031 742626953 738105469 735389404
3797.7 735389404 738349991 742148209 746998367 738854828 729373779 734303360 737449417 741865463
3805.4 741865463 745409698 734620895 732604370 738610535 741308517 741273804 740608215 740151520 741781464
3814.1 741781464 746170273 740961838 729713593 737866135 743818283 746333008 745629959 727899551
3821.8 727899551 732089157 739224548 741425247 743546219 742558823 738437653 739376373 741639633 744845505
3830.5 744845505 745102310 736622314 740307236 747375259 740332031 739168243 745851822 736294479
$$ packed form
3771.7G32113647L993073Q2092L88108l61329J554947J013337K872619p16324p896270
3780.3G33043900K868499J995087M33502Q94165l906402m49982K361145R93805K82059
3789G38515778N73349O25228m01840j05514k19651J400681K238922m521484k716065
3797.7G35389404K960587L798218M850158q143539r481049M929581L146057M416046
3805.4G41865463L544235j0788803k016525O006165K697982l4713o65589m56695J629944
3814.1G41781464M388809n208435j1248245Q152542N952148K514725p03049j7730408
3821.8G27899551M189606P135391K200699K120972r87396m121170R38720K263260L205872
3830.5G44845505K56805q479996L684922P068023p043228j163788O683579r557343
$$ plain form
3838.2 736294479 734657440 741838379 735914383 737585297 744876785 741591492 737810135 741541367
3845.9 741541367 743391342 743367004 744595108 742946777 744247208 747845459 740685501 740982895 724564438
3854.6 724564438 728907318 740618210 741042862 740114059 742414627 744474106 745623779 739630051
3862.3 739630051 740243225 745556412 738478317 735299377 741109085 746962280 750631638 737925644
3870 737925644 731492538 737811203 743755035 745616837 736325607 738150635 742922897 744038162 746472168
3878.7 746472168 749554749 741020126 734243164 741828003 743795319 745017700 748125381 734675217
3886.4 734675217 736945877 741378098 742227402 745593643 743615341 736310120 737971268 741887360
3894.1 741887360 742073059 743703156 744749451 746316299 745952682 735844803 741630173 743361664
$$ packed form
3838.2G36294479j637039P180939n923996J670914P291488l285293l781357L731232
3845.9G41541367J849975k4338J228104j648331J300431L598251p159958K97394j6418457
3854.6G24564438M342880J1710892M24652r28803K300568K059479J149673n993728
3862.3G39630051O13174N313187p078095l178940N809708N853195L669358j2705994
3870G37925644o433106O318665N943832J861802r291230J825028M772262J115265K434006
3878.7G46472168L082581q534623o776962P584839J967316J222381L107681j3450164
3886.4G34675217K270660M432221Q49304L366241j978302p305221J661148L916092
3894.1G41887360J85699J630097J046295J566848l63617j0107879N785370J731491
$$ plain form
3901.8 743361664 737477951 741140289 737294693 736664352 738711929 740568237 742419281 742431107 743017807
3910.5 743017807 742176895 742217712 742371902 742385864 744082336 745112152 741343460 738633575 742521820
3919.2 742521820 741353378 738942184 742800751 744513550 745106812 742180557 739581299 741866150
3926.9 741866150 742420197 742081757 741159286 741647263 743206940 739968414 738863907 740896149 741244049
3935.6 741244049 741296005 741622314 742261276 742527084 742173157 743540421 743146896 738734436 739474106
3944.3 739474106 741500244 741826324 742087860 740692596 741500854 741088028 739509888 741496964 741530838
3953 741530838 741457520 742424240 742659760 742238007 740601730 740962448 741248779 741707230 742191925 740850601
3962.6 740850601 741723862 742191086 741402740 741907806 742633362 742394257 741456604 742010117 742649841 741843338
$$ packed form
3901.8G43361664n883713L662338l845596o30341K047577J856308J851044J1826N86700
3910.5G43017807q40912M0817J54190J3962J696472J029816l768692k709885L888245
3919.2G42521820j168442k411194L858567J712799N93262k926255k599258K284851
3926.9G41866150N54047l38440r22471M87977J559677l238526j104507K032242L47900
3935.6G41244049N1956L26309O38962K65808l53927J367264l93525m412460P39670
3944.3G39474106K026138L26080K61536j395264Q08258m12826j578140J987076L3874
3953G41530838p3318R66720K35520m21753j636277L60718K86331M58451M84695j341324
3962.6G40850601Q73261M67224p88346N05066P25556k39105r37653N53513O39724q06503
$$ plain form
3972.2 741843338 741621552 741853638 741163788 740247421 739973068 740373001 741058502 741662140 742298965 742250443
3981.9 742250443 741373367 740988083 741294785 741557007 741605911 741555405 741835937 742189941 741638947 741432877
3991.5 741432877 741875153 741901703 741717148 741415100 741594467 742023621 741975174 741809235 741796875
4000.2 741796875
$$ packed form
3972.2G41843338k21786K32086o89850r16367k74353L99933O85501O03638O36825m8522
3981.9G42250443q77076l85284L06702K62222M8904n0506K80532L54004n50994k06070
3991.5G41432877M42276K6550j84555l02048J79367M29154m8447j65939j2360
4000.2G41796875
##END=$$ End of the data block
