##TITLE=$$ Begin of the data block
##JCAMP-DX=5.00 $$ ACD/SpecManager v 10.08
##SPECTROMETER/DATA SYSTEM=Varian
##DATE=15 Jan 2013 10:29:32
##DATA TYPE=INFRARED SPECTRUM
##DATA CLASS=XYDATA
##ORIGIN=
##OWNER=
##NPOINTS=3735
##FIRSTX=399.26403809
##LASTX=4000.35498047
##MAXX=4000.35498047
##MINX=399.26403809
##MAXY=72.46901703
##MINY=23.89970970
##XFACTOR=1.0000000000
##YFACTOR=0.000000100000000
##FIRSTY=45.57370758
##DELTAX=0.96440572
##XUNITS=1/CM
##YUNITS=TRANSMITTANCE
##XYDATA=(X++(Y..Y))
399.3 455737076 451459045 428646278 427756500 428990974 424230461 426647377 425450325 427922440
407 427922440 433664627 431067047 424128990 421357803 427329826 430316582 430223732 428979263 420202904
415.7 420202904 417420731 422647934 428775444 429670906 426100006 425084724 423596382 424650612 428471069
424.3 428471069 432690773 431528358 424312553 421209717 421797829 423686523 425549355 425732002 427399826
433 427399826 429029922 429685173 427726402 422741356 422248688 425550957 423923531 420095749 423225060
441.7 423225060 425064392 423735619 426979828 425507507 420100441 420354881 422679749 424214363 421952515
450.4 421952515 416820908 415746384 416804810 420813370 424443054 424163971 423552818 421145096 420095673
459.1 420095673 416675072 414246559 419954147 421799774 418060265 416588173 415715561 412562332 412461815
467.7 412461815 414016876 413773155 415990028 416356735 413397331 413571739 413022041 414060478 418294868
476.4 418294868 417705460 415272980 412898293 406867638 405090027 407260857 407293320 406426697 405866547
485.1 405866547 403356171 402955513 407752724 407990112 406419792 409098282 409966316 407469521 407810974
493.8 407810974 410705643 408650398 406887817 410200882 410958061 407186928 403858223 404407349 405781670
502.5 405781670 406382217 407019577 406922340 404704819 402764473 404704857 404578590 403371124 402522583
511.1 402522583 401642075 402563934 400509338 398414268 399983177 400567932 399797020 399871750 399695129
519.8 399695129 399361877 400610924 400642090 398891907 399258499 398836174 397469978 397670326 396359711
528.5 396359711 395351601 395079880 394801712 394895363 394589806 394966354 394643860 394244156 394015045 394326134
538.1 394326134 395794907 395354843 394884834 395586777 395513725 394103928 392624588 391797714 390822029
546.8 390822029 391018715 391512871 390909500 389584618 389756432 389923935 389245300 389372292 387685318
555.5 387685318 386196213 385118637 385387764 386798286 385803680 386390953 386956863 386523209 387261314
564.2 387261314 387577324 387033348 386124573 385844193 386031723 387601624 387796173 386396980 386021461
572.9 386021461 385652237 384193039 381288719 381744194 383531227 383165932 383184319 383065834 382820969
581.5 382820969 383396416 384186974 384570961 386280937 387456856 386847343 386200981 385413284 385495758 385024414
591.2 385024414 384974976 386621933 387509384 388076210 388798180 389019737 388194199 387479744 387659607 388567314
600.8 388567314 388196182 386829834 386536713 386107521 386360970 386805000 387069473 386653023 384466934
609.5 384466934 383353539 383185539 383193550 383763199 384591827 384011459 382733536 383636055 385049934 386165733
619.2 386165733 386435089 386119118 386656570 386794472 386735458 387289658 387225456 387291908 388696251 389625359
628.8 389625359 390968819 393403320 395729828 397917099 398878632 399361916 400544243 401806297 401666603
637.5 401666603 401123886 402049408 403500938 405034065 405786705 407125740 409565697 411022987 411636429
646.2 411636429 411569939 412108841 412615662 412706146 413950844 415066299 416219101 417331047 417818756
654.8 417818756 417374115 416823158 417434807 417324448 416881104 416213799 415848732 416722870 417596741 418227577
664.5 418227577 418604889 420000572 422253342 422454720 421845512 420978889 419903030 419641838 419814301
673.2 419814301 419944687 421350136 423786659 425399857 426373100 427243423 429246445 430354881 430827522
681.8 430827522 432645149 433384247 433196526 432523117 432910919 435216293 436921005 437577629 438097725
690.5 438097725 439516182 441013489 441458397 440426559 438860359 439494781 441597519 441812515 440868835
699.2 440868835 441888695 444424973 446416969 447566566 448957138 449496880 448494110 448348312 448869095
707.9 448869095 449209480 449442520 450348549 451758499 452479553 454027672 456567535 457635689 457075157
716.6 457075157 457059898 456884193 456487923 456610184 456993370 458509369 459615173 460601730 462203369
725.2 462203369 464274025 465876045 465669441 466227036 466913071 467082939 467086182 467191505 468551712 469845848
734.9 469845848 470603714 471480637 474086494 475607414 474593086 474126244 474222183 474901581 475023537
743.6 475023537 474472733 474408112 475930367 478446579 479918175 480489655 480456734 481242027 482141457 482578354
753.2 482578354 482640038 481987152 482212563 482989388 483817635 485436363 488162003 490111809 491616440
761.9 491616440 492728233 492115784 491809311 491437759 491846657 492912254 493084450 492791824 492589760
770.6 492589760 493573532 494625511 495379715 495292473 494597015 494102707 493720055 493340683 492870712 493688965
780.2 493688965 494526825 495277290 496018410 496499596 497599525 498560143 499323082 499294968 499206505 498176765
789.9 498176765 497043381 497489815 497892914 498351212 498635139 498696327 497803497 497815170 498691711 498359528
799.5 498359528 497854424 495723228 493310738 491873169 490224762 487892227 486530952 486167336 484800262
808.2 484800262 484278069 483560562 481944962 480248642 478105659 475702629 473059731 471785278 471519279
816.9 471519279 471219940 471192322 471441536 471418495 472615700 474776726 474641228 474122772 473973770 475179062
826.5 475179062 478481064 480925827 483383331 486445541 489682121 492567863 495194054 497551270
834.2 497551270 499267654 500897217 502375641 503908234 504942245 507031975 509446182 510887947
841.9 510887947 512153702 514339066 518032570 520507507 522768288 524143753 523670425 523222771 523454857
850.6 523454857 524688187 525989342 527907372 529720840 532339516 535760307 538554878 540269127
858.3 540269127 540633049 541276093 541464615 542707138 543998451 544367561 544129105 543913116 546021957
867 546021957 546816864 546487770 545137024 542568130 540379066 538293915 536390419 534126892 532993622
875.7 532993622 532105370 532236176 532707825 532627640 533532982 533725014 533160133 530844154 528952675 528029480
885.3 528029480 526867065 525874481 524553185 524785500 525341034 526061592 526319160 526059570 526066132 525534210
895 525534210 525501137 524041290 522499580 522154121 522341347 522962379 522850151 522925682 523617134 525020905
904.6 525020905 526350937 527573814 528281364 528691864 529209747 529295158 529976006 530309830 530953255 531239586
914.3 531239586 531020241 530621872 528544617 525919609 522650108 519330101 516045380 513591537 511785393
922.9 511785393 509149399 506494331 503911552 501852722 500053520 498021660 495126991 491950531
930.7 491950531 489066391 486302643 484214745 482339249 481382751 481233940 481524391 481547432 480960960
939.3 480960960 480493202 479720230 478760681 476905632 475405998 474185371 472729950 472178917 472227325
948 472227325 473454361 473792343 472953415 472289848 471721611 470904083 468780289 466465759 463572731
956.7 463572731 460648537 458691368 457137718 455476685 453611717 452221413 450551071 448939552
964.4 448939552 447117500 444836845 442564201 439939804 437717781 435876045 434465027 433175278
972.1 433175278 431465874 429329033 427045784 425102692 422511024 418846703 414801979 411023483
979.8 411023483 407088280 402979469 399646378 396383133 392434692 388345032 384285393 380454483
987.6 380454483 376325684 371787224 367387657 362704887 358508835 354475784 350695534 347843590
995.3 347843590 344611015 340686989 337690620 336020241 333445282 330644836 328087311 325303574
1003 325303574 322822456 320793381 319352760 317749939 316886082 315907974 314573021 313293228 311737919
1011.7 311737919 309847488 307497005 306124458 304049053 302040577 300342503 298150597 296220970
1019.4 296220970 293615265 292167377 291114140 289876595 287210617 284114246 282488899 280361767
1027.1 280361767 279031429 277156982 275519295 274353600 273570175 273597851 272792110 272881393 272351475
1035.8 272351475 271875286 272500057 274153881 275547104 275369778 275651455 276033955 277010555 277490597
1044.5 277490597 277724915 277694302 277339497 277374325 276094227 275110321 274415627 273776283 272746506 272081947
1054.1 272081947 271870041 271143494 270924091 270246201 271078243 271997852 272871475 274839764 276573238
1062.8 276573238 277722874 278501759 281283779 283133678 284077969 284907227 285104351 286038685 286995659
1071.5 286995659 288221569 288287067 288261757 288813610 290128994 291303787 291687107 292672749 292624836 292845249
1081.1 292845249 293576756 295095406 296555367 297538300 298898163 300074921 302009907 302805500 303949490
1089.8 303949490 305260963 306787395 309372711 311403618 313061943 313717403 316450405 318969040
1097.5 318969040 319764538 320850487 321642876 323040047 324467468 326124954 326712341 327888718 329142189
1106.2 329142189 329617882 331966209 333686142 334629555 335081673 335726471 336028290 335786209 337067375
1114.9 337067375 338531342 339688797 340023232 340083847 339864044 339916878 340234108 340015907 340597725 340681000
1124.5 340681000 340393333 340741043 342181053 342929115 343703117 346205902 347656898 349402847 351571426
1133.2 351571426 353092461 353620605 354679375 357096901 358354454 359654846 361145706 362868423
1140.9 362868423 364554176 365777283 367391853 369219971 370693817 370701218 370218391 369680023 369718971
1149.6 369718971 369744415 368938522 369222031 370060692 370627174 370372849 370206223 370269547 369397926 368161392
1159.2 368161392 367006302 366227112 365378380 365447121 365618591 365699425 367241898 369196701 371312828
1167.9 371312828 373410912 376040382 378342094 379978256 381496925 382973557 385223427 388091736
1175.6 388091736 391333923 394523277 397890663 400550995 403329430 406460838 408144188 409224701
1183.3 409224701 410190773 411104889 411921654 413551750 415716171 416939392 417921982 419003296 419847336
1192 419847336 420054893 419979591 419245224 417357368 415448074 414279060 413580093 412950363 412722664 412448235
1201.6 412448235 411899376 411522102 410995483 410135956 408461533 406730080 405229073 403796005 402954178
1210.3 402954178 402273636 402489471 403004227 403051910 402999115 402832794 402427864 401205521 400053978 399239693
1220 399239693 398282089 397263603 396661606 396710320 396696320 396981392 397074127 396489334 395655937 394627228
1229.6 394627228 393133316 391450386 390390091 389421806 388877525 388757477 388794479 389474449 390230446
1238.3 390230446 390518951 390247192 389547234 388467522 387694016 386778030 385903130 385791931 385211639
1247 385211639 384858208 385214043 386048813 386873665 387127724 386937180 386182632 385278435 384177208 383320503
1256.6 383320503 382796516 382844505 383604851 384559593 385983696 387207832 388312798 389061623 389200401
1265.3 389200401 388934288 388600578 389081268 390137291 391101112 392103195 394032173 395962029 397699165
1274 397699165 399450226 400475578 401473045 402310600 402750931 403453827 404510422 405586700 407131920
1282.7 407131920 409453163 411874466 413973694 416264839 418525810 419396286 419965286 420298691 420124474
1291.3 420124474 420465508 421507988 423065834 424534149 426093025 427475052 428899498 430369987
1299 430369987 430695763 430243988 429849586 429225502 428293304 427916336 428238258 428903008 429664879 430570335
1308.7 430570335 431264000 431574860 431604156 430738182 429590721 428296471 427288971 426697845 426459885
1317.4 426459885 427206078 428550339 430822067 432764091 433580780 434025230 434468307 434764366 434234924
1326 434234924 433757210 433402939 433169136 433223877 433606834 434181519 434455490 434979286 435021172 434792137
1335.7 434792137 434023018 432656631 431552658 430551071 430594864 431281242 432472954 433790588 435220108
1344.4 435220108 436807938 437509499 437741241 437411423 437062721 436333466 435662918 435199814 434559174
1353.1 434559174 434917908 435703697 436332245 436332626 436296654 436264725 435631828 434403572 432809143 431344681
1362.7 431344681 429445190 429707222 430054436 429866333 430352592 430595779 430773468 430405273 429953918
1371.4 429953918 429280319 428072853 426987267 426066551 426239166 426585274 426861229 427377129 428004341
1380.1 428004341 428046532 427728348 427179070 425595436 423999786 422171059 420402222 418576088 417877350
1388.7 417877350 417631531 416840858 416458588 415628662 414734955 412729607 409751778 408154182 405826683
1397.4 405826683 403491402 400450134 398485374 397627449 396491547 395431824 394183273 392033501
1405.1 392033501 390229263 389373322 387573051 385268135 382901154 380670624 379821243 379104042 378409157
1413.8 378409157 377986450 377594795 377342758 376577415 376070633 374445648 374792938 375617790 375561714 375830917
1423.4 375830917 375450859 376328125 377525253 378408737 379752502 380594673 381684990 382350311 383449287
1432.1 383449287 384267616 384774170 386011047 386656380 386465645 387872620 390784264 392977448 394637947
1440.8 394637947 396038437 396943893 398033562 397906342 398064308 398221054 398176270 398588905 400397530
1449.5 400397530 402730598 404029083 405691910 406707993 408129921 408946114 408255997 407786179 409060326
1458.2 409060326 412663231 413743477 416343880 418485794 420143013 422598267 423219833 425974922
1465.9 425974922 428140640 430062637 431529922 432903519 434861450 435577507 438109932 441475296
1473.6 441475296 445835075 449448128 452478294 455401764 458189392 460656281 461866188 462812958
1481.3 462812958 464104004 465603905 467122612 468781471 470633926 472192955 473899384 475627861
1489 475627861 474749718 473388329 474209785 474237556 472904816 471547318 470299034 465329666 465335693 464887276
1498.7 464887276 463114929 463501015 462699089 461295738 459876556 459232826 457140694 449927101 445320969
1507.3 445320969 447025871 450239944 450122528 450936928 450715790 449389305 449094696 447251549 445265198
1516 445265198 441756821 440141983 441166916 441396980 439306183 437771530 440565071 442610283 444910126
1524.7 444910126 445487289 445811424 445842171 445574188 446463165 446353340 446454391 447203484 446901321 446159821
1534.3 446159821 448919296 450981903 451703987 452869759 449069138 446005707 448708611 449852562
1542.1 449852562 450972443 452244949 452945442 452970848 455576630 457497902 458989716 459630852 459080467
1550.7 459080467 459934731 459815140 459670067 457127419 457618599 459917068 462208633 463177261 452837524
1559.4 452837524 456036682 458203773 459520950 458862000 457167549 454247932 452310448 451856651 450443726
1568.1 450443726 450032616 443822899 442319031 441770401 439469414 437014542 433699455 430920525 420163536
1576.8 420163536 419676094 417882195 414098511 410449371 405991325 403401985 399240417 396258125
1584.5 396258125 391571732 387369347 382927132 377398376 373734894 368338623 365212593 360285950
1592.2 360285950 357274475 353533783 349201698 346897469 342095337 339789696 335265045 332487411
1599.9 332487411 328713112 324994049 322458763 318107853 316918411 313960323 313439007 310980587
1607.6 310980587 309288712 307686062 304594231 304451313 301454678 300744629 298440437 298073616 296905155
1616.3 296905155 292248535 294695778 293960094 295457306 294057579 294456062 293678818 291842365 293279972
1625 293279972 292399254 294049034 291964836 293136845 294204369 295088406 296506462 296621933 298936005
1633.7 298936005 298490887 299264870 298154316 300397015 301902905 302531681 304369259 304284172 306877499
1642.4 306877499 307709579 309944458 311514931 310714474 313240681 312289543 315496807 315768623 317680454
1651 317680454 318787155 314019489 317154484 319080563 323739052 325154381 327329063 328205948 329940796
1659.7 329940796 331810570 333015404 335401382 335187912 338946495 341371002 344521179 347493401
1667.4 347493401 349638329 353638878 355246468 359590797 362076874 365741768 368631973 371110229
1675.1 371110229 374506531 377681084 382559929 386008339 390950508 394328079 398507881 402783127
1682.9 402783127 402140007 406458588 410673332 417418480 421597824 425533295 430548668 435130081
1690.6 435130081 440541077 445123062 450312347 454568977 458147545 460240364 465883331 471694336
1698.3 471694336 476010017 477982368 480143166 488297844 494068222 498680992 502922745 506418114
1706 506418114 509723778 513081512 516334343 517898216 519492302 521986809 524839478 527887917 529199562
1714.7 529199562 530675812 534336052 536656609 534531746 538288536 541353798 542658806 543538475
1722.4 543538475 543926849 544922600 546824150 549155731 551685486 554266968 556760101 557042618 557275963
1731.1 557275963 559883003 561332130 558285370 556550064 561313477 565263290 567700653 571278191
1738.8 571278191 573416786 574414558 578932991 581584816 582518921 584200745 586656265 588893814 591158333
1747.5 591158333 594572105 597074089 601960258 606003151 609212570 614479752 617750969 620411453
1755.2 620411453 622667007 622457314 624244843 627144089 629926834 633374939 634169273 636068039 640686493
1763.9 640686493 643414764 645489960 647558594 648851318 646682434 647508011 650130844 649847031 649505615
1772.5 649505615 650029144 655038300 658837204 659879456 662149963 662705917 663727112 663174133 661475906
1781.2 661475906 662259903 663544159 665089264 665387115 667351303 670376511 672586441 673678589 674646301
1789.9 674646301 674246674 673248749 671315079 670864792 674087372 675016937 675245667 677418976 680339050
1798.6 680339050 682580643 682732162 684642410 684529495 684422150 684806366 684388046 684736481 684762039
1807.3 684762039 685688095 687512436 690098953 690834808 692231369 694111938 694410934 694850922 693696442
1815.9 693696442 693019333 691836853 691818085 693124619 694214859 696407089 697311020 699220123 701024323
1824.6 701024323 700244522 700119781 700586700 700882874 698726807 695048370 696665573 699778976 701155319
1833.3 701155319 702726135 704636536 706064148 706967773 706277695 706273651 704857330 704035492 703502426
1842 703502426 704262772 705874557 702514954 705559158 708739319 710064850 710628967 710615768 710703735
1850.7 710703735 709315643 708766785 707939606 707784195 707896042 708392334 710367661 711610794 713433075
1859.3 713433075 714531631 714761810 713907776 713133850 712647324 711842346 711760101 710733566 711712341
1868 711712341 712139969 712336960 714993973 716961136 717873611 717563705 717246933 715891571 714940948
1876.7 714940948 714406662 713697128 714064178 715118256 716936188 717699051 718990173 719875031 719617691
1885.4 719617691 719280014 718207474 717972717 716214905 714239349 714972000 716430283 717818756 719270859
1894.1 719270859 720368195 720692215 721818542 721185455 720202789 719466476 718401794 717703629 716820145
1902.7 716820145 717540054 718527069 720293884 721951981 722748795 723166504 722513809 721878891 720783463
1911.4 720783463 720218506 719152069 718646851 718812408 719531021 721650772 721838608 722610474 723834915
1920.1 723834915 724084091 723739090 722093201 720681000 719855576 719697495 719416275 719956589 721007309
1928.8 721007309 722363739 723842850 724279175 724690170 724069672 723280029 721855850 720576553 720052490
1937.5 720052490 719618988 720271683 720709457 722089920 722959671 722983704 723961563 724159012 723280716 721942368
1947.1 721942368 721224289 720114441 719473572 719373703 719843674 721212845 722166977 723511658 724112625
1955.8 724112625 724197006 723235855 721719360 720706711 719678497 719315262 718889771 719524460 720384674
1964.5 720384674 721568451 723127594 723302612 723189011 722959137 722294540 720550461 719437027 718837204
1973.1 718837204 718257294 718662949 719497452 720886688 721602859 722554932 723218613 722984848 722234802
1981.8 722234802 720801849 719563446 718090210 717656631 717679901 718394470 719685898 720536499 721953506
1990.5 721953506 722540131 722190475 721389008 720780411 719487457 717936478 717073364 716380081 717004395
1999.2 717004395 717986450 719644394 721019974 721605530 721783142 720877533 719861450 718061752 716703491
2007.8 716703491 715676880 715188980 715630341 716484833 718082962 718984680 719787521 719798737 719339066
2016.5 719339066 718347092 716882477 715803146 714473190 714221115 714109039 714687653 715866470 717015457
2025.2 717015457 718271866 718332977 718109512 717206573 716182022 714855957 713473892 712303543 711671448
2033.9 711671448 712510910 712950592 713988495 715290833 716290359 716524429 715618134 714544525 712902222
2042.6 712902222 711868286 710716553 710421066 710830917 711587067 713125992 713730927 714507980 714729843
2051.2 714729843 714508057 713683395 712387314 711371460 709988022 709556808 709582977 710333786 711119995
2059.9 711119995 712169571 713430634 713688202 713635178 712451553 711388321 710402985 709696884 709126205
2068.6 709126205 708543015 709185257 709838181 711055832 712052689 712685242 712823792 712162704 711187057
2077.3 711187057 709820786 709245377 708338089 707846909 708058319 708633118 709427185 710075378 711310730
2086 711310730 711510468 711188965 710251541 709175873 708071060 706663666 706638794 706800690 707379913 708327866
2095.6 708327866 709439468 710013580 709794235 709532471 708397141 707402802 706253510 705561447 705179138
2104.3 705179138 704897766 705390472 705818558 706935120 707938461 708363342 708095322 707543945 706613541
2113 706613541 705165482 704202271 703270798 703106995 703377075 704576569 705842667 706273727 707005997
2121.6 707005997 707162704 706878357 705759583 704794464 703787384 702819366 702848969 702763138 703508224 704557114
2131.3 704557114 705541077 706118774 706336517 706337967 705492859 704591827 703566132 703080139 702692413 702725830
2140.9 702725830 703200836 703809738 704661102 705003586 705850677 705815430 705180130 704731140 704069214 703412018
2150.6 703412018 702795563 703087540 703169022 703696060 704208145 704645004 705602951 705894547 705973129 705232773
2160.2 705232773 704616852 703740082 703019638 703213196 703310471 704070892 704810486 705733337 706171417 706179962
2169.9 706179962 705953751 705396881 705398865 704526596 703482513 703148117 703592682 704121170 704700623 705702896
2179.5 705702896 706390305 706845016 706330795 706047287 705797882 705160980 704715729 704290085 704418030 704647675
2189.1 704647675 705260315 705581207 706249695 706765289 706415710 706628494 706423187 705843506 705017700 704797897
2198.8 704797897 704654617 704687653 705727081 706236572 706954803 707422028 707786484 707921906 707431793 706752319
2208.4 706752319 705707474 705489502 705510025 705681000 705912628 706411896 707199478 707691727 707960739 707786789
2218.1 707786789 707999649 707517700 706833038 706462784 706166763 706100311 705893707 706423264 706655960 707399216
2227.7 707399216 707982483 707643509 707518539 707074509 706941605 706455765 706252975 706216583 706229935 706715317
2237.4 706715317 707066498 707546234 707492523 707955093 708377533 708265686 707503281 706628342 706740417 706378174
2247 706378174 706230316 705879364 706166763 707091446 707330475 707677994 707728195 708108673 707835236 707235718
2256.7 707235718 706740265 706191101 706275406 706217804 706279678 706229858 706648865 707141571 707669296 708033371
2266.3 708033371 707755737 707664337 706927795 706620560 706278229 705873337 705760651 705720673 706482697 706706161
2275.9 706706161 706867752 706964188 707271729 707455750 707111359 706852036 706002426 705453491 705151596 705679474
2285.6 705679474 705975418 705724335 706171188 706462402 706709900 706257629 706150665 705955658 705143738 704368286
2295.2 704368286 703483505 703699875 704085007 704693756 705182648 705574417 705904083 705738449 705749207 704999542
2304.9 704999542 704383545 703848801 703788986 703958893 703701782 703983002 703955078 704483032 704940186 705380402
2314.5 705380402 705548859 704753723 704351501 703706818 703145447 702851639 702615128 702030869 702501755 703585663
2324.2 703585663 703966141 704587402 704088135 703415298 702252655 701508942 701301804 700297470 700028992
2332.8 700028992 699971771 701018600 702004852 702687912 703323364 703677673 702871017 701270905 701438293
2341.5 701438293 701188736 700544662 699824600 699492340 699605255 699786758 700451508 701152725 702088394 702135696
2351.2 702135696 702301788 701365051 699382324 698750763 698816299 700024948 699345856 699805222 700101700
2359.8 700101700 700213394 701163635 699855957 699670639 698797379 698646164 698110580 697765274 697100677
2368.5 697100677 695220413 695843124 695862427 696233139 696964569 697258759 697381058 696663437 695751648 694658127
2378.2 694658127 694269714 693580017 692851105 692702637 693330307 694439850 694856567 695000381 694645462
2386.8 694645462 694352646 693576660 692341232 691324005 690458679 690625763 690931778 691283646 691491928
2395.5 691491928 691903915 692603073 692665558 692109680 690823517 689908829 689082413 688409805 687786636 687311478
2405.2 687311478 687709351 688262253 689120102 689511642 689674835 689121399 688012848 687401047 686323013
2413.8 686323013 685170670 684184113 684153748 684398193 684654999 685494232 685965729 686129227 685481873 684676819
2423.5 684676819 683860931 682941284 681894379 680782471 680419998 680101013 680531693 681730728 682710037
2432.2 682710037 682946243 682631454 682170792 681397705 680500259 678913651 677611313 677168884 677340012
2440.8 677340012 677537994 677624893 678297577 678593750 678644791 678044662 677272568 676713333 675531540 674373398
2450.5 674373398 673505630 673320236 673442001 674000854 674306259 674288559 674603500 674351883 673828888 672565308
2460.1 672565308 671368027 670410919 669440155 668984985 668608398 668978271 669503250 670244751 670659256
2468.8 670659256 670113449 669518509 668785629 667838669 666439743 665094452 664149399 664079361 664580612
2477.5 664580612 664987717 665182419 665281525 665747452 665299911 664183655 662778549 661592941 660908890
2486.2 660908890 660107956 659839096 659433212 659409790 659677124 660024490 660495453 660467606 660098495 658576202
2495.8 658576202 657095184 655834274 654865570 654711151 654660339 654752884 654777832 655370178 655608139 655534592
2505.5 655534592 655194016 653793106 652141724 650592880 649939041 649235153 648804703 649162369 649473419
2514.1 649473419 649987717 650212326 650233612 649774017 648899841 647754288 646623306 645616837 644698868
2522.8 644698868 644449158 644325256 644522629 644850616 645548782 645896072 645330353 644977417 643945160
2531.5 643945160 642558289 641221619 640266037 639824905 639527359 639890480 640528107 641168671 641383438
2540.2 641383438 641259460 640638199 639780769 638924522 637637749 636355743 635318718 635155334 635357208
2548.9 635357208 635844879 636374588 636567078 636548729 635905647 635442772 634216156 632700691 631823578
2557.5 631823578 631188049 630813904 630322838 630590134 630863533 631340408 632038727 631920357 631528587 630488853
2567.2 630488853 629000244 627664070 627181091 626836891 626258392 626065483 626434784 627436523 627800446
2575.9 627800446 627692680 626922569 625738297 624850464 623710976 622567520 621816368 621827469 621908569
2584.5 621908569 622347794 622597618 622500114 622766228 622042618 621503105 621085205 619645920 618299866
2593.2 618299866 617741432 617470093 617067795 617087288 617418518 618126221 618272934 617725334 617215004 616200066
2602.9 616200066 615110741 614108543 613048553 612118797 611780472 611697884 611888237 612230759 612268105
2611.5 612268105 612728310 612531471 611576271 610365677 609003868 607966766 607039032 606475754 606374207
2620.2 606374207 606980209 607141571 607152672 607466545 606836662 605954666 604991951 604225769 603176613 601805878
2629.9 601805878 600960655 600578613 600924301 601225166 601285782 601288261 601388588 601073952 599889297 598510742
2639.5 598510742 597146339 596298752 595657082 595094719 594994240 595381393 595658836 595843239 596055908
2648.2 596055908 595239449 594439201 593796082 592721596 591472282 590358124 590023422 589790726 589713593
2656.9 589713593 589909706 590368347 590683441 590254669 589531326 588816757 588130760 587048264 586193237
2665.5 586193237 585513344 585069466 585188255 585436516 585883331 585827103 585683517 585574989 585274963 584552116
2675.2 584552116 583367310 582372551 581309052 581035156 581045227 580963707 581223602 581503143 582053680 581994247
2684.8 581994247 581229782 580268898 579269257 578057861 576991768 576500473 576390495 576756516 576937599
2693.5 576937599 577191963 577516060 577813988 577693863 576748161 575792809 574715195 573915367 573145866
2702.2 573145866 572542572 572469559 572791023 573279190 573411331 573868904 573798141 573189392 572038651 570570755
2711.8 570570755 569868317 569056244 568741150 568871078 569064369 569193001 569538155 570267372 570118484 569570045
2721.5 569570045 568796120 568154793 567469902 566728630 566387444 566062050 566106339 565988579 566241226 566660423
2731.1 566660423 566540489 566128731 565704422 565419426 564191246 563047295 562610207 562457809 562440491
2739.8 562440491 562761269 563614807 563824348 564051094 564234886 563803177 562804298 561672325 561318817
2748.5 561318817 560937004 560466118 560136223 560099220 560383492 560907936 561464348 561136971 560335770 560010986
2758.1 560010986 559726143 558335342 557171593 556837234 556630898 557041817 557581367 557904701 557736473
2766.8 557736473 557478333 557126923 556457596 555892563 555107536 554281845 553683662 553494263 553125343 553064499
2776.4 553064499 553406258 553398209 553427010 552982025 552554588 551992226 551160545 550224533 549223671 548813896
2786.1 548813896 548454895 548710709 548926201 548826714 548754158 547976570 547166405 546360245 545438004 544247513
2795.7 544247513 543535957 543293228 542774239 542517052 542498360 542561111 542038765 541358376 540618439 539869957
2805.4 539869957 539359169 538335457 537308693 536132774 535351944 534950027 534465065 534393120 534162216
2814 534162216 533946228 533264847 532134705 531186523 530069351 529115715 528515053 527824135 526792831
2822.7 526792831 525801048 525602188 526123848 525765877 524611397 523660088 522588959 521261215 519869080
2831.4 519869080 518828278 517681313 516705017 515945778 515198669 515015831 514317360 512835464 510888367
2840.1 510888367 508912239 507114105 505036201 502803230 500560799 498600960 496624107 494880905
2847.8 494880905 493387604 491738815 489951286 488226929 487152939 486128693 484873390 483658752
2855.5 483658752 483138733 483253288 483602104 484285927 484385757 484375687 484597015 484673538 484296684 483461342
2865.2 483461342 482351990 480803146 479515190 478202400 477578773 477411728 476716728 476436005 475984726
2873.8 475984726 475603294 475455589 474939690 474111137 473134995 472196121 470977554 469946404 469192810
2882.5 469192810 468575287 468117981 467980347 467929153 467123566 465854149 464516335 463416786 462365532
2891.2 462365532 461212234 460011482 459007225 458777199 458650932 457893486 456679993 456033401 455578079
2899.9 455578079 454556274 453612251 452639732 451719780 451139717 450341797 448921852 447972946 447382622
2908.6 447382622 446453056 445815849 444825211 443431091 441545906 439278831 437551956 435899963 434196320
2917.2 434196320 432708817 431410904 430307045 429396858 428440552 427972107 427912331 427283974 426747704
2925.9 426747704 426719322 426998482 427153168 427146301 427035904 427131691 428076553 428870964 429309654 429818954
2935.6 429818954 430443954 431053886 431547394 432067680 432680473 433522301 434107628 435158997 436417999
2944.2 436417999 437260590 438164635 438698273 439270439 439727135 440128403 440508080 440693779 440833092 440805359
2953.9 440805359 441448975 442396851 443410339 444121361 444518967 445043488 445269241 445870895 446501808
2962.6 446501808 447053642 447586784 447967262 448743324 449745560 450678978 451470947 452571182 453402901
2971.2 453402901 453872566 454505081 455079842 455535240 455894279 456286926 456505127 457055626 457582550 458237228
2980.9 458237228 459155273 459292221 459558716 459681282 459470444 459340782 459252701 459574699 459876289 460461121
2990.5 460461121 461070557 461245728 461370392 461465111 461329269 461147423 460868149 460116959 459413338 459034767
3000.2 459034767 458747025 458351784 458372574 458241158 457626076 457674980 457591171 456960449 456142387 455802689
3009.8 455802689 455409927 454197006 453223419 452620125 452676888 452506409 452035789 451873512 451390762 450951729
3019.5 450951729 450102806 449048271 448057289 447201996 446489067 445411072 444508972 444293442 444144516
3028.1 444144516 443502159 443582611 443193970 441792870 440920906 439849854 438728600 437419395 436607018
3036.8 436607018 436353111 435931969 435683975 435095978 434522209 433585320 432752113 432362518 431357460
3045.5 431357460 429839745 428456421 427889442 427222176 426460190 425943718 425292854 425057030 424669418
3054.2 424669418 423498268 422420959 421834641 420933762 420026474 419049606 418178635 417634583 416809845
3062.9 416809845 416525383 416150970 415623093 415235252 413916283 412661743 412083015 411415558 410358086
3071.5 410358086 409609070 409295082 408914375 408416290 408176498 408039055 407402992 406576042 405372734
3080.2 405372734 404431992 403869553 403084259 402450027 401827431 401492233 401059036 400607147 400197945 399512672
3089.9 399512672 398821640 397764893 396695099 395554695 394750137 394267235 393672523 393523560 393257713
3098.5 393257713 392844429 392271614 391681290 391266174 390541611 389479637 388150635 387029533 386357613
3107.2 386357613 386033134 385369492 384506721 384166489 383850975 383595467 383275642 382507706 381514626 380442276
3116.9 380442276 379526672 378648453 377557564 377008286 376660690 375721664 374927177 374384117 374009361
3125.5 374009361 373299065 372362785 371501694 370248718 369348907 368529701 367813377 367204208 366682777
3134.2 366682777 366440392 365572205 365151405 365042038 364383659 363412819 362231483 361103973 359629669
3142.9 359629669 358693161 358410530 357959061 357277679 356569443 356158066 355721970 355126038 354294891 353449211
3152.5 353449211 352196503 350693626 349763184 349129448 348803520 348476677 347984200 347104530 346056404
3161.2 346056404 345513229 345104637 344259033 342977142 342164917 341302910 339966049 338975754 338403587
3169.9 338403587 338304939 338265915 337714081 336649742 335555496 334724541 334021721 332879677 331715927
3178.6 331715927 331445694 331268883 330807762 329872513 329223480 329173203 328463669 327385025 326305618
3187.3 326305618 325383873 324319763 323086090 322180901 321699409 321908913 321830902 320878296 319755802
3195.9 319755802 319360580 319153175 318441334 317595921 316451092 315636425 314813957 314125671 314198723 313577061
3205.6 313577061 312632866 312572823 312601776 311754513 310616798 309924603 309357605 308625240 307803917 307009926
3215.2 307009926 306431255 306223469 305857925 305524540 305349503 304950085 304286861 303492908 302955074 301760960
3224.9 301760960 300528202 300283909 299966602 299562492 299267349 298880119 298610134 298504601 297792130
3233.5 297792130 296777916 296225281 295522366 294582405 293816776 293575020 293170090 292747002 292684841 292104549
3243.2 292104549 291661072 291343060 290816784 290319214 289882164 289576530 289086800 288425808 287498035 286963024
3252.8 286963024 286852169 286882763 286758728 285681324 284757309 284236126 283950195 283839302 283132420 282591724
3262.5 282591724 282177258 281696148 281580257 281217155 280660610 280440674 280207119 279881802 279890938 279759102
3272.1 279759102 278717976 277481670 277090359 276933575 276758537 276839962 276752033 276296234 275533218 274834385
3281.8 274834385 274484215 274398346 274340878 273912544 273149567 272755604 272929478 272939796 272637234 272279282
3291.4 272279282 271883793 271419888 271246433 271221066 270559292 269906540 269224491 268189297 267941742 268129330
3301 268129330 268131447 268237457 267983208 267434750 267139339 266822205 266669769 266438866 265627899 265175266
3310.7 265175266 265172405 265102158 264849701 264605713 264438705 263801327 263044910 262416725 261773090 261510639
3320.3 261510639 261837044 262154999 261626759 260959358 260404663 259349957 258550644 258175011 257837543
3329 257837543 257704792 257435074 256785526 256211147 255832596 255243301 254709396 254177284 253481083 253244915
3338.7 253244915 252853642 252433643 252550316 252155418 251535778 251201210 250614166 250002441 249842491 249785595
3348.3 249785595 249593964 249171505 248331833 248160496 248430557 247895012 247128086 246920147 246819115 246296425
3357.9 246296425 246013889 245656109 245238495 245294495 245078526 244666862 244345036 244336185 244361420 244207916
3367.6 244207916 243860855 243376884 243035355 242461548 242321949 241992455 241656742 242034893 241934643 241943340
3377.2 241943340 241538582 240994606 241168613 240987549 240492363 240223770 240483227 240360203 240375042 240890770
3386.9 240890770 240641422 240238419 240394802 240641193 240216827 239850636 239664612 239459896 239644871 239368324
3396.5 239368324 239038143 239332561 239672356 239384594 239293442 239496460 239131012 239210262 239247303 238997097
3406.2 238997097 239091434 239406700 239739609 239765358 239834919 239619503 239354763 239403725 239445038 239484215 239673538
3416.8 239673538 239978809 239903946 240041809 240333805 240147038 240195293 240907288 241316338 241185112 241532288
3426.4 241532288 241903591 242382660 242836037 242808113 242670002 242618217 242962437 242872677 243153133 244039154
3436.1 244039154 244234257 244286957 244751835 245419807 245451336 245436230 245798321 246322479 246821327 247339954
3445.7 247339954 248513660 248677368 248689976 249325428 249525223 249993935 250359936 250670929 250959854 251526699
3455.3 251526699 252619934 253350849 253644409 254101448 255098534 255712910 256220570 256977520 257107105
3464 257107105 256952515 257605896 258776493 259099827 259440365 259880352 260411987 261701069 262735901
3472.7 262735901 263263569 263740692 264608231 265016174 265248470 266275215 266779499 267030869 267830391
3481.4 267830391 268424778 269098988 270392895 271327095 271982212 273392544 274640350 275107288 275721207
3490.1 275721207 276555920 276943665 277346973 278098946 279012966 280074425 281167011 282279263 282706699
3498.7 282706699 283131161 284216881 285282593 285704956 285674686 286753845 288036900 288755608 289524097
3507.4 289524097 290778332 291990891 292735443 293968792 294772549 295369682 296413441 297619705 298643723
3516.1 298643723 299173908 300182400 301257439 301991692 302769852 304060402 305374641 305933456 306922779
3524.8 306922779 308297558 309308910 309432640 310470200 312293663 313508682 314686432 315670662 316980267
3533.5 316980267 317998505 318933754 319461174 320160065 322367668 324225540 325488892 326126556 327280388
3542.1 327280388 328665924 329773750 330922585 331719704 333646088 334432678 335875359 337572327 338464966
3550.8 338464966 340077858 340579109 341994133 343373451 345086861 346731224 348060913 350865555
3558.5 350865555 351930771 352690353 353698387 355613365 357378922 358195839 361840897 363256378 363968964
3567.2 363968964 365605202 366082954 368744240 370840034 372734833 374227524 375487022 377061882
3574.9 377061882 379494019 381596069 382188568 384531059 386721077 387866364 389286499 391425514
3582.6 391425514 393417244 394917641 398160896 399338608 399437714 401291161 402559319 405968552 409077568
3591.3 409077568 411767807 413229790 414554596 417196503 417498741 419721985 422895050 424793320
3599 424793320 427924309 429562874 430899658 434266930 437173729 439032440 441448898 444147491 444529610
3607.7 444529610 447275162 448297615 449068260 455306702 457075958 456841736 460985489 462211533 466065140
3616.4 466065140 469353752 470652466 472733002 473501701 477143059 480480881 483107567 486023216
3624.1 486023216 488652916 490720940 493515015 499365425 500578194 495360146 499569931 504751053
3631.8 504751053 510098343 512838097 513336563 516342010 519976425 523046837 524606285 526844025
3639.5 526844025 530645676 533707619 535339699 537061005 540457993 544580498 549055023 548722725
3647.3 548722725 547446938 552767639 554111900 554469757 556287384 561185989 565943642 569886894
3655 569886894 575057411 571531487 573106918 577801743 579692535 582158699 583824425 586958466 588836021
3663.6 588836021 590096893 591911774 593133469 598149910 601058235 601109772 601845016 596927986 601002121
3672.3 601002121 608813553 615848236 614249458 600746269 605101280 613180008 617605247 615747261
3680 615747261 616595993 619466896 621501236 623295517 624194641 624966469 628662033 634573326 626892014
3688.7 626892014 624127846 632245827 628563805 628434334 633492317 634966087 636458817 636634598 636753311
3697.4 636753311 638280869 639226570 642087936 644236221 639593620 638568802 642866135 644620667
3705.1 644620667 644646606 644533310 646777496 649847641 642919998 646191559 651547852 641625595 645535278
3713.8 645535278 649639893 650104980 651093521 653032379 654386597 650571518 650925598 656448288 653214111
3722.5 653214111 649719849 654613419 655991135 656016693 653940430 654196548 657574005 658105469 662413101
3731.2 662413101 659176178 652259674 659971466 659374313 653386078 657089767 658524399 657237701
3738.9 657237701 659103317 662203293 659549408 662346039 672555313 665509033 650153656 658338699
3746.6 658338699 663706512 667872925 663407593 655403748 665464325 660353088 655046539 661697540
3754.3 661697540 665731277 667971268 663041000 665716782 671502380 664477615 663283844 667469101
3762 667469101 668900833 668453903 670482101 668379669 664879913 668396606 672752457 672677536 665002289
3770.7 665002289 666884918 669971542 669841080 670524139 669972687 670816727 671362534 673498764 673722916
3779.4 673722916 667114029 669254074 670919952 671620483 673745728 671266403 670955582 672794571 673657990
3788 673657990 673928528 673486404 673541946 673568954 673832397 673222809 674026184 676512985 672979965 670847549
3797.7 670847549 673704376 676521301 680746155 674562302 664814987 669232483 672325134 676032791
3805.4 676032791 680057526 671272430 669104080 674650192 676295090 675830231 676320267 676178513 676527634
3814.1 676527634 681083145 679962540 668052368 672509308 678296585 682314301 682817078 669460297
3821.8 669460297 671154709 675004120 676051636 678140335 677382660 673027802 674124374 676794739
3829.5 676794739 679778214 681181564 674233551 676411896 682062378 676272278 675406799 681633759
3837.2 681633759 674687195 671943054 678736649 674659576 674712143 680547028 678232346 674809952 676723022
3845.9 676723022 677955780 678037567 679063797 678121262 679928055 684573746 678793564 679292831 667268906
3854.6 667268906 668819199 678171768 677228546 676326218 678561935 680119476 681916122 676715393 676570511
3863.3 676570511 682667007 678529282 673827515 677177887 681423264 685631714 677619171 669716110
3871 669716110 673442001 678872299 681941071 673609848 674034958 678036346 678471832 680363464 683233948
3879.7 683233948 678216629 673168106 678303604 679412537 680470276 683689880 672969513 674566422
3887.4 674566422 678235321 678707352 682256622 682042160 675755920 676553726 678454514 677044983 678291245
3896.1 678291245 678460312 680307922 682425690 674489441 678649597 679651642 675847321 680391006
3903.8 680391006 677270508 675957413 676252594 676573181 678242187 678128052 678343201 678801270 679535522
3912.5 679535522 679286041 678587418 679207611 680144577 677086182 674656525 678503647 678475342 675505981
3921.1 675505981 677395020 679029922 679850845 677879944 675483398 677248306 678974304 679504242 678004761
3929.8 678004761 677161942 678862076 677248917 675818024 676837540 677106094 677526398 677786789 677783356
3938.5 677783356 677721100 677555237 678447800 678947678 675661392 674653168 676875381 678143539 678557358
3947.2 678557358 677157440 677651749 677810593 675507202 676821518 677542038 677011871 677091827 677130661
3955.8 677130661 677195740 676900330 677333145 676614990 676989975 677593384 676360474 676393585 676302567 676612167
3965.5 676612167 677125854 677281113 677353821 676714859 676382599 676086502 675679016 676093140 677004623 676748352
3975.1 676748352 676328278 676572189 676819611 676844940 676490784 676911926 676948547 676466141 676453247 676183167
3984.8 676183167 675556030 675243912 676144714 677469330 677975235 677406921 677334137 677545853 677187576 676835632
3994.4 676835632 676049042 676016006 676466064 676714325 676857681 676951981
4000.2 676951981
##END=$$ End of the data block
