##TITLE=$$ Begin of the data block
##JCAMP-DX=5.00 $$ ACD/SpecManager v 10.08
##SPECTROMETER/DATA SYSTEM=Varian
##DATE=15 Jan 2013 10:29:28
##DATA TYPE=INFRARED SPECTRUM
##DATA CLASS=XYDATA
##ORIGIN=
##OWNER=
##NPOINTS=3735
##FIRSTX=399.26403809
##LASTX=4000.35498047
##MAXX=4000.35498047
##MINX=399.26403809
##MAXY=72.63280487
##MINY=23.95454216
##XFACTOR=1.0000000000
##YFACTOR=0.000000100000000
##FIRSTY=44.67197037
##DELTAX=0.96440572
##XUNITS=1/CM
##YUNITS=TRANSMITTANCE
##XYDATA=(X++(Y..Y))
399.3D46719704N031395k000504R46465p913437n273094J463127p003289k492332P33414
407.9D30211449P056617M833069o026382N12314J733551J743927m579621q859825J723366
416.6D28348465J029205Q09403N132332k866555m3716O041908L795052j1207123o515312
425.3D24523659K531128J407242j241761k906151Q77724J021500L451385M25835n400887
434D24689674P3395j117821j005897K761154k672234m245300J655083N593910J790962
442.7D27522926p22961J278877Q27255k302322k178268L01399j730271k23426J938057
451.3D24711266o0654n50614n99403l63731J782570p55043p598191J282616L029480
460D20878296j462250l153915k088852K086868M863815J081467p82661J705932M03176
$$ y = [446719704, 451751099, 449750595, 450697060, 442783623, 437510529, 438973656, 431970367, 429478035, 430211449, 437268066, 442101135, 436074753, 436587067, 438320618, 440064545, 435484924, 426625099, 428348465, 429377670, 430187073, 435319405, 432452850, 432409134, 438451042, 442246094, 431038971, 424523659, 427054787, 428462029, 427220268, 424314117, 425191841, 426213341, 429664726, 430090561, 424689674, 424763069, 423645248, 422639351, 425400505, 422728271, 418482971, 420138054, 425731964, 427522926, 426799965, 428078842, 428906097, 426603775, 424425507, 424726906, 422996635, 422773209, 424711266, 424650612, 424099998, 423500595, 423136864, 424919434, 424164391, 416566200, 417848816, 420878296, 419416046, 416262131, 414173279, 416260147, 421123962, 422205429, 421422768, 423128700, 423531876]
468.7D23531876l167534j103020J997223k996712m333153j300277k991982j056556
476.4D08579865J416587K795945O35566l50876R21021m396095m566155J502113K464486
485.1D09002457o63185K702827K822227k803268J601448J484261m095803l615722n95818
493.8D05839424L572540J168595k032967j500702R08280K005119j83258j726837k848473
502.5D05201721J386032J451798p86400K29568q34045O12946J751785r67178k750931
511.1D05295296k070389M26941O41136j753502j924782j867981j39579P30094k317199
519.8C97020035j55716O23436p72934N51529K51198P83424J183243K40898k025833
528.5C97699280k522431m92744j91078P51152L11546J448288K087822m25072l33175
$$ y = [423531876, 420364342, 419261322, 421258545, 418261833, 413928680, 412628403, 409636421, 408579865, 409996452, 412792397, 413427963, 413077087, 413998108, 409602013, 405035858, 406537971, 409002457, 408339272, 411042099, 413864326, 411061058, 412662506, 414146767, 410050964, 406435242, 405839424, 409411964, 410580559, 408547592, 407046890, 407955170, 409960289, 409777031, 408050194, 405201721, 406587753, 408039551, 407253151, 407482719, 406648674, 407261620, 409013405, 408046227, 405295296, 403224907, 403651848, 404292984, 402539482, 400614700, 398746719, 398607140, 399337234, 397020035, 396864319, 397487755, 396714821, 397266350, 397517548, 398300972, 399484215, 399725113, 397699280, 395176849, 394684105, 394493027, 395244179, 395555725, 397004013, 399091835, 398666763, 398333588]
537.2C98333588o6910j653824k205658r52911l5439o04133q35762O90383l11546j390915
546.8C90966873R00231M06875J83563j426010k144966n00069j176033J89248J64680
555.5C87564392K43683O87599K40936M13247j159020k43111J12992k85835K15682j234359
565.1C86556206r66912N79987L29933j12915q1329l93944J237564R23462n01404j61972
574.8C87408676j221046j881676j399879p0305j13716N8250J271858P66411M03519
583.5C85222092j003685J05209P57866P56226R71641p38029J65748J4305N63355J574096
593.1C88388824K65198m09622n07050J324387J976357Q25080r54246k528381k225876
601.8C86154671l38021J960831J032372p11632p68967O5117l08228j287498q04901
$$ y = [398333588, 398266678, 396612854, 394407196, 393454285, 393418846, 392814713, 391978951, 392669334, 392357788, 390966873, 391867104, 392273979, 392457542, 391031532, 388886566, 388386497, 387210464, 387399712, 387564392, 387808075, 388495674, 388736610, 389149857, 387990837, 387747726, 387860718, 387574883, 387790565, 386556206, 385589294, 386169281, 386499214, 386386299, 386304970, 385911026, 387148590, 388072052, 387570648, 387408676, 386187630, 384305954, 382906075, 382835770, 382722054, 382780304, 384052162, 384818573, 385222092, 384218407, 384323616, 385081482, 385837708, 386809349, 386071320, 386237068, 386251373, 386814728, 388388824, 388654022, 388244400, 387737350, 389061737, 391038094, 391863174, 390908928, 388380547, 386154671, 385816650, 387777481, 388809853, 388098221, 387329254, 387394371, 387086143, 385798645, 384993744]
610.5C84993744J61247J259766L40004j756630k221909K51160K022934J226005K70462
619.2C86546783q27293O26526K271118J589813p61451j622315n19981k15874K041435
627.8C89128761K429085J234474J922837K271728J849556J049309J248665Q48426K78664
636.5D02261505M11797N28297P62978J328926K416839J918488P26242O8436Q03489
645.2D11226997Q87185m65622j13259O82945J321946M65469M01649J882020P54356
653.9D17043686P06901J603394N64919k45896j35536j81809o43310n91965n01556K19574
663.5D17838402N30090O18172J667442J427193r06067l76892l31612K12021O93398
672.2D21372147q1635K77519J853829J821174R86367J159439J785278K305374Q21533
$$ y = [384993744, 385154991, 386414757, 386754761, 384998131, 382776222, 383027382, 385050316, 386276321, 386546783, 385719490, 386346016, 388617134, 390206947, 389445496, 387823181, 387303200, 387087326, 389128761, 391557846, 392792320, 394715157, 396986885, 398836441, 399885750, 401134415, 401982841, 402261505, 402673302, 403201599, 403964577, 405293503, 407710342, 409628830, 410355072, 410423508, 411226997, 412114182, 411648560, 411535301, 412218246, 413540192, 414005661, 414407310, 416289330, 417043686, 417750587, 419353981, 419918900, 419673004, 419537468, 419355659, 418712349, 418120384, 417618828, 417838402, 418368492, 418986664, 420654106, 422081299, 421175232, 420798340, 420466728, 420678749, 421372147, 421290512, 421568031, 423421860, 425243034, 426229401, 427388840, 429174118, 431479492, 432301025]
680.9D32301025p80105L42407J575775J072045l13645M24194K356263J860008O62765
689.6D39500732L56789R45969J052246K44331l17840j097908K8343J511192M75617
698.2D42699471N60951J364135J163369J355743J497421Q60558R7923L20702N09300
706.9D50429573L71323K95105P5340J097412J273079L73726J694603K687797L97530
715.6D58695488j032982O77223R23119n42984q60100O80466J664810Q50525J290550
724.3D62346115K109070J824722J088982O63605O97860L13340O05888L13530n50537
733D69412575o8779K004051K046356p4425P58782J442375R87053R78470k87094j326752
742.6D75872612k08550P16706N7220R85871J631317J821289J267204L68958Q46405
$$ y = [432301025, 431520920, 431863327, 433439102, 434511147, 434197502, 434621696, 436977959, 438837967, 439500732, 439857521, 440803490, 441855736, 442100067, 441782227, 440684319, 440712662, 442223854, 442699471, 443260422, 444624557, 445787926, 447143669, 448641090, 449501648, 449599571, 449920273, 450429573, 450800896, 451096001, 451171341, 452268753, 453541832, 453915558, 455610161, 458297958, 458695488, 457662506, 458339729, 459262848, 458719864, 457859764, 458540230, 460205040, 461055565, 462346115, 464455185, 466279907, 467368889, 468032494, 468730354, 469043694, 469649582, 469963112, 469412575, 469343796, 471347847, 473394203, 473319778, 474078560, 475520935, 476507988, 477486458, 477199364, 475872612, 475664062, 476380768, 476437988, 477423859, 479055176, 480876465, 482143669, 482512627, 483359032]
751.3D83359032M4098N08232n61409j633759Q70629K086639J967888J964187L162423
760D91767960J767425M8180K77405o35834j79520l93257l89481R9984J21498M46548
769.6D92930908N67131Q38280N17540R71832Q30269M02336L3303j014023j235352p27501
779.2D94114723p6752L03116J591111J334114Q84208J466866Q00781k07100q90960
787.9D99320107K25410J5984m24881l51906o68717J21918Q83675J232643l43743m2495
797.6D99967995O7978p92466r70611k497406k150650k395439j629868j093521q29773
806.2D87676239p7591j065102L46871j084099k983971k364044k231064j307296j866951
814.9D75042992k112580j498146k58407O85081L12729K70844J005401K057686J293106
$$ y = [483359032, 483403130, 483911362, 483349953, 481716194, 482586823, 484673462, 486641350, 488605537, 491767960, 493535385, 493583565, 493860970, 493225136, 493045616, 492652359, 492262878, 492362862, 492484360, 492930908, 493498039, 494336319, 494853859, 495825691, 496655960, 497058296, 497091599, 496077576, 494842224, 494114723, 494037971, 494341087, 495932198, 497266312, 498150520, 499617386, 500418167, 500211067, 499320107, 499545517, 499561501, 499136620, 498784714, 498115997, 498237915, 499121590, 500354233, 500010490, 499967995, 500035973, 499243507, 498272896, 495775490, 493624840, 491229401, 489599533, 488506012, 487676239, 487598648, 486533546, 486880417, 485796318, 482812347, 480448303, 478217239, 476909943, 475042992, 472930412, 471432266, 471173859, 471858940, 472171669, 472442513, 473447914, 475505600, 476798706]
823.6D76798706L32489p35130j23101K080880K397575K682724K943649L834343L820801
832.3D94032936K846756K098579J111870J249504J389275J844292K017593K112427
840E08703232K247886K263413J430626J382179L094978K147294J194648Q83026O29006
848.7E23976288M06151J13334Q10242J838188K874413J546898K248916L323746K430878
857.4E39569054K267532J195335M65088p76443q507P29561O11839J219521N27038M75273
867E46275291M16337o2638j748619j809273j831741k938309k436523j664925o26182
875.7E33573418o49720O42930Q69293L26118K70653p51877m66232k151337k121239
884.4E29542007j035728j146088q74176o75239M13170J31149L4637m120L11318j62010
$$ y = [476798706, 477131195, 476396065, 476272964, 478353844, 480751419, 483434143, 486377792, 490212135, 494032936, 496879692, 498978271, 500090141, 501339645, 502728920, 504573212, 506590805, 508703232, 510951118, 513214531, 514645157, 516027336, 519122314, 521269608, 522464256, 523347282, 523976288, 524382439, 524495773, 525306015, 527144203, 530018616, 531565514, 533814430, 537138176, 539569054, 541836586, 543031921, 543497009, 542720566, 542712059, 543441620, 544053459, 545272980, 545800018, 546275291, 546691628, 546628990, 544880371, 543071098, 541239357, 538301048, 535864525, 534199600, 533573418, 532923698, 533566628, 534435921, 534762039, 535032692, 534280815, 533814583, 531663246, 529542007, 528506279, 527360191, 526486015, 525810776, 526223946, 526355095, 526389732, 526385612, 526696930, 526534920]
894E26534920r12819n60074j331902l64952n30586o49185M06380L65409L89901M95071
903.7E23842163J343803J239014J500855J005554L34930L1243J297J130180J37863
912.3E30566902N17349L84598l94363l51830j385536k508583l758698l326339l630409
921E16113091l267479k871705k017440j045876k341537j966706k377052k303238k792892
929.7D95129166l586693k495346k651558k127533j629868p72972m30717P0801L68385
938.4D81873665o39000o1112q44078j166839j360398j977310j656456j128235k43568
947.1D72796669m49562R58710N16624q00552J220o16836j173821k520828k734260k312127
956.7D63665237k449417j915092k232323j898041j572647j521759j235542j802101
$$ y = [526534920, 525622101, 525062027, 523730125, 523365173, 522834587, 522185402, 522591782, 522957191, 523347092, 523842163, 525185966, 526424980, 527925835, 528931389, 529266319, 529297562, 529298859, 530429039, 530566902, 531084251, 531468849, 531074486, 530722656, 529337120, 526828537, 523069839, 519743500, 516113091, 512845612, 509973907, 507956467, 506910591, 504569054, 502602348, 500225296, 497922058, 495129166, 491542473, 489047127, 486395569, 484268036, 482638168, 481865196, 481434479, 481505280, 481873665, 481234665, 481173553, 480329475, 479162636, 477802238, 475824928, 474168472, 473040237, 472796669, 472347107, 473305817, 473822441, 473021889, 473023109, 472406273, 471232452, 468711624, 465977364, 463665237, 461215820, 459300728, 457068405, 455170364, 453597717, 452075958, 450840416, 449038315]
964.4D49038315k482948k668725k545356j864815j077194j637383k135505j401902
972.1D33224487j373520k345962k256355k195855l314323l298645l382378l716354
979.8D11341095l134422l729668m232445l564186l851280m770813m511528l096657
987.6C80450096l567238m805183m851036m763336l624726l702049m056892l419304
995.3C47660332l160019l092880l032227k534218k777595k404518k868233k920876
1003C24869766j948433k061233j402092j383114q42762q93326j318188j493797j769009
1011.7C11757812j333656k034759j984005k129975j646366k002735k929783j976414
1019.4B95720119j841583j381340j974792j479111j552448k791386k451191j719780
$$ y = [449038315, 446555367, 443886642, 441341286, 439476471, 438399277, 436761894, 434626389, 433224487, 431850967, 429505005, 427248650, 425052795, 421738472, 418439827, 415057449, 411341095, 408206673, 404477005, 400244560, 396680374, 392829094, 388058281, 383546753, 380450096, 376882858, 372077675, 367226639, 362463303, 358838577, 355136528, 351079636, 347660332, 344500313, 341407433, 338375206, 335840988, 333063393, 330658875, 327790642, 324869766, 322921333, 320860100, 319458008, 318074894, 317232132, 316338806, 315020618, 313526821, 311757812, 310424156, 308389397, 306405392, 304275417, 302629051, 300626316, 297696533, 295720119, 293878536, 292497196, 290522404, 289043293, 287490845, 284699459, 282248268, 280528488]
1027.1B80528488p47471j944961j450730j328430j460609q14152r99813K10724J05591
1035.8B72098637R45911L45192j54343P26567O94618O66275O52828J575050K85378
1044.5B77836113M58183m14486r29603K73418r57794J8902m84848r15070j781673j321793
1054.1B71781349N24044r21573n60780m91829O12011J130467J351451J820603J306438
1062.8B76552181J142044N55840K108536J323452J294345J876812J457425J271667
1070.5B87582302K94094R59225r6359N44757N78690M73328N96695p34387J027889N96638
1080.1B91822872J074467J527538J486950J791363R88483J485062P17621J415119J562672
1088.8C03872147J756420J626053J343364K140313Q58497J418514J688977J844577
$$ y = [280528488, 279781017, 277836056, 276385326, 275056896, 273596287, 272782135, 271782322, 271993046, 272098637, 273044548, 273389740, 273235397, 273961964, 274656582, 275322857, 275975685, 277550735, 277836113, 278294296, 277879810, 276950207, 277223625, 276265831, 276284733, 275799885, 274884815, 273103142, 271781349, 272305393, 271383820, 270823040, 270331211, 270943222, 272073689, 273425140, 275245743, 276552181, 277694225, 278250065, 280358601, 281682053, 282976398, 284853210, 286310635, 287582302, 287876396, 288835621, 288739262, 289284019, 289862709, 290336037, 290932732, 290198345, 291226234, 291822872, 292897339, 294424877, 295911827, 297703190, 298691673, 300176735, 300894356, 302309475, 303872147, 305628567, 307254620, 308597984, 310738297, 311596794, 313015308, 314704285, 316548862]
1096.5C16548862J751328J364632J497898R35936J312370J069984J829529J246681
1104.2C27557220O83632J494980J412697J614876J051178Q96339M4747M56733J397133
1112.9C36609535R53102M82064J65519J106148O66657J20811j28250N01099O65893
1121.6C41142578k01874M31786l07999k82249m7035O20460Q92182R44175K427635J064225
1131.2C46683884J632080K823753K022362J479912J384849J706085J164513J425705
1139C60323143J436424J241226R08356J592865K482796J149711Q52776Q80280K70614
1147.6C71138191p17201n50194K02866k76070J20697M39186M70467j16730l09524L395
1157.3C70405083n07279o43768j007919j264878j028022j92299Q2168N31693J368179
$$ y = [316548862, 318300190, 319664822, 321162720, 322098656, 323411026, 324481010, 326310539, 327557220, 328240852, 329735832, 331148529, 332763405, 333814583, 334710922, 334755669, 335212402, 336609535, 337562637, 338044701, 338210220, 339316368, 339983025, 340103836, 339975586, 340476685, 341142578, 340940704, 341372490, 341064491, 340782242, 340735207, 341355667, 342247849, 343192024, 345619659, 346683884, 348315964, 351139717, 353162079, 354641991, 356026840, 357732925, 358897438, 360323143, 361759567, 363000793, 363909149, 365502014, 367984810, 369134521, 369987297, 370867577, 371138191, 370420990, 369870796, 370073662, 369797592, 369918289, 370357475, 370827942, 370711212, 370401688, 370405083, 369897804, 369254036, 368246117, 366981239, 365953217, 365760918, 365843086, 366374779, 367742958]
1166C67742958J842804K499771J764527K155914K012558J385269J922340J483231K012176
1174.6C84821548K965622L063240L119469L486824L332596L075714K513199K223930
1182.4D08602142K129517O14548J00288O78368J510505J992417J715698J538925P21779
1191D19604187L55415L29934k11106o97098j536407j812096j289062j094284n60265
1199.7D13089218j51710k15378m62952p82814m37469p61643j796989j750870j247253
1208.4D05482140r96399r84269n51719J43776K72064M80270J97296l41453j106987
1217.1D02594719j311874q54569j326790j149750p54280l70941R2964J5183M9171m10995
1226.7C96572838k52800l12882p51800j237946j813774j393127j234093m80957K75269
$$ y = [367742958, 369585762, 372085533, 373850060, 376005974, 378018532, 379403801, 381326141, 382809372, 384821548, 387787170, 390850410, 393969879, 397456703, 400789299, 403865013, 406378212, 408602142, 410731659, 411346207, 411446495, 412124863, 413635368, 415627785, 417343483, 418882408, 419604187, 419959602, 420289536, 420078430, 419381332, 417844925, 416032829, 414743767, 413649483, 413089218, 412937508, 412722130, 412259178, 411476364, 411038895, 410277252, 408480263, 406729393, 405482140, 404485741, 403501472, 402949753, 403093529, 403365593, 403845863, 404043159, 403701706, 402594719, 401282845, 400428276, 399101486, 397951736, 397197456, 396826515, 396919479, 396934662, 396983833, 396572838, 396320038, 396007156, 395255356, 394017410, 392203636, 390810509, 389576416, 389095459, 389370728]
1235.4C89370728L23371K95983N18799O46171l71094q12377j016198j033973j056099
1244.1C86865311q26149k80953l92113L80097L40691M71496O18477j10092k71950o37283
1253.7C86157532o31790j069947p35626j07155P5379P91511O53954R24492J273040
1262.4C87331390J175919O44722L35922R232n08194J40114N42411J087418J634750
1271.1C92393684J843033K089043J775284J526527J506653J142654O90499M03785M49028
1279.8D03820190J129532J236611J433906K168274K425575K453309K070884J851883
1287.5D18590164J212692M59214L00483K16103J96762P47185J373100J486740J818009
1296.2D26400452K024269J540375O92558K12593l32642n41191m60777o72913q1367
$$ y = [389370728, 389694099, 389990082, 390508881, 391155052, 390783958, 389971581, 388955383, 387921410, 386865311, 386039162, 385758209, 385366096, 385746193, 386086884, 386558380, 387176857, 387066765, 386794815, 386157532, 385525742, 384455795, 383720169, 383613014, 383688393, 384479904, 385133858, 386058350, 387331390, 388507309, 389152031, 389487953, 389497185, 388988991, 389129105, 389671516, 390758934, 392393684, 394236717, 396325760, 398101044, 399627571, 401134224, 402276878, 402967377, 403371162, 403820190, 404949722, 406186333, 407620239, 409788513, 412214088, 414667397, 416738281, 418590164, 419802856, 420262070, 420562553, 420778656, 420975418, 421722603, 423095703, 424582443, 426400452, 428424721, 429965096, 430657654, 430870247, 430537605, 429996414, 429535637, 428862724, 428781357]
1304.8D28781357L65257M65469O46401Q07800P07283L37181j91192r68666r30100j162605
1314.5D28858185r77707m00734K5787M27666O32248K036819K201310J236381L94020
1323.2D34433975P8354L28941j66778j50948m69360m66538K67411O65588O06499J92146
1332.8D35319290K90337l21808o83861j144142j297417o78863n35240L4675M46816
1341.5D31429787J056671J423416J641197J740074J159058M02985o83938o91299p78351
1350.2D36699600n66826o09092m20609M78821M19464N51910J96076M62646j13639j138382
1359.8D35959969j383515j309433n84373k001839l35388K57568j78146O33125J14861
1368.5D31172829j11618n05028n43480n08499r03130j312599r98688N07584K50091
$$ y = [428781357, 429146614, 429612083, 430258484, 431066284, 431773567, 432110748, 431919556, 430950890, 430020790, 428858185, 427880478, 427479744, 427505531, 427933197, 428565445, 430602264, 432803574, 434039955, 434433975, 434512329, 434841270, 434674492, 434523544, 434054184, 433587646, 433855057, 434520645, 435127144, 435319290, 435609627, 435287819, 434603958, 433459816, 432162399, 431483536, 430948296, 430982971, 431429787, 432486458, 433909874, 435551071, 437291145, 438450203, 438853188, 438169250, 437477951, 436699600, 436132774, 435523682, 435103073, 435581894, 436001358, 436553268, 436749344, 437211990, 437098351, 435959969, 434576454, 433267021, 432682648, 430680809, 430345421, 430602989, 430424843, 431057968, 431172829, 431061211, 430556183, 430012703, 429504204, 428601074, 427288475, 426289787, 426797371, 427047462]
1377.2D27047462L59688O08063O60172K98461o72683r46465j622543j483078j416245
1385.8D22832832j733055k536316m93393N68428o48346p53097j035919j087876k223358
1394.5D12889900k986793j588402k157211j618004l006935k485581q35876j410179
1402.2C96800919j238671r16099j578293j917839j097412j788559k538872k046890
1409.9C83678284j818886j201210r01299o21948n79834q36983m60014k67258M83666
1418.6C77474518j433792p21474N50575j86691J70822j70021J209831J305161Q31642
1427.3C79030571J535873Q24776O37627N48057J218300J179733N78423O84891M05884
1436C86644135O91871J607781K722435J669921J458130J711312Q80127J065559J2207
$$ y = [427047462, 427407150, 428015213, 428675385, 428973846, 428301163, 427354698, 425732155, 424249077, 422832832, 421099777, 418563461, 418070068, 418638496, 417990150, 417237053, 416201134, 415113258, 412889900, 409903107, 408314705, 406157494, 404539490, 401532555, 399046974, 398211098, 396800919, 395562248, 394646149, 393067856, 391150017, 390052605, 388264046, 385725174, 383678284, 381859398, 380658188, 379756889, 379134941, 378555107, 377718124, 377258110, 376990852, 377474518, 376040726, 375319252, 375869827, 375683136, 375853958, 375683937, 376893768, 378198929, 379030571, 380566444, 381391220, 382028847, 382576904, 383795204, 384974937, 385553360, 386238251, 386644135, 387336006, 388943787, 391666222, 393336143, 394794273, 396505585, 397385712, 398451271, 398463478]
1444.7C98463478L73879L54576P6217M53034J454658K008477J379547J814346N81627
1453.3D06959839J193580J282769k15569j001510J06811M022331J851426K774848K134438
1462D19108963J677513K593537P79685K371636J762009K086944J809349J437874K190399
1470.7D35817909Q60634K292557L119850M552002L907700K536735K818184K924843
1478.4D58830414K274856J379471J308098J308518J349258J251335J535034J917305
1486.1D71154289J172066J122589J684113k90795n73997N80559r8649j297264j698265
1494.8D71754646j528396m536362K594n46303j543007L56026r42764j326561j480217
1503.5D60209656q69179k131119p760277l607940K229194K512551m01879O43120k37999
$$ y = [398463478, 398837357, 399191933, 399268150, 399721184, 401175842, 403184319, 404563866, 406378212, 406959839, 408153419, 409436188, 409220619, 408219109, 408325920, 412348251, 414199677, 416974525, 419108963, 420786476, 423380013, 424159698, 426531334, 428293343, 430380287, 432189636, 433627510, 435817909, 436678543, 438971100, 442090950, 446642952, 450550652, 453087387, 455905571, 458830414, 461105270, 462484741, 463792839, 465101357, 466450615, 467701950, 469236984, 471154289, 472326355, 473448944, 475133057, 474842262, 474268265, 474848824, 474750175, 473452911, 471754646, 470226250, 465689888, 465692482, 465146179, 463603172, 463959198, 463016434, 461689873, 460209656, 459340477, 457209358, 449449081, 445841141, 448070335, 450582886, 450181007, 450824127, 450586128]
1512.2D50586128j038208j87721j746483j863975l476296k087440J598777R06716k023735
1520.8D40667763l59612J681595R29833K062912J93862K83890K65465K8038J075439
1529.5D46829185K75460R8800J73684K97355K61231K142448J730156R58061J458435
1538.2D54224815k115898k477913J061478L34549p6141J447143J441345M34876K535744
1546.9D56809998J586990J154518j27907o75773J598243L55835J13297j899529Q18062
1555.6D59733734J966210J222229q53196p388382L267174J834335J425095o28166j668587
1564.2D58910446l105659k130699r39484j900864r02710o571274J10856k4796k748718
1572.9D40697098k534180l109398k393951j0619240r63058k544938l987617k972145
$$ y = [450586128, 449547920, 449360199, 447613716, 445749741, 442273445, 440186005, 441784782, 442691498, 440667763, 440308151, 441989746, 442919579, 444982491, 445176353, 445460243, 445725708, 445753746, 446829185, 447104645, 447203445, 447377129, 447674484, 447935715, 450078163, 451808319, 452766380, 454224815, 452108917, 449631004, 450692482, 451027031, 450950890, 452398033, 453839378, 454274254, 456809998, 458396988, 459551506, 459423599, 458747826, 460346069, 460701904, 460815201, 458915672, 459733734, 461699944, 462922173, 462068977, 454680595, 457947769, 459782104, 461207199, 460579033, 458910446, 455804787, 453674088, 452734604, 450833740, 449931030, 443359756, 443470612, 443445816, 440697098, 438162918, 435053520, 432659569, 422040329, 421077271, 418532333, 414544716, 411572571]
1580.6D11572571m077835k788964m560432l049431m779320m344215m372139n390320
1588.4C78209915l436050n705223l322678m895630l318748l783646m335136k246437
1596.1C47166367m464150k189217m549369k699814l829308l856964k252426l994236
1603.8C19330883j252975l142586r87911l251343j875706j074371k593212j20831l128052
1612.5C01903896o56223k476654l88222o28967m914913K586059p80792R85909j494255
1621.1B94135838O73923n17960k253418J541081p09305J428471j721020J188679M81300
1629.8B94247589Q63514J732101j05705J951695o59275J72920n6858K629757J329384
1638.5C02105122Q65421J870918K7332K942734P83539J825810J358947r403K398510
$$ y = [411572571, 407494736, 404705772, 400145340, 397095909, 392316589, 387972374, 383600235, 378209915, 374773865, 369068642, 365745964, 360850334, 357531586, 353747940, 349412804, 347166367, 342702217, 340513000, 335963631, 333263817, 329434509, 325577545, 323325119, 319330883, 318077908, 314935322, 313947411, 310696068, 308820362, 307745991, 305152779, 305031948, 301903896, 301247673, 298771019, 298382797, 297753830, 292838917, 295424976, 294644184, 295630093, 294135838, 294809761, 294291801, 292038383, 293579464, 292870159, 294298630, 292577610, 293766289, 294247589, 295111103, 296843204, 296737499, 298689194, 298029919, 298202839, 298145981, 300775738, 302105122, 302970543, 304841461, 304868793, 307811527, 308595066, 310420876, 311779823, 311770420, 314168930]
1647.2C14168930j220303L219147l8414J933518J502266k132435K360935N66311M194679
1655.9C24554634J061630K355194J090622J537896J757774J149635K494087K21749
1663.6C36223221L757171K323342K967071K772522K100334M017640K275200M366264
1671.3C60802765J691170L709793L146934K318459L403778L448524M812317K974396
1679C86308136M757500L950348M503021M326401K84462M918861L022003O328316M046783
1687.7D22445831L881226M747887M662513N728035M692726N107346M267693L939743
1695.4D59473000J839065N680275N960693M742203L897782N86509P221337N699043
1703.1D95099907N284882M047241K687034L512726L492890L431663J849136J672669
$$ y = [314168930, 312948627, 316167774, 316129360, 318062878, 319565144, 317432709, 319793644, 320359955, 324554634, 325616264, 327971458, 329062080, 330599976, 332357750, 333507385, 336001472, 336223221, 339980392, 342303734, 345270805, 348043327, 350143661, 354161301, 356436501, 360802765, 362493935, 366203728, 369350662, 371669121, 375072899, 378521423, 383333740, 386308136, 391065636, 395015984, 399519005, 403845406, 404129868, 409048729, 412070732, 418399048, 422445831, 426327057, 431074944, 435737457, 441465492, 446158218, 451265564, 455533257, 459473000, 461312065, 466992340, 472953033, 477695236, 481593018, 482179527, 489400864, 495099907, 500384789, 504432030, 507119064, 510631790, 514124680, 517556343, 519405479, 521078148]
1710.8E21078148K153168K158813K395630J665306L082657M408493K795258l187027
1718.5E36550446K861595K855453J312332J001702K56500Q87413K104416K483520K153283
1727.2E52466660K362785K448196J12839Q58002K882766J694069l218155k782287M981346
1735.9E61806221L998566K949905L697891J671677J150780M519004K598267Q22945
1743.6E83215256J986694K642670K065201K122535K971154K554588N302887L778305
1751.3F06639290L255882N565529L027458K808533K728844n19295J434250K813835
1759F27754326K984733L618203R48257K012596M329224K559509K284241K329712J095123
1767.7F49915924k227096J090774K700043n94101j172867P22809N045242L747482J203385
$$ y = [521078148, 523231316, 525390129, 527785759, 529451065, 532533722, 536942215, 539737473, 536550446, 539412041, 542267494, 543579826, 544581528, 544838028, 545725441, 547829857, 550313377, 552466660, 554829445, 557277641, 557390480, 558248482, 561131248, 562825317, 559607162, 556824875, 561806221, 565804787, 568754692, 572452583, 574124260, 575275040, 579794044, 582392311, 583215256, 585201950, 587844620, 589909821, 592032356, 595003510, 597558098, 602860985, 606639290, 609895172, 615460701, 618488159, 621296692, 624025536, 623506241, 624940491, 627754326, 630739059, 634357262, 635305519, 637318115, 641647339, 644206848, 646491089, 648820801, 649915924, 647688828, 648779602, 651479645, 650885544, 649712677, 650435486, 655480728, 659228210, 660431595]
1776.4F60431595K826767J182709Q18176m42734j926804L30277J491013J718673N53742
1785.1F66983414J772537K715378J985626J286392J512528m44107j178360k322312
1792.8F72311096m66232L436432P97577L37677K417144K936173K022781K48871K059326
1801.5F86100845n13458j42517P84912n26123N1422P3776Q29468J830139K735215P55767
1811.1F91979446J427460J907349L65906M18396j186066p36389j029435K92206J137619
1819.8F94576492P27387K130432J123886K044907J730041r56497n2033M91333P4006
1828.5G01889954k104798l837356J512069L457718J518021J438904J910400J566315
1836.2G07351227O80466q34198M85610j050262r30405p86895N91812J274414l791733
$$ y = [660431595, 663258362, 664441071, 665259247, 664816513, 662889709, 663219986, 664710999, 666429672, 666983414, 668755951, 671471329, 673456955, 674743347, 676255875, 675811768, 674633408, 672311096, 671844864, 675281296, 676078873, 676416550, 678833694, 681769867, 683792648, 684041519, 686100845, 685587387, 685444870, 686229782, 685703659, 685755081, 685828857, 686658325, 688488464, 691223679, 691979446, 693406906, 695314255, 695680161, 696098557, 694912491, 694176102, 693146667, 693438873, 694576492, 695303879, 697434311, 698558197, 700603104, 702333145, 701376648, 701324615, 701815948, 701889954, 699785156, 695947800, 697459869, 700917587, 702435608, 703874512, 705784912, 707351227, 708031693, 707197495, 707683105, 706632843, 705702438, 704915543, 705507355, 706781769, 702990036]
1844.9G02990036L476639L623886J152573N78994K30942j65253j514129n07889p35245
1853.6G09130554N0659M33350P60880J716995J029358J583862R24072O33927n56794
1862.2G15706863q77533p87963j071091r6970o42013J090545j61819l4332K735138
1870.9G15860825K217865R16290p14951k75650j041183j020584p87583m21600Q89130
1879.6G15622559R69467J738891J078034J238785O61850l32642m69818j145554k10113
1888.3G19151459j533432k243881M75997J785050J413193J481704J295243J55410J037369
1896.9G23018112l14712p10602r97772j324234p70722p39212J034546J045685J482391
1905.6G21723480J452942J001969K58636q58231l76281j017075o34613j117554l81851
$$ y = [702990036, 706466675, 710090561, 711243134, 711822128, 712053070, 711887817, 710373688, 709865799, 709130554, 709181213, 709614563, 710375443, 712092438, 713121796, 714705658, 715629730, 716263657, 715706863, 714829330, 714041367, 712970276, 712873306, 712231293, 713321838, 713160019, 713125687, 715860825, 718078690, 718994980, 718280029, 718004379, 716963196, 715942612, 715155029, 714733429, 715622559, 716592026, 718330917, 719408951, 720647736, 721309586, 720976944, 720507126, 719361572, 719151459, 717618027, 715374146, 715850143, 717635193, 719048386, 720530090, 721825333, 721980743, 723018112, 722703400, 721992798, 720995026, 719670792, 718900070, 718160858, 719195404, 720241089, 721723480, 723176422, 724178391, 724437027, 723578796, 723202515, 722185440, 721550827, 720433273, 720051422]
1914.3G20051422K899O38581K374038j50985P72476J726379L94058p50351k393188
1923G22665329j672516m37927K10342j47400R26896J249389J088791J224747N47027
1931.7G25654678O73371q73184j035309j258622j277084q54797m20990J125793O98624
1940.3G22432480J428909O86798q6670J059189J16806j018982j654205q15735r19571
1949G21229019m78973n3940K93884J396103J181717J359940O57272L72620j091538
1957.7G24866104j866455q90732j089935o57806l95966O67648P68662J170120J623535
1966.4G24195175L39966J8692k00958m22592j548996j226883o70395n38178L57666
1975.1G20303497N59616J336441J190720J040039J67847k91443m83399j271743j145020
$$ y = [720051422, 720054321, 720692902, 723066940, 722915955, 723688431, 725414810, 725808868, 725058517, 722665329, 720992813, 720554886, 720765228, 720617828, 721544724, 722794113, 723882904, 725107651, 725654678, 726328049, 725454865, 724419556, 723160934, 721883850, 721029053, 720608063, 721733856, 722432480, 723861389, 724548187, 724461517, 725520706, 725637512, 724618530, 722964325, 722148590, 721229019, 720750046, 720696106, 720989990, 722386093, 723567810, 724927750, 725585022, 725957642, 724866104, 722999649, 722108917, 721018982, 720361176, 719965210, 720632858, 721401520, 722571640, 724195175, 724535141, 724553833, 724352875, 723930283, 722381287, 721154404, 720484009, 719945831, 720303497, 720863113, 722199554, 723390274, 724430313, 724598160, 724306717, 723823318, 722551575, 721406555]
1983.7G21406555j605530n74035j31226O96945J227265P09305J780700O45142n90897
1992.4G23564224j040268p39898p59659j494293r04084m89349L28140Q88138J495438
2001.1G20848389J130218P03888M43649p20977j050721j665496j227036j139069m98733
2009.8G16824112N19943O01883J222077Q72039R22547L16162k69928j058731j303253
2018.5G18646851r85566j511154m97131j28327O18973R10721J020660J418839J94321
2027.1G19688187j80817j002274j018219j242752j388015q06427m58985O70243O90002
2035.8G14950943J191635R25903M44336L11356l77045q36639j632919j374360j290893
2044.5G12312317k69775K96707P94143J342545O63986J096573J35193l61633q42667
$$ y = [721406555, 719801025, 719226990, 719095764, 719792709, 721019974, 721729279, 723509979, 724155121, 723564224, 722523956, 721784058, 721024399, 719530106, 718626022, 718136673, 718464813, 719352951, 720848389, 721978607, 722682495, 723126144, 722405167, 721354446, 719688950, 718461914, 717322845, 716824112, 717344055, 717945938, 719168015, 720040054, 720962601, 721278763, 721008835, 719950104, 718646851, 717661285, 716150131, 715653000, 715524673, 716143646, 717054367, 718075027, 719493866, 719688187, 719507370, 718505096, 717486877, 716244125, 714856110, 714049683, 713590698, 714260941, 714950943, 716142578, 717068481, 717512817, 717824173, 717447128, 716610489, 714977570, 713603210, 712312317, 712042542, 712339249, 713133392, 714475937, 715139923, 716236496, 716371689, 716010056, 715167389]
2053.2G15167389j597138j241226r30176j1520N2033O26754P37305R98535J021347
2061.9G14823303K85492N5924j089783j111908j283875q85391n09796k28119N70526
2070.5G10626373N17044J603241J310120O89316k67182r08203r49859j665421p03506
2079.2G10251923o63987j67999K85568P08161J474457R12323O70013k70081n00564
2087.9G12699814q89969j210938j312103j076050l63769j43280J303558R92432P35702
2096.6G10735397P02286K09351R842j317215r96399j122818j022263o37283k99072
2105.2G06261826O06842P86514J399307Q82187L30353m62952q92639q36792j226196
2113.9G06848450j063919q16803J62048J15738R83047J359406M13361M29306j29014
$$ y = [715167389, 713570251, 712329025, 711398849, 711387329, 711439362, 712066116, 712803421, 713801956, 714823303, 715108795, 715164719, 714074936, 712963028, 711679153, 710793762, 710283966, 710055847, 710626373, 711143417, 712746658, 714056778, 714746094, 714478912, 713570709, 712620850, 710955429, 710251923, 709587936, 709419937, 709705505, 710413666, 711888123, 712800446, 713470459, 713200378, 712699814, 711809845, 710598907, 709286804, 708210754, 707846985, 707703705, 709007263, 709999695, 710735397, 711437683, 711647034, 711656876, 710339661, 709343262, 708220444, 707198181, 706560898, 706261826, 706868668, 707655182, 709054489, 709936676, 710267029, 709804077, 708911438, 708074646, 706848450, 705784531, 704967728, 705129776, 705245514, 706228561, 707587967, 708001328, 708430634, 708301620]
2122.6G08301620L8453p28455j291275j321030q93860J11008N8365Q56552R60465Q15658
2132.3G06907501M96292K33078q3999q38623n19104o63529o47430p91550q6441O90689
2141.9G04696884J030350J215057L62854M37470l05481m71039n41840r63974p53021
2150.6G04707260o07757M30755K37580N52978Q32291Q74939P88116k16675l17077o81076
2160.2G06601334l22724q25729o48422K13546J64719O58951N17578J044464K72141
2168.9G07675858j3657K25372n50003m66308r61914n68390k68174J90506M07639L93372
2178.5G06064301J069870P46002L10974l66898j09405k82440p21512o28281l37143
2187.2G05745468L64609M3640M96903P41653R48791L96424j53046J5640r53445m11606
$$ y = [708301620, 708340073, 707611618, 706320343, 704999313, 704105453, 704216461, 704274826, 705131378, 706091843, 706907501, 707403793, 707636871, 707552872, 706714249, 706195145, 705531616, 704884186, 704092636, 704006195, 704696884, 705727234, 706942291, 707305145, 707742615, 707437134, 706966095, 706424255, 705460281, 704707260, 704099503, 704530258, 704767838, 705320816, 706153107, 707028046, 707816162, 707599487, 707282410, 706601334, 706278610, 705452881, 704804459, 705018005, 705182724, 705841675, 706359253, 707403717, 707675858, 707662201, 707887573, 707337570, 706871262, 705909348, 705340958, 705072784, 705263290, 705670929, 706064301, 707134171, 707880173, 708191147, 707824249, 707714844, 707432404, 706710892, 706082611, 705745468, 706110077, 706153717, 706650620, 707392273, 708341064, 708737488, 708584442, 708600082, 707646637, 707235031]
2196.9G07235031m46167j61285N5160m7607R43527M66766O48194M02298n036j11923
2206.5G08978958k16904o4010p15866o49720l83224L08304L96728N90287P32193J31073
2216.1G09107819J16500J00022L97873n92652o92520m20608n65720K86255L77197L44315
2225.8G08458481k92664M14200Q64563K71301K16599m09622m28238p99179m43573O4544
2235.4G07916412J61515j44654o6757R66568L82462J06964p3242J33895k50015p77893
2245.1G08355255J19095j43814k16599n10025L4256O41938N92269O82602J42746J17112
2254.7G09814835n58243k48490k68249n94254k55127j31607L38898j47705N01404L84140
2264.4G08835602J20392J91803l60260J30539m65546m69971k82898J10626o7749k89230
$$ y = [707235031, 706788864, 706627579, 706682739, 706635132, 707578659, 708045425, 708693619, 709095917, 709090881, 708978958, 708762054, 708698044, 707982178, 707332458, 706949234, 707257538, 707654266, 708244553, 708976746, 709107819, 709224319, 709324341, 709722214, 709129562, 708437042, 708016434, 707450714, 707736969, 708114166, 708458481, 708165817, 708580017, 709444580, 709715881, 709932480, 709522858, 709094620, 708295441, 707851868, 707916412, 708077927, 707933273, 707866516, 708833084, 709215546, 709322510, 709249268, 709383163, 709133148, 708355255, 708474350, 708330536, 708113937, 707603912, 707638168, 708280106, 708872375, 709554977, 709697723, 709814835, 709256592, 709008102, 708739853, 708145599, 707890472, 707758865, 708097763, 707950058, 708451462, 708835602, 708955994, 709147797, 708787537, 708918076, 708452530, 707982559, 707699661, 707810287, 707742538, 707453308]
2274G07453308O67267K72598J62964j02081N83191L65905p18536n32532r62143l56521
2283.7G06833420J4038M37240l8223k54440P54394N24292K27356m07486k5100n55878
2293.3G07509613j013946n87235m37775N77622j221L48435P09915M18243K66113r8877
2302.9G07690887j20163j020278o63987o08902q4304K48642k1668P09763J02615K68707
2312.6G06501312j9073j8463K11258n71366o81534m48379n44357j304474L29284P08542
2322.2G04162750L11203L43933K95792R90601r01947r34601o25916l11737k02255n90134
2331.9G02537689J56555r26513M21753J633606J165466m98123l50647M99573q45032
2340.6G03794327j073914j504211O86264Q22296m48303j6938k26898L82691O55899
$$ y = [707453308, 708120575, 708393173, 708556137, 708454056, 709037247, 709403152, 708684616, 708152084, 707189941, 706833420, 706847458, 707284698, 707246475, 706992035, 707746429, 708270721, 708498077, 708090591, 708065491, 707509613, 706495667, 705908432, 705470657, 706048279, 706047058, 706395493, 707105408, 707523651, 707789764, 707690887, 707570724, 706550446, 705886459, 705277557, 705193253, 705441895, 705420227, 706129990, 706232605, 706501312, 706482239, 706463776, 706675034, 706103668, 705422134, 704973755, 704429398, 703124924, 703454208, 704162750, 704473953, 704817886, 705113678, 706104279, 705202332, 704267731, 703641815, 703330078, 703127823, 702537689, 702694244, 701767731, 702189484, 703823090, 704988556, 704490433, 704139786, 704639359, 703794327, 702720413, 701216202, 701902466, 702724762, 702276459, 702259521, 702032623, 702415314, 703071213]
2349.2G03071213R39102k12936n39780q85773j758270n37720l91617O62384k22320
2357.9G00124283M40903J076049O65207Q82111o4774N3864k141724j072922o66885
2366.6F99296112j493912r54132J80512R84192m43116L70331M83628O15463K3269r56268
2376.2F98106079r02557j385346m81872m11454l38363Q545M32129P84225M96369K42614
2385.9F96550369m99801j34125j014023j507111n80215n01480R6512k4491L23868M38233
2395.5F93147736M50363O11191j13984o73980j086197o43692j051560r08889m51127
2404.2F89279861k15225O42853M67529O12641L20053K6550n50613r62525q28094j190949
2413.8F87602081q84552r34066r9106K63366K61460Q78448M37165l0289m58145l69187
$$ y = [703071213, 704010315, 703797379, 703257599, 702371826, 700613556, 700075836, 699684219, 700346603, 700124283, 700565186, 701641235, 702306442, 703188553, 703123779, 703177643, 701035919, 699962997, 699296112, 697802200, 696848068, 697028580, 698012772, 697569656, 697939987, 698423615, 699039078, 699062347, 698106079, 697203522, 695818176, 695336304, 694924850, 694586487, 694595032, 695027161, 695811386, 696307755, 696550369, 696050568, 695916443, 694902420, 693395309, 692815094, 692313614, 692410126, 692385635, 692709503, 693147736, 693598099, 694209290, 694095306, 693421326, 692335129, 691691437, 690639877, 689730988, 689279861, 689064636, 689707489, 690175018, 690787659, 691107712, 691134262, 690583649, 689621124, 688793030, 687602081, 686717529, 685783463, 685684357, 685947723, 686209183, 687087631, 687524796, 687494507, 687036362, 686667175]
2423.5F86667175r19265j130066j035233j067734m34723l71475M65317P73315O08673
2432.2F83555984N14832L47366j64260j244965j195145j348648r86099m58527j55029
2440.8F78865509O4087K84119P82699L03803L20358m04968q31223j045685j693039
2449.5F76645660j242752q80279J36337J49384K15683M51965K22931L44009j17111
2458.2F75925827k25983j379623j219101p43027j360016o65283j40304L04412M98887
2466.9F70995789Q88900K15607m07562m04892j259155j182862j352997j145630o00128
2475.6F65747070j8158L37067L72162O01654J45111K64969n37033j183090j198807
2484.2F64530945j366501j089096r26209o5918k46200j88217K80990O69098P69654
$$ y = [686667175, 685747910, 684617844, 683582611, 682514877, 682080154, 681708679, 682173996, 682947311, 683555984, 684070816, 684418182, 684253922, 683008957, 681813812, 680465164, 679479065, 679020538, 678865509, 678929596, 679213715, 679996414, 680300217, 680620575, 680215607, 679384384, 678338699, 676645660, 675402908, 674522629, 674658966, 674808350, 675024033, 675475998, 675698929, 676042938, 675925827, 675699844, 674320221, 673101120, 672358093, 670998077, 670332794, 670192490, 670496902, 670995789, 671884689, 672100296, 671692734, 671287842, 670028687, 668845825, 667492828, 666347198, 665747070, 665728912, 666065979, 666438141, 667039795, 667184906, 667449875, 666912842, 665729752, 664530945, 663164444, 662075348, 661149139, 661083221, 660837021, 660648804, 660929794, 661598892, 662368546]
2492.9F62368546m08173o45981j232605j346817j304245j364746k34756k4415l4790
2501.6F55772018L88718N51987O9961K75498k25525j592407j375580j199265j156845
2510.3F51508560q81958r2544J97448K31247O75583L15323o5918o74210q39462j041565
2519.9F49332504j080932r48334j113739m90723o5994M76761O32324O25076P9422n30853
2529.6F46915512m72641j363983j242065r69925j126175p71027j08032N26504N68543
2538.2F41956711P97729L33634j72653n46723q80279j308823j478996q92754q80547
2546.9F36927299k45933P0839N33562R27238J67847n8136l84636n87845j298943j704864
2556.6F34346428j324463o76346k77405l59993L98179L65638N58663M26826m03442
$$ y = [662368546, 661960373, 661314392, 660081787, 658734970, 657430725, 656065979, 655831223, 655806808, 655772018, 656160736, 656712723, 656782684, 657058182, 656832657, 655240250, 653864670, 652665405, 651508560, 650626602, 650534058, 650731506, 650962753, 651638336, 651953659, 651887741, 651213531, 650374069, 649332504, 648251572, 647303238, 646189499, 645698776, 645632782, 646109543, 646741867, 647366943, 647446365, 646915512, 646442871, 645078888, 643836823, 642866898, 641740723, 640969696, 640861664, 641388168, 641956711, 642754440, 643088074, 642915421, 642368698, 641488419, 640179596, 638700600, 637807846, 636927299, 636681366, 636752205, 637285767, 638213005, 638380852, 638322716, 637938080, 637350235, 636051292, 634346428, 633021965, 632345619, 632068214, 631708221, 632106400, 632472038, 633030701, 633457527, 633054085]
2565.2F33054085o09169j094666q54835r35059j033630p33071l57704J01509N75638
2573.9F28113098P22962n532L3608m85459p64503q86955j615219j102829n86281N5237
2583.6F23478127L47175K99606j56402k76375K66418k08358l74451p04269j184655
2592.2F21486816j262703p98912o52427p23152K97203N92804L70140k45667m42619
2600.9F18621483l79868o01463r01794j571579r08280o36749k39258L04680m578O0196
2610.6F13742790K08664M50096n49545j149521j220054j087189p47032j102257n37529
2619.3F08008423j46523L26882L9825j21193N31998l77464j143189j290970q94317
2627.9F04933472j067963j216965o80198k46048N58586O63948K79312m92821k76603
$$ y = [633054085, 632444916, 631350250, 630495415, 629560356, 628526726, 627793655, 627435951, 627537460, 628113098, 628836060, 628830528, 628864136, 628378677, 627614174, 626727219, 625112000, 624009171, 623422890, 623478127, 623825302, 624124908, 623968506, 623692131, 623958549, 623750191, 623375740, 622671471, 621486816, 620224113, 619425201, 618772774, 618049622, 618346825, 618939629, 619309769, 619064102, 618621483, 618241615, 617640152, 616738358, 615166779, 614258499, 613621750, 613382492, 613687172, 613682594, 613742790, 613951454, 614401550, 613852005, 612702484, 611482430, 610395241, 609648209, 608545952, 608008423, 607861900, 608188782, 608228607, 608107414, 608639412, 608261948, 607118759, 605827789, 604933472, 603865509, 602648544, 601968346, 601722298, 602280884, 602944832, 603224144, 602731323, 602454720]
2636.6F02454720j47858r48448j229973j353264q02765r74312o60553K21863M69780
2645.3E97029190L95012l48625l62740l19633m01650r55238j277123j017150r96895
2654E91745148n29061k22168L74108L72047J42250j45912l95470k41508j117592r42688
2663.6E89039154p04346r60960m59709j49956n8594J77651M98848M1275K861k35749
2673.3E87190475r88311r79004o13709r08737j296158j4381K58484L4294J35155k6818
2682.9E82791290N08766k20832r06563q78639p72553q34846q44193n40962m45557L12653
2692.5E78168564K70347L23410L47939m56772n18532o01005p84340r72862p26166o35834
2702.2E74414749m48303R7961L68157M62570R5139K65655k2469n32226j015663j582108
$$ y = [602454720, 602306862, 601358414, 600128441, 598775177, 597972412, 596998100, 596337547, 596559410, 597029190, 597424202, 597075577, 596712837, 596393204, 595991554, 595036316, 593759193, 592742043, 591745148, 591216087, 590993919, 591368027, 591740074, 591882324, 591736412, 591340942, 591099434, 589981842, 589039154, 588334808, 587373848, 586914139, 586764183, 586705589, 586883240, 587382088, 587423363, 587426224, 587190475, 586202164, 585223160, 584609451, 583700714, 582404556, 582390175, 582648659, 582682953, 582818108, 582791290, 583300056, 583079224, 582172661, 581294022, 580521469, 579686623, 578842430, 578301468, 577855911, 578168564, 578438911, 578762321, 579110260, 578653488, 578134956, 577533951, 576749611, 575776749, 575050583, 574414749, 573966446, 574064407, 574432564, 574895134, 574990273, 575255928, 575233459, 574701233, 573685570, 572103462]
2711.8E72103462j140518m52957J05247l662P744J5450M12216P15179q3160n19638
2721.5E71159363j060372q82568o66275o47926m54750j99204J92795j96114L67279
2730.2E67612228K77596l05214m56467o44035k58293p65152q52776q34884l20053L78723
2739.8E63831673L58772P18689M99191M78554j35155n93834p94906j217156o32019
2748.5E62513809o05125n21965k7886L90168L91464L35426Q4381k55623O2142n89180
2758.1E61777611j029968j077385r37958l61519j71051J10741N02777N56183k98577
2766.8E59070854j09749q4381j012840j015205j042366p78275m30107Q9149J7853j56822
2776.4E54548111L54118m9019n31082m36172j65482n99937p78046r11102j039467m19235
$$ y = [572103462, 570962944, 570509987, 570615234, 570611572, 570619316, 570634766, 571046982, 571762161, 571679001, 571159363, 570098991, 569216423, 568550148, 567902222, 567447472, 567248268, 567441063, 567244949, 567612228, 567889824, 567584610, 567128143, 566484108, 566225815, 565460663, 564607887, 563773003, 563452950, 563831673, 564190445, 564909134, 565408325, 565886879, 565751724, 565157890, 564362984, 563145828, 562513809, 561908684, 561386719, 561358833, 561749001, 562140465, 562475891, 562560272, 562304649, 562366791, 561777611, 560747643, 559670258, 558732300, 558370781, 558199730, 558310471, 558813248, 559369431, 559070854, 558961105, 558876724, 557863884, 556848679, 555806313, 555028038, 554597931, 554687080, 554704933, 554548111, 554902229, 554853210, 554322128, 553885956, 553720474, 553120537, 552342491, 551431389, 550391922, 549972687]
2786.1E49972687k67716J70441K11601L35121K34948n85061j121940j403771p74803
2794.8E46771507r43565q10776l30086n65910m97131k95945k5863m35295l06702n05447
2804.4E42054787q44460q14171j135482q56934j042137o15692m29306m21639j23978
2813.1E35770988k66838J07575o02722r35784r56726j480980j547088j179161n44968
2821.8E28364296o81877k58141Q1101k68936p31087j053505q94547j090240j230469
2830.4E22236595j297569j073914j007805r15451q51135o85425j87912q06389j079063
2839.1E14331932j552544k058792j849403k211495k317008k108689k136307k399597
2846.8D97698097j722946j437874j661339j507606j750031j276702j232796j026802
$$ y = [549972687, 549704971, 549875412, 550087013, 550422134, 550657082, 550072021, 548950081, 547546310, 546771507, 545827942, 545017166, 544687080, 544121170, 543624039, 543328094, 543302231, 542866936, 542560234, 542054787, 541210327, 540396156, 539260674, 538403740, 537361603, 536745911, 536316605, 535894966, 535770988, 535504150, 535611725, 535009003, 534073219, 533116493, 531635513, 530088425, 528909264, 528364296, 527682419, 527424278, 527505379, 527236443, 526505356, 525451851, 524557304, 523467064, 522236595, 520939026, 519865112, 518857307, 517941856, 517090721, 516405296, 516217384, 515410995, 514331932, 512779388, 510720596, 508871193, 506659698, 504342690, 502234001, 500097694, 497698097, 495975151, 494537277, 492875938, 491368332, 489618301, 488341599, 487108803, 486082001]
2854.6D86082001n76554m92172R0256L70483J12686k34260K01683K3994K8687J1368
2864.2D85618172r79920j196480j442871j300468j275559r52911m19159q1711N56069
2872.9D78525162k93579o87752o56815j064605j078721p68508p39441j419068j001358
2881.6D70815315l50494k37885m53033l76511k65922q60710r61419j321144j434631
2890.2D64553566j307106r80873q66356j201859p39059n44548k12326o28929j041107
2898.9D57031403p38564r40590q12416j104851q56056o71997j078796p46308l12729
2907.6D49769096n07660j338005j421432j152153j048508j492348j978607j869545
2915.3D38960838j941147j631507j364251j117553p99179o27213j019707j199646n98640
$$ y = [486082001, 485505447, 485013275, 485103531, 485474014, 485586700, 485352440, 485554123, 485578117, 485606804, 485618172, 484638252, 483441772, 481998901, 480698433, 479422874, 478469963, 478050804, 477969093, 478525162, 478231583, 477543831, 476887016, 475822411, 474743690, 473975182, 473235741, 471816673, 470815315, 470464821, 470226936, 469773903, 469397392, 469131470, 468270760, 467309341, 465988197, 464553566, 463246460, 462265587, 461399231, 460197372, 459458313, 458913765, 458701439, 458072510, 457031403, 456292839, 455352249, 454539833, 453434982, 452578926, 451906929, 450828133, 450081825, 449769096, 449261436, 447923431, 446501999, 445349846, 444301338, 442808990, 440830383, 438960838, 437019691, 435388184, 434023933, 432906380, 432107201, 431479988, 430460281, 429260635, 428661995]
2924D28661995o88324n67741l18261K41814L19748k39410M24346Q94928P21093M21028
2933.6D29871216O15043O19812N02930M99954J52245O28090Q87413R12399R43947J248817
2943.3D36881866J185647M66766P73010Q66318P93342K7276l54996Q44993Q35686k4567
2952.9D42295341j36184K93770M89959R65081R03701N13878P86171P85637P64809J66778
2962.6D47828941J09177M16756L80287R15832J392441J187897N32074J086235J214981
2971.2D55064621L96423L21846M40865M59404K74505K88430L72658Q26187O51893N11742
2980.9D59608574Q96606J47324O1989P8506o2408R7198r8381q8806K09236Q99468Q54645
2991.5D62603951L23333L395N73k63253m76989m0284k55508n15633p66868o21872l89786
$$ y = [428661995, 427973671, 427405930, 427087669, 427329483, 427649231, 427409821, 427834167, 428729095, 429450188, 429871216, 430486259, 431106071, 431609001, 432108955, 432261200, 432889290, 433776703, 434689102, 435633049, 436881866, 438067513, 438534279, 439307289, 440173607, 440966949, 440994225, 440639229, 441484222, 442319908, 442295341, 442159157, 442452927, 442942886, 443907967, 444811668, 445325546, 446111717, 446897354, 447662163, 447828941, 447938118, 448354874, 448735161, 449650993, 451043434, 452231331, 452763405, 453849640, 455064621, 455461044, 455782890, 456223755, 456683159, 456957664, 457246094, 457618752, 458444939, 459096832, 459608574, 460505180, 460652504, 460714493, 460792999, 460730591, 460827789, 460729408, 460640602, 460849838, 461749306, 462603951, 462927284, 462930679, 462931252, 462667999, 462191010, 462150726, 461895218, 461379585, 460612717, 459990845, 459601059]
3002.1D59601059k03018N4321m33617k22816j90849k83394l31345l82232l55835j015816
3011.7D56236458q80051o21643m06876n85556m57115N3292n24369p12127r79882q81462
3021.4D50240669q07495p90062p78885j063194j90697k60009m02298k80381p02476
3030.1D44965172q91571r96704n44129r79957j371765j207657o82526j86958o24275
3038.7D37479630k37198k97470j051941q96302o07490p09763r62600j505089j497040
3047.4D29714737n58167l97605m27666n06859p48863l91770m69932p97005p45544j041298
3057.1D23630028j405373r77478j050377q22334l09639n08118k95601q64753p62825
3065.7D16633530l57399p79610n75523q55217r19648r42001q69827o67114q03338j15318
$$ y = [459601059, 459398041, 459452362, 459018745, 458795929, 458605080, 458321686, 457990341, 457608109, 457252274, 456236458, 455356407, 454734764, 454327888, 453742332, 453285217, 453338509, 452814140, 452102013, 451122131, 450240669, 449433174, 448643112, 447864227, 446801033, 446610336, 446350327, 445948029, 445667648, 444965172, 444073601, 443076897, 442532768, 441552811, 440181046, 438973389, 438290863, 438103905, 437479630, 437242432, 436944962, 435893021, 434996719, 434389229, 433679466, 432716866, 431211777, 429714737, 429156570, 428758965, 428331299, 427824440, 427075577, 426683807, 426213875, 425416870, 424671326, 423630028, 422224655, 421247177, 420196800, 419374466, 419064827, 418556709, 418261108, 417396355, 416633530, 416276131, 415496521, 414920998, 414065781, 413146133, 412204132, 411334305, 410667191, 409863853, 409748535]
3075.4D09748535K90795j42327p56378p45010p65191j290855r93957n36271n72090
3084.1D04237251p26661j008912n95665J61591l27988p97309j066552q73947k67105
3092.7C98734703r91592r06067p06902j028213p00875m45518P477l52402o34422m88854
3102.4C92487335n16205q06694j085472r02519j146355p24067p21550p02057K0103
3111.1C85902519m98276o42089n15786n04303l94058r60426j387444j214714r93652
3119.8C78791771p50351m52003m98696j17378j27030j016540j448784q29010m00352
3128.4C73151627q09136r07249j289177q43544k38457p37267p12928o90232l46031
3137.1C66577606m47159p64885p97348j082305r35860j054878r22966q35038p03735
$$ y = [409748535, 410039330, 409897003, 409140625, 408395615, 407630424, 406339569, 405345612, 404809341, 404237251, 403510590, 402501678, 401906013, 402067604, 401739616, 400942307, 399875755, 399001808, 398734703, 397743111, 396837044, 396130142, 395101929, 394401054, 393955536, 393963013, 393610611, 392976189, 392487335, 391971130, 391164436, 390078964, 389176445, 388030090, 387306023, 386584473, 385882416, 385902519, 385404243, 384762154, 384246368, 383742065, 383348007, 382387581, 381000137, 379785423, 378791771, 378041420, 377589417, 377090721, 376973343, 376846313, 375829773, 374380989, 373551979, 373151627, 372342491, 371435242, 370146065, 369302521, 369064064, 368326797, 367613869, 366923637, 366577606, 366130447, 365365562, 364568214, 363485909, 362550049, 361495171, 360572205, 359737167, 359033432]
3145.8C59033432m62952m51240j03874l68309p97921j280059j327782q43697p94792
3154.5C52602806o97250o92826o75430m55780m56047r28116r66797o39457p09954q67843
3164.1C45513306j040840j127663p98454k41471q96187j222534n18417j74217k68364
3172.8C39225159j255875j031532n50270r51310j057662j085701m67377o07147q73909
3181.5C31344376o54183m60319k60201n67741p81136r60350q56132j023941j201477
3190.1C24578896r20830m73938j93901l17917j95961p54242n94521m29191q79307o52905
3199.8C19166183j093883r95884q66108m76723k97756o96831j76887l30124l22437
3208.5C13909550p11003j041584o88839r81578o38810m17957m24786o57272p36542
$$ y = [359033432, 358570480, 358119240, 358015366, 357647057, 356849136, 355569077, 354241295, 353397598, 352602806, 351905556, 351212730, 350537300, 350081520, 349625473, 348697357, 347730560, 347091103, 346381149, 345513306, 344472466, 343344803, 342546349, 342304878, 341408691, 340186157, 339667740, 339493523, 339225159, 337969284, 336937752, 336387482, 335436172, 334378510, 333292809, 332825432, 332218285, 331344376, 330690193, 330229874, 329969673, 329401932, 328620796, 327660446, 326804314, 325780373, 324578896, 323658066, 323184128, 322990227, 322672310, 322476349, 321722107, 321127586, 320698395, 319819088, 319166183, 318072300, 317076416, 316210308, 315733585, 315435829, 314738998, 314562111, 314231987, 313909550, 313198547, 312156963, 311468124, 310486546, 309847736, 309429779, 309004993, 308347721, 307611179]
3217.2C07611179k26249k49215o32781o32077l63807q09136q52852r04712j079331
3225.8C01861019m65755n60665l40939L36666k21748j018105m71763j21804n90725
3234.5B98406181n44471q50411j116485n97992j91403l75309k42195j04351q50582
3243.2B93532982r17149l36055j96152o55747p56187m54807p11937o37493k71798j93882
3252.8B88401775k75688k67124k26459n07565o96583m07200n60779q01239k90451o13919
3262.5B83754768p04536k58770k88258j04313k98862j97124l57419o09684k50968l19176
3272.1B80365658m57077n47734m26788l87649l81051o87885m79107L33691J1692l96442
3281.8B76947308o15235m91276n20229m36649k05193o15406k58941l48034k94705k04582
$$ y = [307611179, 307384930, 307135715, 306502934, 305870857, 305507050, 304697914, 303845062, 302940350, 301861019, 301395264, 300834599, 300493660, 300830326, 300608578, 299590473, 299118710, 298996906, 298406181, 297861710, 297011299, 295894814, 295296822, 295105419, 294730110, 294487915, 294383564, 293532982, 292615833, 292279778, 292083626, 291427879, 290671692, 290216885, 289504948, 288867455, 288595657, 288401775, 288126087, 287858963, 287632504, 287124939, 286428356, 286021156, 285460377, 284659138, 284368687, 283754768, 283050232, 282791462, 282503204, 282398891, 282100029, 281902905, 281545486, 280935802, 280684834, 280365658, 279908581, 279360847, 278934059, 278546410, 278165359, 277477474, 276998367, 277332058, 277343750, 276947308, 276332073, 275840797, 275320568, 274883919, 274678726, 274063320, 273804379, 273456345, 273161640, 272957058]
3291.4B72957058m94862O0196P3738L2978m58145q44211n48535m99458l82023j92222
3301B69704514J0871k58445k27642l94802m56124R0828K308o42471j146851k58942
3310.7B66423244P592l27931k45838o81267l80401j55087l89766m61197l49121l38631
3320.3B63101597k89269l35292n71232j08395l43456m40960k40555m66213l80783p93934
3330B59131508r90372p58896j91879l12996o16188L929j77154o70071o02245j74523
3339.6B54641113m57554o02684m10499q38947p24888n72243k10J0033o15120l11794
3349.3B50117207K9048Q679o10733o30131j32294J7529k46887n92976l57532l64514
3358.9B47237396m01058l37734l23506m50458j19648J16768j90087l6487m77753m38328
$$ y = [272957058, 272462196, 272522392, 272596130, 272629108, 272170963, 271326752, 270778217, 270278759, 269896736, 269704514, 269715385, 269456940, 269229298, 268834496, 268378372, 268469200, 268471508, 267829037, 266682186, 266423244, 266430836, 266102905, 265857067, 265175800, 264795399, 264640312, 264250546, 263789349, 263440228, 263101597, 262812328, 262477036, 261905804, 261797409, 261453953, 261012993, 260772438, 260306225, 259925442, 259131508, 258141136, 257382240, 257190361, 256877365, 256261177, 256265106, 256087952, 255417881, 254815636, 254641113, 254183559, 253580875, 253170376, 252331429, 251606541, 251034298, 251034088, 251044121, 250429001, 250117207, 250146255, 250154934, 249544201, 248914070, 248781776, 248799305, 248552418, 247959442, 247601910, 247237396, 246836338, 246498604, 246175098, 245724640, 245604992, 245721760, 245531673, 245495186, 245017433, 244579105]
3368.6B44579105l57380n19390n3901j57776j49002k14539J41316J19495n25894m98982
3378.2B42363052l86715J55220M4804k71625l47519m00086k86026o27003o2236N93815
3387.8B40775681M81433M4136j35097j9054l09964j61285j47915n90324l90721J40915
3397.5B39687805O3248J87683L10745j50375m0245N9967L7689J71356K56748l31325
3407.1B40253296p07874K74124N50709J26800k35958J4000K69489j27582k21596k04430
3416.8B39990978M73633N64842L67642P7076m13761L64627L13778L79086K94914l49750
3426.4B42063065O8283K54402J88751J73588P93857R08833J8558l37333j09902N87139
3436.1B44609241N63050L31650L23562K2106K55394O08578J75839J66034J053353P68966
$$ y = [244579105, 244221725, 243702335, 243648434, 243490658, 243341656, 243127117, 243268433, 243387928, 242862034, 242363052, 241976337, 242131557, 242176361, 241904736, 241557217, 241157131, 240871105, 240244102, 240181866, 240775681, 241257114, 241301250, 241166153, 241147099, 240837135, 240675850, 240527935, 239937611, 239546890, 239687805, 239751053, 239938736, 240249481, 240099106, 240058861, 240118828, 240156517, 240327873, 240584621, 240253296, 239545422, 239819546, 240370255, 240497055, 240261097, 240275097, 240544586, 240417004, 240195408, 239990978, 240464611, 241029453, 241397095, 241474171, 241060410, 241425037, 241738815, 242117901, 242412815, 242063065, 242131348, 242385750, 242574501, 242748089, 243541946, 244450779, 244469337, 244132004, 244022102, 244609241, 245172291, 245503941, 245827503, 245849609, 246105003, 246713581, 246889420, 247055454, 248108807, 248877773]
3445.7B48877773J25065J40247M99344J031285Q07857K27356k69432k289N61371L47977
3455.3B52346554K83184Q74004J340275P58133L92799O23131L84884L71513O86703
3464B58061180M56085K76032O83956P03392O62708N52197N93471J274910R31511L08209
3473.7B64503651L42369L31630Q77057R94052K76013O77929Q00495n7468N57308J251201
3483.3B70554237J033421P79877P11383J047211R41410O55518R00497J006184M65278
3492B78095016L91636P97673J040744J104031R52721J042022N45750L33118O73237
3500.7B84975948P33872P08084L62911R64298J471959J086578J087856J841488J106358
3509.4B94339352l72601R70898J163769M74643O13671Q54187J433601J278229J110248
$$ y = [248877773, 249002838, 249143085, 249642429, 250673714, 251481571, 251708927, 251439495, 251437206, 251998577, 252346554, 252629738, 253503742, 254844017, 255602150, 255994949, 256618080, 257002964, 257374477, 258061180, 258517265, 258793297, 259477253, 260180645, 260843353, 261395550, 261989021, 263263931, 264195442, 264503651, 264846020, 265177650, 266054707, 267048759, 267324772, 268002701, 268803196, 268745728, 269303036, 270554237, 271587658, 272367535, 273078918, 274126129, 275067539, 275723057, 276623554, 277629738, 278095016, 278486652, 279284325, 280325069, 281429100, 282381821, 283423843, 283969593, 284302711, 284975948, 285709820, 286417904, 286780815, 287745113, 289217072, 290303650, 291391506, 293232994, 294339352, 293966751, 294937649, 296101418, 296576061, 297189732, 298043919, 299477520, 300755749, 301865997]
3518C01865997Q83122P60650R58271J274491J204529L90033J023541J579800J198005
3526.7C11138439O48060R47895J093311P68433J152306J125831J452961J518803J458015
3535.4C21304054J050301L86429R90600J351166J805344J250953R81980J349983J478767
3544.1C31949577J202393O19087J479874P58362J513443J945610J570167J613312m35982
3552.7C42215843J107788J936913K359237K554513R60578J463356J072503J200904
3560.5C54871635J364556J715774J621895K014160L736725m50477m40064J844559J287117
3569.1C67565880K862167J738167K315178K263145J679154J609535J710358J900558
3576.9C83644142J251145K767524J835594O60553J709481K212372J815071J266479
$$ y = [301865997, 302749119, 303509769, 304468040, 305742531, 306947060, 307337093, 308360634, 309940434, 311138439, 311786499, 312734394, 313827705, 314596138, 315748444, 316874275, 318327236, 319846039, 321304054, 322354355, 322740784, 323731384, 325082550, 326887894, 328138847, 329120827, 330470810, 331949577, 333151970, 333771057, 335250931, 336009293, 337522736, 339468346, 341038513, 342651825, 342215843, 343323631, 345260544, 347619781, 350174294, 351134872, 352598228, 353670731, 354871635, 356236191, 357951965, 359573860, 361588020, 365324745, 364874268, 364434204, 366278763, 367565880, 370428047, 372166214, 374481392, 376744537, 378423691, 380033226, 381743584, 383644142, 384895287, 387662811, 389498405, 390158958, 391868439, 394080811, 395895882, 397162361]
3584.6C97162361L189240J166114J95160K762833Q55560L049164L408585K571830J349259
3593.2D15710106J790047K900123j72157K254410L144684J833877L309670J827812
3601D32598572J413231K158279K381744K110482K447471L360176P74994L412667J481170
3609.6D52138786k28958N878067K700997L59573L353043P92312L970757L950424J675987
3618.3D74590988K582970J549301J851463K641182K854500K374191K729187K696839
3626D93870621L177681N658912O59294m013519M530182M714317M801674K239723K61460
3634.7E15900345L436889L989792K738190J732483K060966L058892L428688J890716
3642.4E38236961J857376L493538L617440M654350K05803m56467N582199o2027r43069
$$ y = [397162361, 400351601, 401517715, 401712875, 404475708, 405331268, 408380432, 411789017, 414360847, 415710106, 417500153, 420400276, 420228119, 422482529, 425627213, 427461090, 430770760, 432598572, 434011803, 436170082, 438551826, 440662308, 443109779, 446469955, 447244949, 450657616, 452138786, 451909828, 457787895, 460488892, 460848465, 464201508, 464993820, 468964577, 472915001, 474590988, 477173958, 478723259, 480574722, 483215904, 486070404, 488444595, 491173782, 493870621, 497048302, 502707214, 503366508, 499352989, 503883171, 508597488, 513399162, 515638885, 515900345, 519337234, 523327026, 526065216, 527797699, 529858665, 532917557, 536346245, 538236961, 540094337, 543587875, 547205315, 551859665, 552065468, 551609001, 557191200, 557129173, 556186104]
3651.1E56186104J805420N846596M921569M010697M931793m589348K766228N239487
3658.8E81118546J778144K566338J294517K674447J874084J932983K441407J335296
3666.5E97015762M729920K772140M53606J260796n827523K849846Q301773Q221550
3674.3F19777870j229477j4800453L958092Q255005M305191j532669J075935K720261
3682F22529755K136726J459312P13387J190033L759842N619202p498360k964974P461930
3690.6F34406853l602371J62734N104332J564675J525001L17917N33295J626663N29099
3699.3F42168198K616958K209320m702987j390992M471817K346192M23736k71606J803513
3708F49674149L545455o805877K944641N943909j0866318L220444L914337N47790J096268
$$ y = [556186104, 557991524, 563838120, 568759689, 572770386, 577702179, 573112831, 575879059, 581118546, 582896690, 585463028, 586757545, 589431992, 591306076, 593239059, 595680466, 597015762, 601745682, 604517822, 604971428, 606232224, 600404701, 603254547, 611556320, 619777870, 618548393, 603747940, 607706032, 615961037, 620266228, 618733559, 619809494, 622529755, 624666481, 626125793, 626839180, 628029213, 631789055, 637408257, 629909897, 626944923, 634406853, 630804482, 630967216, 636071548, 637636223, 639161224, 639479141, 640012436, 641639099, 642168198, 644785156, 646994476, 642291489, 640900497, 645372314, 647718506, 648142242, 647870636, 649674149, 653219604, 646413727, 649358368, 655302277, 644435959, 647656403, 651570740, 652118530, 653214798]
3716.7F53214798J968002J778336k907334N78766M710465l076401k851791M676056
3724.4F58090897J560363J65711k417832n62133L359069R17817L922348l373108o018067
3733.1F55645065Q927765M80194p772751J614075J667786m9057J667633L009949j881485
3741.8F63309174L120040J0230179r861450j5642700R642181N946274M622269l469086
3749.5F67896881q435593R628373m959412o095123N940857L807907K860870m314422
3757.2F66330338K153549N221557o828155q08640M165497J349487l87420J983032k765808
3765.9F70413437m476700L310547N185547J783066o986771J085510K869644k2125L58048
3774.5F73520203m59977J351777N26733J698379p73391o747437K886887K118301Q85391
$$ y = [653214798, 655182800, 656961136, 654053802, 654632568, 659343033, 656266632, 653414841, 658090897, 659651260, 659816971, 657399139, 656837006, 660196075, 661113892, 665036240, 661663132, 655645065, 664572830, 665053024, 657280273, 658894348, 660562134, 660513077, 662180710, 665190659, 663309174, 666429214, 676659393, 666797943, 651155243, 660797424, 666743698, 671365967, 667896881, 659461288, 669089661, 664130249, 658035126, 663975983, 667783890, 670644760, 666330338, 668483887, 673705444, 666877289, 666068649, 670234146, 671583633, 671196213, 673179245, 670413437, 665936737, 669247284, 674432831, 676215897, 669229126, 670314636, 673184280, 673162155, 673520203, 673060226, 674412003, 674938736, 676637115, 675863724, 669116287, 672003174, 674121475, 675006866]
3783.2F75006866K359162j721497m56924J025543L35999j96534o64215Q4305J3657
3791.9F75786362N64193L84903Q58918J738586l547134l201294K573471M106140N020065
3800.6F84284210o516571q801575M710160K091064L773346M686966r192810k554016
3808.3F72480774M748611J467514k31552N43061P16552R83124M384766j882553j2197953
3817F71012344M477539N443879M122619L90396j4918594K139435M598694J791534K807541
3825.7F81865387o27747m487228M21524K376175M047546J443787p970123K345504N721207
3834.3F85136032n162353n49317N935211q000564l690872O581192m032364O85959O045303
3843F82948227k352066k397766K362289O62766k32163Q70056j161346J967468M948120
$$ y = [675006866, 677366028, 675644531, 675187607, 676213150, 676549149, 676352615, 675688400, 675772705, 675786362, 676350555, 676735458, 677594376, 679332962, 675785828, 672584534, 675158005, 679264145, 684284210, 677767639, 668966064, 673676224, 675767288, 679540634, 684227600, 675034790, 672480774, 677229385, 678696899, 678465347, 679008408, 679724960, 680708084, 685092850, 683210297, 671012344, 675489883, 680933762, 685056381, 685446777, 670528183, 672667618, 677266312, 679057846, 681865387, 681237640, 676750412, 677171936, 679548111, 683595657, 685039444, 677069321, 679414825, 685136032, 679973679, 679424362, 685359573, 677359009, 673668137, 680249329, 676216965, 676902924, 682948227, 680596161, 678198395, 680560684, 681223450, 680991287, 681861343, 680699997, 682667465, 687615585]
3851.7F87615585m763031N04837j3250656K090454J0019532o70090j556473J966477
3859.4F81956635J431198J155700n211868K36664O233139l985977m931946L403702
3867.1F80287247M123993M050674p208099q050309L517075N234680K782898p364654
3874.8F77373505O61163L615112q545J499024L143234m929810n336990N300140P20673
3883.5F82037506J489716M084854j2781906J189651M633866J351394L820114j439361
3891.2F84385834p081909J187820K751541p46231R70154K31094J813050J839447p791214
3899.9F77559586M855651P22123n783615M858932k352982p64160M21143n07889J768570
3908.6F80777359j86768k35672L66364P61871J68000j32370J123886J278991k996521
$$ y = [687615585, 682852554, 683357391, 670106735, 672197189, 682216721, 681546631, 679990158, 681956635, 683387833, 684543533, 679331665, 679568329, 685801468, 681815491, 676883545, 680287247, 684411240, 688461914, 681253815, 673203506, 676720581, 681955261, 684738159, 677373505, 678034668, 681649780, 681641235, 683140259, 686283493, 681353683, 676016693, 681316833, 682037506, 683527222, 687612076, 674830170, 676019821, 680653687, 682005081, 685825195, 684385834, 677303925, 678491745, 681243286, 680497055, 681467209, 681698303, 683511353, 685350800, 677559586, 682415237, 683137360, 677353745, 682212677, 679859695, 679095535, 679516678, 679008789, 680777359, 680590591, 680354919, 680721283, 681483154, 681651154, 681518784, 682642670, 683921661, 680925140]
3917.3F80925140l268966L532943L64991k854538J799240Q27255P86820j567383k499619
3926F78045883K564240J818313K76795r92508l60413J460724k757263j558380J605377
3934.6F80102768K13776k95258k7313K12173l75290j03302J314316K11563k184677
3943.3F79068756M99802J076202O1417M91333j599961J072159R01795k798920N75562
3952F79348145R25979L14789k69775n46799L85818l39126P1792l72924R95178O80313
3961.6F81193390j396942M38995p4386q48084K39487J031418L80020q20237o12564
3970.3F79531097j80206n1956j6937K27432k00195j36872Q0872J14212N30090K00043
3980F80097580j83640m93240k8152L45459J01623m97894k97852M69666L07388O33545
$$ y = [680925140, 677656174, 681189117, 681554108, 678699570, 680498810, 681326065, 682112885, 680545502, 678045883, 680610123, 682428436, 682705231, 681712723, 681352310, 682813034, 680055771, 678497391, 680102768, 680316544, 680021286, 679993973, 680206146, 679830856, 679727554, 681041870, 681253433, 679068756, 679568558, 680644760, 680706177, 681197510, 679597549, 680669708, 681571503, 678772583, 679348145, 680274124, 680588913, 680319138, 679772339, 680158157, 679819031, 679890823, 679517899, 680513077, 681193390, 679796448, 680235443, 680161057, 679312973, 679552460, 680583878, 680963898, 680143661, 679531097, 679350891, 679298935, 679281998, 679509430, 679309235, 679172363, 679253235, 679367447, 679897537, 680097580, 679913940, 679420700, 679392548, 679738007, 679839630, 679341736, 679043884, 679513550, 679820938, 680454483]
3989.6F80454483l30582l55072K01722k66419M75540l04565n10941N63889P65304m3411
3999.2F80649948o42776
4000.2F80007172
$$ y = [680454483, 680123901, 679768829, 679970551, 679704132, 680179672, 679875107, 679364166, 679928055, 680693359, 680649948, 680007172]
##END=$$ End of the data block
