##TITLE=$$ Begin of the data block
##JCAMP-DX=5.00 $$ ACD/SpecManager v 10.08
##SPECTROMETER/DATA SYSTEM=Varian
##DATE=15 Jan 2013 11:01:00
##DATA TYPE=INFRARED SPECTRUM
##DATA CLASS=XYDATA
##ORIGIN=
##OWNER=
##NPOINTS=3735
##FIRSTX=399.26403809
##LASTX=4000.35498047
##MAXX=4000.35498047
##MINX=399.26403809
##MAXY=67.44227600
##MINY=16.58135223
##XFACTOR=1.0000000000
##YFACTOR=0.000000100000000
##FIRSTY=36.71906662
##DELTAX=0.96440572
##XUNITS=1/CM
##YUNITS=TRANSMITTANCE
##XYDATA=(X++(Y..Y))
399.3C67190666j3088035p147065M878579J074371L18108N706138J721344o660957
407C53993149l777542j371231k264023M242744J151009o102142k204590K236709K272148
415.7C48176231J866990j895028r075927j0031433P457313J4064751N422744k576751
423.4C53408890m121895m161110L996201o73943k516441k321320m276199O33468J410370
432.1C41378021K835694J14746N81779L401756k96363k69432p53518J008530k786598
440.7C45214615l866692M907112K938843k480850l246307J048164J251831k86179o95114
449.4C44785423k479515J235008m43611q91037K590256k377548j488495O361771J738967
458.1C49031219n644950k309266l937835k061691K37274J27945J211471q34007l797798
$$ y = [367190666, 354102631, 346955566, 351834145, 352908516, 353226624, 358932762, 360654106, 353993149, 350215607, 348844376, 346580353, 350823097, 351974106, 345871964, 343667374, 345904083, 348176231, 350043221, 348148193, 339072266, 329040833, 336498146, 350562897, 355985641, 353408890, 349286995, 345125885, 349122086, 348448143, 345931702, 343610382, 339334183, 339967651, 341378021, 344213715, 344328461, 344910240, 348311996, 348015633, 347746201, 346992683, 348001213, 345214615, 341347923, 346255035, 349193878, 346713028, 343466721, 344514885, 345766716, 345480537, 344785423, 342305908, 343540916, 343097305, 342206268, 344796524, 342418976, 340930481, 347292252, 349031219, 343386269, 341077003, 337139168, 335077477, 335314751, 335442696, 336654167, 335820160, 332022362]
466.8C32022362j647415K580528R28192J119652R61914m31519L014794q42552j151658
475.5C36554298l7384j425361n81780k843322j082955r7504l631134k535972O66618
484.1C24985504K761612j118965j315079K840653P91664j886482j360245J147499Q01239
492.8C27647400k420731k146339J352157K213288J338768K825394j799126l858948
500.5C25151863k98881j860047J974106K272835k368813k522812m06570J496353j460915
509.2C21977119j348457J245728j958466k501526J551266K008457k414265k900848
516.9C15659008Q31184O46763P7896Q45681L01971j474628j968880n55077J200886
525.6C15564804Q16784k216740j906852J271801P60307l59917Q27790r6303m56352
$$ y = [332022362, 330374947, 332955475, 333883667, 335003319, 335965233, 335533714, 338548508, 337705956, 336554298, 336516914, 335091553, 334509773, 331666451, 330583496, 330485992, 326854858, 324318886, 324985504, 327747116, 326628151, 325313072, 328153725, 328945389, 327058907, 325698662, 326846161, 327647400, 325226669, 323080330, 324432487, 326645775, 327984543, 330809937, 329010811, 325151863, 324852982, 322992935, 324967041, 327239876, 324871063, 322348251, 321941681, 323438034, 321977119, 320628662, 321874390, 319915924, 317414398, 318965664, 320974121, 318559856, 315659008, 316490192, 317136955, 317214851, 318060532, 318362503, 316887875, 314918995, 314363918, 315564804, 316381588, 314164848, 312257996, 313529797, 314290104, 313930187, 314757977, 314661674, 314205322]
534.3C14205322j003132k370624L71322K792798M87785k079239q93726N72376o75030
543C11407852k008266j74847P63226j301690j99031J6250r48257n36194j140461r25274
552.6C04953308j025638j02292J505719M97799j869965j724930L81146o47850k73610
561.3C01693687J750679L76740p03659J57757L12385j181335m44832K303848Q93898
570C05159168r85470r30538j413593K87514R60102n35298K66571m1256j444435N76954
579.6C01899719K409611n78060q35171J290016j8387n16815m47235r4509N81245j248703
589.3C02441711j243209O00338Q89949L96805Q50392J927414J171131o81134m48589
597.9C05904808M39720j42345j557732k152881n11380K42234l58887O9561m16985m03042
$$ y = [314205322, 313202190, 310831566, 311202888, 313995686, 314483471, 312404232, 311510506, 312082882, 311407852, 309399586, 309224739, 309987965, 308686275, 308487244, 308503494, 307555237, 307019043, 305878582, 304953308, 303927670, 303825378, 305331097, 305828896, 303958931, 302234001, 302615147, 301967297, 301693687, 303444366, 303821106, 303117447, 303275204, 303587589, 302406254, 301961422, 304265270, 305159168, 304173698, 303243160, 301829567, 302117081, 303077183, 302541885, 302808456, 302767200, 301322765, 301899719, 304309330, 303731270, 302896099, 304186115, 304167728, 303650913, 303203678, 303109169, 303690414, 302441711, 301198502, 301798840, 302688789, 303085594, 303935986, 305863400, 307034531, 306353397, 305904808, 306344528, 306202183, 304644451, 302491570, 301980190, 302222424, 301863537, 301933098, 301516113, 301113071]
607.6C01113071j2569q04539j227340j057721r75780q95004K15931Q44669M15630n79834
617.2B97036514o06632O48327M92725N72853P98951N7525M87271J636581Q25367K46448
626.9C02195930R69639Q10967J371193J519356J145057J414757Q78239N45978J142292
635.5C11993408J601219J559353J790600J177845M83246J444912J828384J009522M56505
644.2C23344994Q7013N73654J178169J134300J228371L76969J144866K142373N50308
652.9C31761017k48223n13458m63524l62701J37329P36313J39542n88074j168289j176529
662.5C28253403n6458J646385J531372N37873o96831k961159L232231R07631k37846
671.2C32156601P22694J051331J231575Q57620J246452J408921J098594Q66547O52084
$$ y = [301113071, 301100502, 300295963, 299068623, 298010902, 297035122, 296140118, 296356049, 297200718, 297616348, 297036514, 296429882, 297078209, 297570934, 298143787, 298942738, 299000263, 299487534, 301124115, 301949482, 302195930, 303165569, 303976536, 305347729, 306867085, 308012142, 309426899, 310305138, 310851116, 311993408, 313594627, 315153980, 316944580, 318122425, 318605671, 320050583, 321878967, 322888489, 323344994, 323432007, 324005661, 325183830, 326318130, 327546501, 327923470, 329068336, 331210709, 331761017, 331512794, 330999336, 330535812, 330173111, 330310440, 331046753, 331186295, 330598221, 329429932, 328253403, 328196945, 329843330, 331374702, 331912575, 331215744, 328254585, 331486816, 332394447, 332156601, 332879295, 333930626, 335162201, 336019821, 337266273, 338675194, 339773788, 340640335, 341292419]
679.9C41292419J375580J216011N42145P53594J859092J387406M30717P61261K74963
688.6C49893188N14145J085320N43976k10038K31896R94072P16514J179505J124802
697.3C56073380N56907R89227M39568l98827L37182N93948J58615L87688J077575K310524
706.9C62525787K281571Q97865K69699O7291k37083N65605J452408J166420R64851
715.6C69954414L11051K39525L92646L44658J067658J547127J606292O13938Q29086
724.3C76906395J061783Q20503J679001J002350P16667N31769Q97445J762772J015434
733C86394119K7581J61743J574440J199989P55081P37839M86031Q69636N06859O89926
742.6C93403244N78308L95241M99306P13577Q16498J284294J905441R36775P37229
$$ y = [341292419, 342667999, 343884010, 344426155, 345179749, 347038841, 348426247, 348856964, 349618225, 349893188, 350407333, 351492653, 352036629, 351826591, 352058487, 353052559, 353769073, 354948578, 356073380, 356630287, 357619514, 358059082, 357660255, 357997437, 358591385, 358750000, 359137688, 360215263, 362525787, 364807358, 365705223, 365974922, 366042213, 365805130, 366370735, 367823143, 368989563, 369954414, 370265465, 370504990, 370897636, 371242294, 372309952, 373857079, 375463371, 376077309, 376906395, 377968178, 378788681, 380467682, 381470032, 382186699, 382718468, 383615913, 385378685, 386394119, 386421700, 386583443, 388157883, 389357872, 390112953, 390850792, 391336823, 392206459, 392713318, 393403244, 393981552, 394376793, 394876099, 395589676, 396406174, 397690468, 399595909, 400532684, 401269913]
751.3D01269913N37071Q55827N68199j68266J410370J889076J356697M61655J325226
760D09505768K322197J233406R86900J015320R11293K13890K88735l16849o66199L90549
769.6D15885010N06668Q34236K54402K00348O73676N15976N7640n30129l31611q0605
779.2D17985611J79214o29119l97568R59854J358147Q44574O07452J338997P75261
787.9D23022423O77452L71666l60069j90163M23469O57235j58120K27318K36283O95343
797.6D25602837M53834j559028l123780k727127q07762j793022j438484m13819k74429
806.2D13919220J00021j267547j751328k020454j821366k547760l211135k249222j251602
814.9C97898827r60999j123161O14815J43127n89027O46095L28827R3956N71022J285438
$$ y = [401269913, 401806984, 402662811, 403231010, 403062744, 404473114, 406362190, 407718887, 408180542, 409505768, 411827965, 413061371, 414048271, 415063591, 415974884, 416188774, 416477509, 416160660, 415494461, 415885010, 416391678, 417225914, 417480316, 417680664, 418354340, 418870316, 418927956, 418397827, 418066216, 417985611, 418164825, 417535706, 417138138, 418097992, 419456139, 420300713, 420908165, 422247162, 423022423, 423699875, 424071541, 423711472, 423521309, 423944778, 424602013, 424443893, 424671211, 424907494, 425602837, 426056671, 424497643, 421373863, 418646736, 417838974, 416045952, 414607468, 414193649, 413919220, 414019241, 412751694, 411000366, 408979912, 407158546, 404610786, 401399651, 399150429, 397898827, 396937828, 395814667, 396429482, 396572609, 395983582, 396629677, 396958504, 397052460, 397623482, 398908920]
824.6C98908920J147538K498779L635101L127136L173447L090172L763122K980576
832.3D22324791K675056K387085J642342K055130K406960K918510K402763L000832
840D41813469K324753K258491K469826J598358J633873k34604P46575J466407J660920
848.7D55738068J673889J459999K984848K358971K846221R43642J09863J144066P35741
857.4D69995308J756210J559220J873550J582756J936798J007385N64270J493454l929
866D81765022o6337j652718l008766l507080l232346k659340k036247j284714k166366
874.7D62151108q26912n70831k37427k27623r96819m02908l61939R44100M91981L51906
884.4D60314636m27322j024513j39161j228332j412964j573524j111603j370354n90591
$$ y = [398908920, 400056458, 402555237, 406190338, 409317474, 412490921, 415581093, 419344215, 422324791, 424999847, 427386932, 429029274, 431084404, 433491364, 436409874, 438812637, 441813469, 444138222, 446396713, 448866539, 450464897, 452098770, 451864166, 452610741, 454077148, 455738068, 457411957, 458871956, 461856804, 464215775, 467061996, 468005638, 468115501, 469259567, 469995308, 471751518, 473310738, 475184288, 476767044, 478703842, 479711227, 480275497, 481768951, 481765022, 481698685, 480045967, 477037201, 473530121, 470297775, 467638435, 465602188, 464317474, 462151108, 461324196, 460753365, 460515938, 460288315, 459291496, 458888588, 458526649, 459470749, 459962730, 460314636, 459887314, 458862801, 458723640, 457495308, 456082344, 454508820, 453397217, 452026863, 451436272]
893D51436272J72119k05193O19240M30222P52220q37746j279030j831016k518959p52144
902.7D45985985n54581J188278K070046L285827L588944K289162K061729R42421J351929
911.4D62209740l40996j036568q02536p34749l06396j496773j554260k549896k000351
920D51387215k259369l189812l430138l811187l022232l979302l127670l067131l477783
928.7D22022591k527199l045006k770958k355842j689950j953201k176513j428223
936.4D04075699p59926n79376j011849m71496r44863j338386j357613j259765j495476
945.1C94856949k169876o97174K99186P59774O28852k79312p15789n68963l42941j219177
954.8C90551529j411057k489318l091622k190399j936378k210694k551727j584625
$$ y = [451436272, 451608391, 451403198, 452022438, 452452660, 453204880, 452367134, 451088104, 449257088, 446738129, 445985985, 445431404, 446619682, 448689728, 451975555, 455564499, 457853661, 459915390, 460857811, 462209740, 461868744, 460832176, 460029640, 459294891, 458988495, 457491722, 455937462, 453387566, 451387215, 449127846, 445938034, 442507896, 438696709, 435674477, 431695175, 428567505, 425500374, 422022591, 419495392, 416450386, 413679428, 411323586, 409633636, 407680435, 405503922, 404075699, 403315773, 402736397, 401724548, 401253052, 400308189, 398969803, 397612190, 396352425, 394856949, 392687073, 391989899, 392289085, 393048859, 393677711, 393398399, 392682610, 392113647, 391770706, 390551529, 389140472, 386651154, 383559532, 381369133, 379432755, 377222061, 374670334, 373085709]
962.5C73085709j462708k228546k515755k284126j967011k554054k678375k377548
970.2C55017586j874542k308960k987290k534103k699318l324051m288025m541855
977.9C30459442l789520m030037m359837m243660m567566n090656n006656m091130
985.6B95280380m433498m869118m781303n036259m194870l280468l239040l771134
993.3B61674690k927055k754994l133163k127380k293492k774505l027363k571564
1001.1B40065174k471867k073860j948471k687149j965675j762657j129456j460152
1008.8B24565887j816368j691227j961021j228790j847458k191849k407742j900005
1016.5B09521427j913986j936894j627655k795276j876087k247792k211342j792469
$$ y = [373085709, 371623001, 369394455, 366878700, 364594574, 362627563, 360073509, 357395134, 355017586, 353143044, 350834084, 347846794, 345312691, 342613373, 339289322, 335001297, 330459442, 326669922, 322639885, 318280048, 314036388, 309468822, 304378166, 299371510, 295280380, 290846882, 285977764, 281196461, 276160202, 271965332, 268684864, 265445824, 261674690, 258747635, 255992641, 252859478, 250732098, 248438606, 245664101, 242636738, 240065174, 237593307, 235519447, 233570976, 230883827, 228918152, 227155495, 226026039, 224565887, 222749519, 221058292, 219097271, 217868481, 216021023, 213829174, 211421432, 209521427, 207607441, 205670547, 204042892, 201247616, 199371529, 197123737, 194912395, 193119926]
1024.2A93119926j814708j340924j787929o67763j324119j475296j461773j195755
1031.9A82051659j085148j124439J132907K2831N44911J060066L87135J112270J280937
1040.6A85383129J734905O23608P80697O08539K96174m1161k43416q7376j733589j208248
1050.2A86113262m25854j34410j384640j795616j010914j118851M8828p53364l46737
1058.9A79191704J36013M51584R24682J713925K590580R49688J399383J193066K178192
1067.6A90728817K210865P62692J013469L49941J194382J76602J9741N74226K78473
1076.3A97309208M63085o0520L86505J0662J199341J344643Q78067J197338J120910
1085B03849239J192894k2621J031494J835919J776561J508847J729259J913357J160812
$$ y = [193119926, 191305218, 189964294, 188176365, 187508602, 186184483, 184709187, 183247414, 182051659, 180966511, 179842072, 180974979, 180997810, 181542721, 182602787, 182989922, 184102192, 185383129, 187118034, 187741642, 188522339, 189130878, 189427052, 189385891, 189142475, 189055099, 187321510, 186113262, 185687408, 185552998, 184168358, 182372742, 181361828, 180242977, 180291805, 179538441, 179191704, 179327717, 179779301, 180703983, 182417908, 185008488, 185958176, 187357559, 188550625, 190728817, 192939682, 193702374, 194715843, 195065784, 196260166, 196436768, 196456509, 197030735, 197309208, 197772293, 197711773, 198098278, 198108940, 199308281, 200652924, 201530991, 202728329, 203849239, 205042133, 205019512, 206051006, 207886925, 209663486, 211172333, 212901592, 214814949, 215975761]
1093.6B15975761J357079Q43697J889343J675834J329537J394691P63207J339779O13155
1102.3B27182083J465912J606636R47132N23701P45964J412373L26385R32846O72283
1111B35815315O76193N16282K63309J293869Q96168Q47721L30791O48232j85871l05653
1120.6B40796356O94180l33977J61781J92128N58624R85107J624737J740150J030102
1129.3B47449188J569004J452198K620964K616635K022552J803093J506233K158509
1137B63198376K468567K488441J191750J408653J215515N12829J221599P52335L70178
1145.7B74828243J87798P87277P07588K13452k49482p79323J33p05318r62391k7084
1155.4B74000893M22992m23908j384106j440582j833896l22972o7272l07846Q11005
$$ y = [215975761, 217332840, 218176537, 220065880, 221741714, 223071251, 224465942, 225229149, 226568928, 227182083, 228647995, 230254631, 231201763, 231725464, 232471428, 233883801, 234210186, 235143032, 235815315, 236491508, 237007790, 237271099, 238564968, 239461136, 240308857, 240639648, 241287880, 241102009, 240796356, 241490536, 241156559, 241318340, 241510468, 242069092, 243054199, 244678936, 246419086, 247449188, 249018192, 250470390, 253091354, 255707989, 257730541, 259533634, 261039867, 263198376, 265666943, 268155384, 269347134, 270755787, 271971302, 272484131, 273705730, 274458065, 274828243, 275016041, 275803318, 276510906, 276724358, 276474876, 275695553, 275695686, 274990368, 274027977, 274000893, 274423885, 273999977, 272615871, 271175289, 269341393, 269018421, 268951149, 268643303, 269454308]
1164B69454308J188163J828862J986694K443161K275123K268830K800388K836857L102665
1172.7B90185051L419399L300419K485790K613335L425198L447914K965793K584744
1180.4C14427643K415924L065414K798043J969299J981087J516838J685295J798210
1188.1C31657753J280708P12014M39529L23601J58233J8273m52919l85399k59743k46467
1197.8C33245583p71981j091232q02422j011314r02443r42268q47702p55120p98492
1206.5C25322609n64957o35376m8713K4948l84827n3444k02827k98538l42675o39610
1216.1C22176590m61044m12217k86712q507n73196m63620j61628o73371m87880p87831
1225.8C17860584r03454l53088o85825j150685j086158m88892m28276m96922l38344
$$ y = [269454308, 270642471, 272471333, 274458027, 276901188, 279176311, 281445141, 284245529, 287082386, 290185051, 293604450, 296904869, 299390659, 302003994, 305429192, 308877106, 311842899, 314427643, 316843567, 319908981, 322707024, 324676323, 326657410, 328174248, 329859543, 331657753, 332938461, 333650475, 334090004, 334413605, 334571838, 334590111, 334137192, 333751793, 333492050, 333245583, 332473602, 331382370, 330579948, 329568634, 328666191, 327723923, 326876221, 326121101, 325322609, 324757652, 324122276, 324073563, 324098511, 323713684, 323660240, 323457413, 323158875, 322816200, 322176590, 321715546, 321303329, 321016617, 321008110, 320434914, 319971294, 319809666, 319136295, 318648415, 317860584, 316957130, 316604042, 315918217, 314767532, 313681374, 313192482, 312764206, 312267284, 311928940]
1234.4C11928940n95780l39622k66552l07369l46222l52783P3070p5817k03743j76888
1244.1C09337234j77307l89862o04477m01706l37124j20850r2468j00861m4212j0319
1253.7C07058048M1065n0258m0360l52726k55355J77192M61540M63086K50244M55398
1263.4C08207874N79987M11167L56369R40113Q54340J004486J484966Q06236P27883
1272C15373421Q71143J069679Q97084Q84265J385212J243134J175537R59206J147423
1280.7C25006104J212692R69658J210632J327171J226578J418686J494675J241035
1288.4C35107231J480522J210327Q98018P77016Q30688P80564N05333N92041L27453
1297.1C42509193M92211J71470L90816P66106J69563J67771l0060p9079m13589m43306
$$ y = [311928940, 311333160, 310993538, 310726986, 310419617, 310073395, 309720612, 309793682, 309717865, 309514122, 309337234, 309159927, 308770065, 308165588, 307763882, 307426758, 307305908, 307213440, 307112579, 307068367, 307058048, 307099113, 307048855, 307008495, 306655769, 306400414, 306577606, 307039146, 307502232, 307752476, 308207874, 308787861, 309199028, 309555397, 310495510, 311349850, 312354336, 313839302, 314645538, 315373421, 316244564, 317314243, 318211327, 319095592, 320480804, 321723938, 322899475, 323858681, 325006104, 326218796, 327188454, 328399086, 329726257, 330952835, 332371521, 333866196, 335107231, 336587753, 337798080, 338696098, 339473114, 340303802, 341084366, 341589699, 342181740, 342509193, 343001404, 343172874, 343563690, 344329796, 344499359, 344667130, 344637070, 344557991, 344144402, 343701096]
1306.8C43701096m70734o77719n15709o37360n73539o86112k41508o21758p60078j24626
1316.4C38391953j57929M52690L59726M67835O61125N69572J015053J094704J043930
1325.1C43898659O36482M18396j10283j68114l07426o94389p65496q76426l14675m68483
1334.7C41248245k76603l3570J55373M04701l35083P6218M27131R01146N82543M50782
1344.4C43600883R89457N03387Q54378O63338L93371q1367k68479m03785n91622p2937
1354C45586624n66788l06320k31972j10626l57132m97589m57802j157722j01357q14285
1363.7C40985031l76587l24707j028747l47824p73049k43072l97377o38314k98195
1372.3C36557159J57776J97068o65207L19328j42899p7018j4458j69182j06277o70853
$$ y = [343701096, 343230362, 342552643, 342036934, 341399574, 340826035, 340139923, 339898415, 339276657, 338516579, 338391953, 338234024, 338686714, 339046440, 339514275, 340175400, 340744972, 341760025, 342854729, 343898659, 344535141, 344953537, 344843254, 344675140, 344367714, 343673325, 342907829, 342031403, 341716728, 341248245, 340971642, 340938072, 341093445, 341498146, 341163063, 341239281, 341666412, 342567558, 343150101, 343600883, 344590340, 345093727, 345948105, 346611443, 347004814, 346923447, 346654968, 346251183, 345659561, 345586624, 345019836, 344713516, 344481544, 344370918, 344013786, 343516197, 343058395, 341900673, 341799316, 340985031, 340608444, 340283737, 339254990, 338907166, 338134117, 337891045, 337493668, 336855354, 336557159, 336714935, 336912003, 336246796, 336566124, 336423225, 336346207, 336331749, 336162567, 336056290, 335385437]
1382C35385437o32133j160622r11827r28688o81153j536216j502495m03404j602860
1390.7C26026039j527443j392708r93614k167110l822956j895752k155629j143817
1398.4C10927010k482415k863388j512623k257862j749954j619396l003426k977314
1406.1B92460632j216488j398582k148953j826572j915264j179199j084786r59224
1413.8B80731564j156464j433716o70051r23176L45688k042103j532860N55267r7408
1422.5B73776741O00891r35020K87838J075992M81434J052494N38387R51577K05364
1431.2B78035698J155033J390247J089802J874333J259613R06639R11922K641125J893501
1439.8B91157913J242218J170082O83461J667709J039925J473560J227341J371955
$$ y = [335385437, 334753304, 333592682, 332680855, 331752167, 331071014, 329534798, 328032303, 327628899, 326026039, 324498596, 323105888, 322112274, 319945164, 316122208, 314226456, 312070827, 310927010, 308444595, 305581207, 304068584, 301810722, 300060768, 298441372, 295437946, 292460632, 291244144, 289845562, 287696609, 285870037, 283954773, 282775574, 281690788, 280731564, 279575100, 278141384, 277471333, 276548157, 276893845, 274851742, 273318882, 273874149, 273776741, 274377632, 273442612, 273730450, 274806442, 275287876, 276340370, 276878757, 277830334, 278035698, 279190731, 280580978, 281670780, 283545113, 284804726, 285711365, 286623287, 289264412, 291157913, 292400131, 293570213, 294253674, 295921383, 296961308, 298434868, 299662209, 301034164]
1447.6C01034164N16472Q60100K459126J330185J577320J067409K081986K088546J263523
1456.2C14278831K432862l6411L892803J630134K247238J875458J540261K617301N41001
1464.9C31019478K296829K508392L158112K495193K550545L634415K524528L295212
1472.6C53482704K732353L494187L087501L038979K468147K162361K243080J757241
1480.3C74466553K375984J976318K085038J993675J267738J681900J346474P14607
1488.1C87908287J114044J49193q12874K61994K88772n86815l18374n35508n202484
1496.7C82266235j36146o64597l008079n26047r73167r39866p63549Q31375J403274
1505.4C77489433k246093m368287j687431K12708j353569j67237q14209j695938l17612
$$ y = [301034164, 301550636, 302410736, 304869862, 306200047, 307777367, 308844776, 310926762, 313015308, 314278831, 316711693, 316675282, 320568085, 322198219, 324445457, 326320915, 327861176, 330478477, 331019478, 333316307, 335824699, 338982811, 341478004, 344028549, 347662964, 350187492, 353482704, 356215057, 359709244, 362796745, 365835724, 368303871, 370466232, 372709312, 374466553, 376842537, 378818855, 380903893, 382897568, 384165306, 385847206, 387193680, 387908287, 389022331, 389171524, 388358650, 388620644, 388909416, 388322601, 388004227, 387468719, 382266235, 382130089, 381465492, 378457413, 377931366, 376958199, 376018333, 375254784, 376086159, 377489433, 375243340, 370875053, 369187622, 369400330, 368046761, 367879524, 367065315, 365369377, 365051765]
1514.1C65051765q16993m29039j607628k453919R79767J596108j278916k073555J182900
1522.8C60150490J231041J936111k66342K42920J526871M47845n0201P11975J045418
1531.5C66976128O09932K16674j705894J513405J247864Q56781K044067k047653j607666
1540.1C68103638K264747Q40798l45078J384468J007500j528893J831131J409226J380081
1548.8C76347618J295891n10216N23377Q27674J612740j869965n1918K304306J953049
1557.5C82432556P44858l037911k256813o24084Q26569p84607n72663k126045l002930
1566.2C71598930j062050j246337p6256p677765k060623j201554l036842k320557k417450
1574.9C50499496p37075j2066231k470703k700691m024506l552551n155011l766307
$$ y = [365051765, 364234772, 363805733, 362198105, 359744186, 360723953, 362320061, 361041145, 358967590, 360150490, 361381531, 363317642, 363051300, 363294220, 364821091, 365268936, 365218735, 365930710, 366976128, 367586060, 367802734, 366096840, 367610245, 368858109, 369714890, 371758957, 369711304, 368103638, 370368385, 371209183, 370864105, 372248573, 373256073, 371727180, 373558311, 374967537, 376347618, 377643509, 377133293, 377656670, 378484344, 380097084, 378227119, 378175201, 380479507, 382432556, 383177414, 380139503, 377882690, 377258606, 378085175, 377300568, 376727905, 374601860, 371598930, 370536880, 369290543, 369214287, 361536522, 359475899, 358274345, 355237503, 352916946, 350499496, 349762421, 337696190, 335225487, 332524796, 328500290, 324947739, 319792728, 316026421]
1582.6C16026421n335522l210278m954071m617233m432163n169487l244457n406933
1590.3B79656277k854576n203152l628178l678303m725112l002339m890995k101440
1598B49572182m268799k333145l248997l226547k391491m076538r75533l198051q73604
1606.7B24979477k735653j494045j111164k823735k12841k561130J30558j803818M42696
1615.4B12810345K39696n138511J462574j469956P90119j341381J149063k29568k321129
1624B05951252J364727n96828J957263j606121R30062L63445J95313P45849l83987
1632.7B08920975K205143n76592J291943n12371K147865J150894O73027K099056J29776
1641.4B17529716K722245L65238J812572J586647j0967K949963j499767L239059N64823
$$ y = [316026421, 310690899, 307480621, 302526550, 297909317, 293477154, 288307667, 285063210, 279656277, 276801701, 271598549, 267970371, 264292068, 259566956, 256564617, 251673622, 249572182, 245303383, 242970238, 239721241, 236494694, 234103203, 230026665, 229051132, 225853081, 224979477, 222243824, 220749779, 219638615, 216814880, 216602039, 214040909, 214171467, 212367649, 212810345, 213050041, 207911530, 209374104, 207904148, 208694267, 207352886, 208501949, 208272381, 205951252, 207315979, 206719151, 208676414, 207070293, 208000355, 208363800, 208559113, 209304962, 208920975, 211126118, 210549526, 211841469, 211329098, 213476963, 214627857, 215300884, 217399940, 217529716, 220251961, 220617199, 222429771, 224016418, 224005451, 226955414, 225455647, 228694706, 229259529]
1650.1B29259529K707138K368794K48909J830444j153831L927497J077729K160625
1657.8B42426834J340103K452698K500458J848202M093933O53610L203029K136860
1665.5B60655727K869378L033065L118801M537373J444492M696160K318020L832664
1673.2B86505680L688831L236371L361873L450794M648991L188267N116043K752895
1680.9C15949745M155541N949745L587875M967537J343231N660210M156227M530144
1688.6C50300255N274315L972816M588394M291153N240059N443802O199761K182617
1696.4C87493172M582634O044616N796280N784378n33294O398124N241776M235649
1704.1D25043335L366814M143333K999001K286453L958092K963905K600250K397232
$$ y = [229259529, 231966667, 234335461, 234584370, 236414814, 235260983, 239188480, 240266209, 242426834, 243766937, 246219635, 248720093, 250568295, 254662228, 255315838, 258518867, 260655727, 263525105, 266558170, 269676971, 274214344, 275658836, 280354996, 282673016, 286505680, 290194511, 293430882, 296792755, 300243549, 304892540, 308080807, 313196850, 315949745, 320105286, 326055031, 329642906, 334610443, 335953674, 341613884, 345770111, 350300255, 355574570, 359547386, 364135780, 368426933, 373666992, 379110794, 385310555, 387493172, 392075806, 398120422, 403916702, 409701080, 409167786, 415565910, 420807686, 425043335, 428410149, 432553482, 435552483, 437838936, 441797028, 444760933, 447361183, 449758415]
1711.8D49758415K656479L448105J397209Q34274M026146N151635l506241P78999L171005
1720.5D67716026K221489J753311J022225J181679J515541J169319J141319J872521
1728.2D79593430K565040O36254O82334L743630M123573q0147m050750L738937M012375
1736.9D94964676J966171L091088J887664r23729M312554M187584J928329K371254
1744.6E13785591M238625M262962L179092L337288K301445M958420K976303J642914
1752.3E40682640N590096M221649L910293L945542J396064K218400L319931L226127
1760E68510742L999939M23279L77464L916512K403869K127839K771492K492981r96895
1768.7E86027222K335128N088997J682244j426010k114182L915291K905197N2185K516327
$$ y = [449758415, 452414894, 455862999, 457260208, 458094482, 462120628, 467272263, 463766022, 464545021, 467716026, 469937515, 471690826, 472713051, 473894730, 475410271, 476579590, 477720909, 479593430, 482158470, 482794724, 483477058, 487220688, 491344261, 491264114, 487213364, 490952301, 494964676, 496930847, 500021935, 501909599, 500985870, 505298424, 509486008, 511414337, 513785591, 518024216, 522287178, 525466270, 528803558, 531105003, 536063423, 539039726, 540682640, 546272736, 550494385, 554404678, 558350220, 559746284, 561964684, 565284615, 568510742, 572510681, 572933960, 573311424, 577227936, 579631805, 581759644, 584531136, 587024117, 586027222, 588362350, 593451347, 595133591, 593707581, 591593399, 595508690, 598413887, 598466072, 600982399]
1777.4F00982399J307487K060891J148796q91495Q94279J908570J946945L8490O25153
1786F10021515J805458J675491J366883K292022J350441Q13523j422043j400566L907089
1794.7F20409813J287918n30357J878624K485237O80237q82950K873878M11530R3307
1803.4F28707237J601296P98378J266098O53190O89278J377945J841812n63774O27212
1812.1F36998672J442605O53991J309929n0430J036529l3187K15530J164780L91998
1820.8F43130417J778946L93448J298217J364212k277984j82572K167511K502060Q4916
1829.4F50259171l741074O88934K909699P33566O52313P16172O84051O26526o16913
1838.1F52912445O87409k96021P53326J025086J849289J910248n216751J640625K287597
$$ y = [600982399, 602289886, 604350777, 605499573, 604608078, 605502357, 607410927, 609357872, 609396362, 610021515, 611826973, 613502464, 614869347, 617161369, 618511810, 619325333, 617903290, 616502724, 620409813, 621697731, 621167374, 623045998, 625531235, 626211472, 625328522, 628202400, 628613930, 628707237, 630308533, 631106911, 632373009, 633026199, 633715477, 635093422, 636935234, 636371460, 636998672, 638441277, 639095268, 640405197, 640354767, 641391296, 641358109, 641573639, 642738419, 643130417, 644909363, 645302811, 646601028, 647965240, 645687256, 645504684, 647672195, 650174255, 650259171, 646518097, 647207031, 650116730, 650850296, 651502609, 652218781, 652902832, 653529358, 652912445, 653599854, 653303833, 654057159, 655082245, 656931534, 658841782, 653625031, 655265656, 657553253]
1846.8F57553253L84598l32108L91541J170120m20456M41284j525P53631O88934L39203
1856.4F60968475Q37479q0795M61273m13818J74407j35040K51770M64401O11J445846
1866.1F63974609M33350J489258n55268j610260R66721P64542M73480o82068J89362
1874.8F65443726o0273N02167O54831K38953O46743R156P98187j15814L53012K594
1884.4F68473282o93665K32849q6746J155472J87759j016235N72968J231079K38800
1893.1F70295563J33362k6169j178589N64270N8670K6855K17667L26157P04498P3395
1902.7F71195679P56530m73251j97067N2261j66855L7690j77689L41797k14462J076202
1912.4F72230835L59344L56751K84042k13241J368561j807251j144410N60227M69055
$$ y = [657553253, 657937851, 657605743, 657997284, 659167404, 658746948, 659188232, 659186707, 659940338, 660629272, 660968475, 661805954, 661725159, 662186432, 661772614, 661947021, 661811981, 662063751, 662528152, 662528763, 663974609, 664407959, 665897217, 665341949, 663731689, 664698410, 665462952, 665936432, 665254364, 665443726, 665383453, 665885620, 666540451, 666779404, 667426147, 667435303, 668233490, 668117676, 668470688, 668473282, 667779617, 668012466, 667925720, 669081192, 669268951, 668252716, 668825684, 670056763, 670295563, 670428925, 670402756, 669224167, 669788437, 669847107, 669873962, 670091629, 670417786, 671122284, 671195679, 671952209, 671478958, 671281891, 671334152, 671167297, 671204987, 671027298, 671369095, 671154633, 672230835, 672590179, 672946930, 673230972, 673017731, 674386292, 672579041, 671434631, 671994858, 672463913]
1921.1F72463913J068954k47039l18756M02908O03866l62243J05438j68915m22439
1929.7F73125687R1781m55627K2201k02942P31049N06592L54462K49557m43878K8839
1939.4F74007721r99222O21262L0517j933899M71039Q52432K22168j75247P47681J39084
1949F73983536j28556q0642m55399n14374m36782N26275j44806L34626K86026N3329
1958.7F73423233K72217j97220J36414q26035k27203m7455j96076k7389o40640p9804
1968.3F71590042K03018P90940N8899P5988m4479l62473L11127k40021k14538n02777
1978F71665726L7536J20850L53470N82275k06833J9532n05982j18942m69971k15149
1987.6F71262512K33917n04531L32641J91879n1269r5673M27857K9831m33045l09601
$$ y = [672463913, 673532867, 673285828, 672967072, 673369980, 673973846, 673611603, 673717041, 673548126, 673125687, 673217468, 672761841, 672784042, 672581100, 673312149, 673818741, 674173203, 674422760, 673978882, 674007721, 673008499, 673629761, 673660278, 671726379, 672197418, 673049850, 673272018, 673096771, 673844452, 673983536, 673854980, 673774338, 673318939, 672804565, 672367783, 672894058, 672749252, 673083878, 673369904, 673423233, 673695450, 673498230, 673634644, 672808609, 672581406, 672533951, 672337875, 672310486, 671669846, 671590042, 671793060, 672584000, 672642899, 672718887, 672674408, 672311935, 672623062, 672383041, 672168503, 671665726, 671703262, 671824112, 672177582, 672759857, 672553024, 672572556, 672066574, 671947632, 671477661, 671262512, 671496429, 670991898, 671324539, 671516418, 671465149, 671369476, 671797333, 671827164, 671394119, 671084518]
1997.2F71084518q30154j45493j75018J97907o4698K05384M93393l30048J08795n60379
2006.9F69984207j93100k12631k65274j82648n22613J26266k09656K25296o0043r6512
2016.5F68593292m81186n84945R7351l36762K27204n17655J13220K70615m79126m2953
2026.2F66859055m31290J45645m89883l30964j29470l45841L3798k51922R1476o0882
2035.8F65089722R5596l37219k16141k54974l49732M6387n03235j81274n85175L37067
2045.5F63141022K84042j47171K64359n31769J7242m01306n2795k13700l74527R2392
2055.1F62077789l13186K33154j94702L85437j23596k14005M6082o82145J40381l62472
2064.7F60992737j66855m33960n7449L25470k71149K19192j27792K60162l29132k11105
$$ y = [671084518, 670254364, 670108871, 669933853, 670131760, 670067062, 670272446, 670765839, 670435791, 670544586, 669984207, 669791107, 669578476, 669313202, 669130554, 668607941, 668734207, 668524551, 668749847, 668689804, 668593292, 668112106, 667527161, 667624512, 667287750, 667514954, 666997299, 667110519, 667381134, 666902008, 666859055, 666427765, 666573410, 666083527, 665752563, 665623093, 665277252, 665311050, 665059128, 665150604, 665089722, 665185318, 664848099, 664631958, 664376984, 664027252, 664073639, 663570404, 663389130, 662803955, 663141022, 663425064, 663277893, 663542252, 663010483, 663027725, 662626419, 662573624, 662359924, 661985397, 662077789, 661764603, 661997757, 661803055, 662188492, 662064896, 661850891, 661896973, 661214828, 661355209, 660992737, 660825882, 660391922, 660334473, 660659943, 660388794, 660607986, 660480194, 660740356, 660411224, 660200119]
2074.4F60200119O2256k48261o2942l69949L82385k3957J05286k16751k05841L57666
2084F59980011m78287l26767o04477j82190l67889m5929L18375k69242J25428m46778
2093.7F57702255j43509k72674k55280l29895k77939L35007k43759J74637k21176r2621
2103.3F56375046p6752k01645P401l82996o6986o44150O3553q5754m66462k5787K1820
2113.9F54517288L85208n83648r6054n3406l04184k56500k45285J92794j97754K32773
2123.6F53591232k69088K38571K92206k09122J44348n26657j68610m39300j22223M2953
2133.2F52574310K49024K88086l06168M14887j35956Q8196k49634l79715K6245k83432
2142.9F52285843K33536j12763J98822k61230J5106M80270k2583O0959l50342K08359
$$ y = [660200119, 660262375, 660014114, 659951172, 659581223, 659963608, 659939651, 660044937, 659828186, 659622345, 659980011, 659501724, 659174957, 658570480, 658388290, 658020401, 657974472, 658292847, 658023605, 658149033, 657702255, 657558746, 657286072, 657030792, 656700897, 656422958, 656757965, 656514206, 656688843, 656467667, 656375046, 656298294, 656096649, 656104050, 655721054, 655654068, 655009918, 655073471, 654987717, 654521255, 654495468, 654517288, 654902496, 654318848, 654222794, 654169388, 653865204, 653608704, 653363419, 653556213, 653358459, 653591232, 653322144, 653560715, 653852921, 653643799, 653788147, 653261490, 653092880, 652653580, 652531357, 652574310, 652823334, 653111420, 652805252, 653220139, 653084183, 653172379, 652922745, 652543030, 652569275, 652285843, 652519379, 652406616, 652605438, 652344208, 652359314, 652839584, 652817001, 652877960, 652527618, 652735977]
2152.5F52735977j88675p7209m3488k43988K27814K9755N76705N0507R1171L3417k3498
2163.1F53168488k2736m76074J58844j64032K20413M0512K30560O35147k41699j92566
2172.8F53356857Q1406M40216m82407n82275l51257K43606Q40073j70975K17819Q7357
2182.4F53680420J31073J36490L12347J68076o31409J53656j10855Q5983O0349K74429
2192F54260559L94516k02560K05383j76697K82593l52783o41785M6005o0424J13372
2201.7F53868179j2664O86035M77752K90604j51901k42310L44238k04391j41068m79812
2211.3F54434662O6452L77426L28369K86026r1400J68152k39105K46124p8278k84500
2221F55213928j07879k25983J1749p2403O22864J15128K90451K0828n05448j57394
$$ y = [652735977, 652547302, 652470093, 652426605, 652182617, 652410431, 652440186, 653016891, 653067398, 653158569, 653191986, 653168488, 653145752, 652669678, 652828522, 652664490, 652884903, 652925415, 653155975, 653791122, 653549423, 653356857, 653438263, 653878479, 653396072, 652813797, 652462540, 652706146, 653546219, 653375244, 653593063, 653680420, 653811493, 653947983, 654260330, 654428406, 653796997, 653950653, 653839798, 653925781, 653986130, 654260559, 654655075, 654452515, 654657898, 654481201, 654763794, 654411011, 653769226, 653815231, 653754807, 653868179, 653855515, 654541550, 655019302, 655309906, 655158005, 654915695, 655259933, 655055542, 654914474, 654434662, 654501114, 654878540, 655206909, 655492935, 655401535, 655569687, 655330582, 655576706, 655498428, 655213928, 655106049, 654880066, 654891815, 654819412, 655442276, 655557404, 655847855, 655868683, 655363235, 655205841]
2230.6F55205841m36401J95770k43759J47781J99127K7161K20032n2643O13251k93274
2240.3F55582886j99967k65274j00403J42060n14603L50189N5695K79236k98157m79050
2249.9F54552612L52021m0665M7150o4011K97775m56314k96478L09295m7454J72424
2259.5F54826355l052M96292K20261R4833l36609n37567k9144q3694K34603j66626
2269.2F54715652K52305q3008j81351J09177l01438R1706j19248J67618k53601k11029
2278.8F54186783l18985k19345O70471j02158L3799j55182J39084j39313m17023L81165
2288.5F54059296k71302J86615k9754K9754l8452m55017L47519M02374K89383o31561
2298.1F53888855k35672K51389j62201m31595m31977K21787J36948N02548k1057J04599
$$ y = [655205841, 654769440, 654965210, 654721451, 654869232, 655068359, 655095520, 655315552, 655262909, 655876160, 655582886, 655382919, 655117645, 655017242, 655159302, 654644699, 654994888, 655050583, 655329819, 655031662, 654552612, 654904633, 654863968, 654911118, 654847107, 655144882, 654688568, 654392090, 654701385, 654653931, 654826355, 654823303, 655319595, 655539856, 655634689, 655298080, 654760513, 654731369, 654647675, 654882278, 654715652, 654967957, 654884949, 654703598, 654812775, 654511337, 654603043, 654483795, 654651413, 654397812, 654186783, 653867798, 653648453, 654318924, 654216766, 654250565, 654095383, 654234467, 654095154, 653678131, 654059296, 653787994, 653974609, 653944855, 653974609, 653936157, 653481140, 653828659, 654231033, 654520416, 653888855, 653653183, 653904572, 653742371, 653310776, 652878799, 653100586, 653237534, 653740082, 653719025, 653823624]
2307.8F53823624j41678o23322K69242j04065M67224l72849j01471P43485m45404P705
2317.4F53522491K77558K52914l36380l5095q1863k14157O07681N77698L23715q02613
2327.1F54091949k48870j39313O39267L77884n89829P99332n59921p04346n53589k30637
2336.7F52881927M13666N39398P1488j520691j81809k2048N20248K55279r75646m73938
2346.3F51507874o90232o31180L44468J528015j51673n07278P78046l7384n1346j75095
2356F51914215K543717J181106j290512j055374j217575J72882Q26950L87878j222305
2364.7F52240982k66876j025849J04065M77448k494965r67865r3841M5700j71051m85535
2374.3F47362213q69598j063690m30756n27420j00937p00531q48007l84903l78876
$$ y = [653823624, 653681946, 653058624, 653327866, 653223801, 653691025, 653318176, 653216705, 653960190, 653514786, 653522491, 653800049, 654052963, 653716583, 653681488, 653599625, 653385468, 653993149, 654570847, 654894562, 654091949, 653843079, 653703766, 654343033, 654720917, 654131088, 654930420, 654370499, 653666153, 653112564, 652881927, 653295593, 653834991, 653906479, 652385788, 652203979, 652181931, 652702179, 652957458, 651981812, 651507874, 650817642, 650186462, 650530930, 652058945, 651907272, 651399994, 652178040, 652140656, 652089310, 651914215, 654457932, 655639038, 654348526, 653293152, 652075577, 652248459, 653075409, 653463287, 652240982, 651974106, 650948257, 651052322, 651529770, 649034805, 648066940, 647973099, 648018799, 647847748, 647362213, 646492615, 645428925, 644998169, 644470749, 644369812, 643669281, 642821274, 642436371, 642057495]
2383F42057495l48892n58014j81885q3084j07574p10373o56510P3586l3760j57852
2392.6F39293137k93160K93999j6785m23317l65867o52352k81181j09863j39618m04778
2402.3F36900215j09672q3847N9509J14899p21093n03959n30815k74811P3051j23291
2411.9F34800186n02434n63583k15797n28374j91498k78130k33535o4736o1989o3552
2421.6F32096558o87485m72183n76439k6932j49612o32973j68991k16141O1722p51953
2431.2F28475571o68373l17574k97852j07193n75561k30980m24805j1634j73111l41835
2440.8F25326653m5891n69115j77765n40352m06189k77366m99955m13055l66249P935
2450.5F22038651k96669l02315p80983m23737j02501n70068k51999l95622k12746l32107
$$ y = [642057495, 641708603, 641150589, 640968704, 640885620, 640778046, 640067673, 639411163, 639484749, 639450989, 639293137, 638999977, 639293976, 639277191, 638853874, 638488007, 637835655, 637554474, 637444611, 637304993, 636900215, 636790543, 636706696, 636766205, 636881104, 636160011, 635656052, 635125237, 634850426, 634923477, 634800186, 634297752, 633734169, 633518372, 632989998, 632798500, 632520370, 632286835, 632222099, 632160110, 632096558, 631409073, 630936890, 630360451, 630333519, 630183907, 629550934, 629381943, 629165802, 629227524, 628475571, 627807198, 627489624, 627191772, 627084579, 626509018, 626278038, 625853233, 625841599, 625668488, 625326653, 625280762, 624711647, 624533882, 623993530, 623587341, 623309975, 622810020, 622396965, 622030716, 622038651, 621741982, 621439667, 620658684, 620234947, 620132446, 619562378, 619310379, 618914757, 618702011, 618369904]
2460.1F18369904o05927q38165k55699j5183n79758l75251q13713j22605n1918l72734
2469.8F14338951N5695k28272l93066q28209m62914n70869k21253l1814p88231n80254
2479.4F10289764p25479n41496n15366k00004m29497m96368L6125m82941l91655o98929
2489.1F05844154l42636m85382p64618l39279p10144k90031o50635m81148l20358m80156
2498.7F00979767p8163m46282p45430j078109k92092k31781o17828l29247m64630n04570
2508.3E96191635o45828j62583l36532k97508J106l89824q14171q30269k64206p33718
2518E91718102m46282j00212k72751m85344q34236k54555l38974m10118n01213j04561
2527.6E87969856k08702p41691k66266o30303m82902o08101m03328j144k20299j08223
$$ y = [618369904, 617763977, 616925812, 616670113, 616654930, 616075172, 615699921, 614886208, 614763603, 614711685, 614338951, 614394646, 614166374, 613773308, 612945099, 612482185, 611911316, 611690063, 611658249, 610870018, 610289764, 609564285, 609022789, 608507423, 608307419, 607877922, 607381554, 607417679, 606934738, 606543083, 605844154, 605501518, 605016136, 604251518, 603912239, 603202095, 602912064, 602261429, 601780281, 601459923, 600979767, 600901604, 600455322, 599709892, 598631783, 598339691, 598107910, 597490082, 597160835, 596696205, 596191635, 595545807, 595383224, 595046692, 594749184, 594750290, 594360466, 593546295, 592716026, 592451820, 591718102, 591271820, 591171608, 590898857, 590413513, 589579277, 589324722, 588985748, 588575630, 588074417, 587969856, 587761154, 587019463, 586753197, 586122894, 585639992, 585031891, 584628563, 584627419, 584407120, 584298897]
2537.3E84298897o18248o67153p86628j05591m7035q39539n86586n99670p0801m96
2546.9E79977150m1084m23889q42095o09856q45680n70526m87556r4033n2528l75786
2556.6E75634117l25279m13284j67046k58598l99590o98814o09551o63147p10792m94919
2566.2E70893097n87120J35460O2370k75001l28904m06685l08342n59501o58493o11992
2575.9E67354889l69301p30019l37104P400l01170j94016o44531k90680m61922p19566
2585.5E63313980k81525l41529m47236o81610l55606m66613m91906j56135j40763l53012
2595.1E59598045q13369p78733o69403l97300l20321k57225n19027m37851K9373m31519
2604.8E55002670m41284o69899o63452n60303o76460m80766m49410l28369q49571n40695
$$ y = [584298897, 583680649, 583013496, 582226868, 582121277, 582074242, 581234703, 580648117, 580048447, 579977646, 579977150, 579936066, 579512177, 578670082, 578060226, 577214546, 576644020, 576156464, 576062431, 576009903, 575634117, 575308838, 574895554, 574728508, 574469910, 574070320, 573371506, 572761955, 572098808, 571388016, 570893097, 570305977, 570441437, 570503807, 570228806, 569899902, 569493217, 569184875, 568625374, 567966881, 567354889, 566985588, 566255569, 565918465, 565925865, 565624695, 565430679, 564786148, 564495468, 564033546, 563313980, 563032455, 562690926, 562243690, 561562080, 561206474, 560739861, 560247955, 560091820, 559951057, 559598045, 558784676, 558005943, 557336540, 556939240, 556618919, 556361694, 555842667, 555404816, 555434189, 555002670, 554561386, 553891487, 553228035, 552667732, 551991272, 551510506, 551061096, 550732727, 549883156, 549342461]
2614.4E49342461k55967m37545l99094o14586o25954r22927l16964l34281p34292m47387
2624.1E44253464l79143k87819q53157p40471k41699j96533p05910n21507k69585r17244
2633.7E39140396n25055m72374j94740n85098j032448m15344n94216m40407o71272
2642.4E34209442n83687p44171o07300J8845m42543l39661p03582o56052l30429l54614
2652E29466248o66123j064796n89028m00429J95961k18505p40128n23872n03578k42463
2661.7E24713287o53000m84352o20613o54754j85395k34222n76859p19184o7940k62261
2671.3E20254707o9923j02959n65452l74031o01921n95360o57654k88773m18281n10903
2681E16069450j0604j81160o13022r37119l80821m65050n90477m36287l05557k51312
$$ y = [549342461, 549086494, 548648949, 548249855, 547635269, 547009315, 546086388, 545769424, 545435143, 544700851, 544253464, 543874321, 543586502, 542733345, 541992874, 541751175, 541554642, 540848732, 540327225, 540057640, 539140396, 538615341, 538142967, 537948227, 537363129, 536330681, 535915337, 535321121, 534880714, 534209442, 533625755, 532881584, 532274284, 532293129, 531850586, 531510925, 530807343, 530151291, 529820862, 529466248, 528800125, 527735329, 527146301, 526745872, 526941833, 526723328, 525983200, 525459328, 524955750, 524713287, 524060287, 523575935, 522955322, 522300568, 522115173, 521880951, 521304092, 520584908, 520516968, 520254707, 520184784, 520081825, 519516373, 519142342, 518540421, 517945061, 517287407, 516998634, 516580353, 516069450, 516058846, 515877686, 515264664, 514327545, 513946724, 513481674, 512891197, 512454910, 512149353, 511898041]
2690.6E11898041o70357r0904k17819k83623k35787m74243l87802p75680m09966m20113
2700.3E07931747l87878k14424j55220k75917q53386n09071k73362j8539k83051o34613
2709.9E04326286o32362n37376p1488k00844n0163l11699l33862l50609p32765p00989
2719.5E00404129p95593p1984j02958l13912n836K10609j35994q89511l97529l97339
2729.2D97504082k20642p820m15192o33049p22504j69411j31111p782P8087j17683
2738.8D95156975n29137n44968K3995j91612n8480n98182o93016m5052j94549J11923
2748.5D92437897j01471m50211l00903l8033l39126o41670k54288m46854m99496j14022
2758.1D89251823j34430k61383j20163n62248n08117j48240l65333j29204n25322m46777
$$ y = [511898041, 511227684, 511136780, 510918961, 510635338, 510399551, 509925308, 509537506, 508761826, 508351860, 507931747, 507543869, 507329445, 507174225, 506898308, 506044922, 505535851, 505262489, 505243950, 504960899, 504326286, 503693924, 503156548, 503085060, 502884216, 502834053, 502522354, 502188492, 501837883, 501105118, 500404129, 499608536, 499536552, 499433594, 499119682, 499113846, 499324455, 499188461, 498298950, 497901421, 497504082, 497283440, 497275620, 496860428, 496227379, 495504875, 495335464, 495204353, 495196571, 495274658, 495156975, 494627838, 494082870, 494106865, 493915253, 493856773, 493258591, 492565575, 492520523, 492325974, 492437897, 492336426, 491886215, 491585312, 491547279, 491208153, 490566483, 490312195, 489865341, 489365845, 489251823, 489117393, 488856010, 488735847, 488173599, 487665482, 487517242, 487151909, 487022705, 486497383, 486050606]
2767.8D86050606k35596n25627n59578l20930L71055k46277o64291o45561o49109k82707
2777.4D82291985l28598l36342p08313m58031m42734o32858l11699j86310m730l39355
2787D78543015m46358r68819j065559l47862m00048o27594n81627l05328o10313o04020
2796.7D72585487n67779q43048q29315q53425o73980o36215l41645o50139r50737q96988
2806.3D65342216q67919k92168m03137o81000r80682r04961q93860j021919o53954
2815D58642616q26568p96395p17048o73485r14307r02595p56722q46748p78084j402702
2824.7D50027962j118241j042709q89626m90264j161347j047554q67958o87103j082230
2833.3D41640930j146583r64127j585846j617622j760598j282806j322479j604080
$$ y = [486050606, 485815010, 485289383, 484729805, 484408875, 484779930, 484533653, 483869362, 483223801, 482574692, 482291985, 481963387, 481627045, 480918732, 480460701, 480017967, 479385109, 479073410, 478887100, 478882370, 478543015, 478096657, 477127838, 476062279, 475714417, 475314369, 474686775, 474105148, 473799820, 473189507, 472585487, 472017708, 471174660, 470345345, 469491920, 468817940, 468181725, 467840080, 467189941, 466239204, 465342216, 464474297, 464182129, 463778992, 463097992, 462117310, 461212349, 460318489, 459296570, 458642616, 457816048, 457019653, 456302605, 455629120, 454714813, 453812218, 453055496, 452208748, 451430664, 450027962, 448909721, 447867012, 446977386, 446487122, 445325775, 444278221, 443410263, 442723160, 441640930, 440494347, 439530220, 437944374, 436326752, 434566154, 433283348, 431960869, 430356789]
2841.1D30356789j737976k281685j900063k012977k199708k300453k546844k807160
2848.8D12569923k355613j892052k398605j402970q71544r92241n90324j28593N85556
2857.4D02523537J62391k05001j31913k12326m33426p02247q51288p36656o63948q82759
2867.1C97866364n65224q19664j093025r86824p43714l63731p03430p34406p85370
2875.8C91070976r22012p52754k97852n38330r49821n60112j164818j263352p09533
2884.4C83912392o43502r03244j077194j055984j303826o96182p70149j281586j223869
2893.1C74956856r56879r25903j371269o91872n96390q40683p91321q02841o93779
2901.8C67285919q02154k30484n92347j221389j431389j133194p11479j179390j148720
$$ y = [430356789, 428618813, 426337128, 424437065, 422424088, 420224380, 417923927, 415377083, 412569923, 410214310, 408322258, 405923653, 404520683, 403649139, 402656898, 402066574, 401937981, 402523537, 402685928, 402480927, 402349014, 402136688, 401703262, 401001015, 400149727, 399413071, 398749123, 397866364, 397301140, 396481476, 395388451, 394401627, 393657913, 393294182, 392590752, 391856346, 391070976, 390148964, 389396210, 389098358, 388560028, 387610207, 387050095, 385885277, 384621925, 383912392, 383268890, 382365646, 381288452, 380232468, 378928642, 378232460, 377462311, 376180725, 374956856, 373999977, 373074074, 371702805, 371010933, 370414543, 369573860, 368782539, 367979698, 367285919, 366483765, 366253281, 365660934, 364439545, 363008156, 361874962, 361163483, 359984093, 358835373]
2910.5C58835373j338806j136933j245765j703034j896438k090836j192360j137428
2918.2C47093773j258392j369400j631966j329041q13026k32506o81000k76260Q5907
2926.9C39588089J183L77769O2790J18484N33333N36843R1858K86941N79300Q54454
2936.5C43031044J029663Q76312J240158N60837M37203R84344J053505J080818M10042
2945.2C50703926L07961O23626J008644R20220M27208L76320N26123O57158K87704
2953.9C55838890M07524N54276J37901N7259N12733P37038P75337Q38203M22173O55174
2963.5C60936508P82166O62193Q05511P61872R00383R94453Q31185N95741J016388
2972.2C68286400P54127O62957Q25004L70484R00611N69230M91294P53441M24309M92363
$$ y = [358835373, 357496567, 356359634, 355113869, 353410835, 351514397, 349423561, 348231201, 347093773, 345835381, 344465981, 342834015, 341504974, 340691948, 340459442, 339778442, 339502182, 339588089, 339589272, 339967041, 340029831, 340148315, 340681648, 341218491, 341310349, 341597290, 342176590, 343031044, 344060707, 344937019, 346177177, 346738014, 347175217, 348159561, 349213066, 350293884, 350703926, 351011887, 351635513, 352644157, 353564377, 353991585, 354367905, 354894028, 355551186, 355838890, 356246414, 356800690, 356938591, 356995850, 357508583, 358245621, 359020958, 359859161, 360281334, 360936508, 361718674, 362380867, 363186378, 363948250, 364848633, 365843086, 366674271, 367270012, 368286400, 369040527, 369703484, 370528488, 370898972, 371799583, 372368813, 372860107, 373613548, 374037857, 374530220]
2981.8C74530220J98288J45721Q4496M21905M47388M19350L82042J13983N02548P3128
2991.5C77319069J65558l07083o97251J16196n8975j88790n49926m82331l18641k12593
3001.1C74785233j29853n54237n37567r00955q54912p14226m31252j47819n77545p80525
3010.8C69156342p12510l08151n28297p07741o61545n49126m34150n68848n31082p47566
3020.4C63407326m69742p65953p16095m16870j021958j130333j024665j79139k97165
3029.1C57385406q09021p91702r28039p91359j118737p01866p69005p72132p10335
3037.8C49993210j187363o69403o00166m71535r44900j341134n89828m52385j071167
3046.5C42665329j312904n64270p11899q86879o63262p73048r56001j052513n01900
$$ y = [374530220, 374728508, 374874229, 374958725, 375380630, 375828018, 376247368, 376629410, 376743393, 377245941, 377319069, 377484627, 377177544, 376480293, 376596489, 376537514, 376348724, 375798798, 375316467, 374997826, 374785233, 374655380, 374101143, 373563576, 372662621, 371807709, 371093483, 370662231, 370514412, 369936867, 369156342, 368443832, 368135681, 367607384, 366899643, 366238098, 365688972, 365254822, 364685974, 364154892, 363407326, 362937584, 362171631, 361455536, 361038666, 360016708, 358886375, 357861710, 357682571, 357385406, 356576385, 355784683, 354856644, 354065285, 352946548, 352244682, 351475677, 350703545, 349993210, 348805847, 348136444, 347536278, 347064743, 346119843, 344778709, 344188881, 343736496, 342665329, 341352425, 340788155, 340076256, 339189377, 338526115, 337753067, 336797066, 335744553, 335242653]
3055.1C35242653p68051r71871q34236o85844o42586j268387r00230m25339p38106
3063.8C28008003r55353m53414n49469j057282n04951l87764q21381r91478n30586
3072.5C21756325n64575r05076n32550l42274m41990q80852q82339q42762q88825n78918
3082.1C14896164l66612m70886p63931n94215r81274r68380l51696m82941p59315o42319
3091.8C08514595o14967j261120q37708m26464o53019p23934o32133l73230j199170
3100.5C01792850n29441M19q33816o54221p50599q48293j055565q33549p89338r23099
3110.1B94575348m30966m50706n10311o95419n23205q82740j022702n47485r01470
3118.8B88610344n15957m29764r73625j244278j100025p33471n63736l89881l85437
$$ y = [335242653, 334474602, 333502731, 332668495, 331982651, 331340065, 330071678, 329171448, 328746109, 328008003, 327052650, 326599236, 326049767, 324992485, 324487534, 324099770, 323278389, 322286911, 321756325, 321191750, 320286674, 319754124, 319411850, 318969860, 318089008, 317206669, 316363907, 315475082, 314896164, 314529552, 314058666, 313294735, 312700520, 311719246, 310750866, 310399170, 309916229, 309156914, 308514595, 307899628, 306638508, 305800800, 305374336, 304721317, 303997383, 303365250, 302992020, 301792850, 301263409, 301263828, 300430012, 299775791, 299025192, 298176899, 297121334, 296287785, 295498447, 294575348, 294144382, 293693676, 293183365, 292487946, 291964741, 291082001, 290059299, 289511814, 288610344, 288094387, 287664623, 286690998, 285446720, 284346695, 283613224, 283049488, 282659607, 282274170]
3127.5B82274170o13690j168136p65534m15191o54431p49530j158085q99105o79932
3136.1B75170536n25169n73788p24602r86404j472283o58226j22242n55400j135025
3144.8B68417397q99868k41433m70256r63746j308097p50828k20280k82154o86703
3153.5B62594032j027908j058407j056290p47337q81328m58222m69246p49283k70443
3162.2B55875568r22241j322231q90370j74579k46277p02858r13105j264572n77450
3170.9B48861885m14619o84758r89837q75492n25456p65381l5991m84791j324978q40321
3180.5B41920261m44889l07979m56810m90742r12056j134720j262913q89988k74391
3189.2B35745773n94482m40674n34344q12683n84583k97508n76268j053981o58074
$$ y = [282274170, 281660480, 280492344, 279726810, 279311619, 278657188, 277907658, 276749573, 275850468, 275170536, 274645367, 274071579, 273346977, 272360573, 270888290, 270230064, 270107822, 269552422, 268417397, 267517529, 267276096, 266805840, 265842094, 264533997, 263783169, 263562889, 263280735, 262594032, 261566124, 260507717, 259451427, 258704090, 257822762, 257364540, 256895294, 256146011, 255875568, 254953327, 253631096, 252740726, 252566147, 252319870, 251617012, 250703907, 249439335, 248861885, 248447266, 247762508, 246772671, 245897179, 245371723, 244606342, 244570351, 244085560, 242760582, 241920261, 241475372, 241167393, 240710583, 240219841, 239307785, 238173065, 236910152, 236020164, 235745773, 235151291, 234710617, 234176273, 233363590, 232779007, 232481499, 231905231, 230851250, 230193176]
3197.9B30193176m85821k65178m94709j148644p34043l05862l59783n52655q68683
3206.5B24977798q04119m77867p64160o53629j74427r6207k77672j001167p48425n01880
3216.2B19478245r17855n09204l02735p23896m89559J98975n43061j237106p22218
3224.9B14231586l13530l33690p21550n22194l16696j95999l37944r12304n57309l82003
3234.5B09638367n10826o50406r89437l37277J63040o55002j059723n70107j93329
3243.2B04835300j4209l99151p45163m33979o3419m40655q06484j05267j53999m36383
3252.8B01236591k29454m27475m82692o88038p10678k78950j20678m34895m97245l41797
3262.5A97024689l77560n04188n53837L3130l81641q53710k32182j06983j64890o67553
$$ y = [230193176, 229707355, 229442177, 228947468, 227798824, 227064781, 226758919, 226399136, 225846481, 224977798, 224173679, 223695812, 222931652, 222278023, 222103596, 222007389, 221729717, 220728550, 219980125, 219478245, 218560390, 218051186, 217748451, 217024555, 216534996, 216733971, 216190910, 214953804, 214231586, 213918056, 213584366, 212862816, 212340622, 212023926, 211827927, 211489983, 210577679, 210020370, 209638367, 209127541, 208477135, 207487698, 207150421, 207313461, 206658459, 205598736, 205028629, 204835300, 204821091, 204421940, 203676777, 203242798, 203179379, 202738724, 201932240, 201826973, 201672974, 201236591, 201007137, 200579662, 200096970, 199408932, 198698254, 198419304, 198298626, 197863731, 197366486, 197024689, 196647129, 196142941, 195589104, 195622234, 195240593, 194386883, 194154701, 194047718, 193882828, 193215275]
3272.1A93215275n03349j20354k74525k78816q78468o44474l96995j72558K68841l42236
3281.8A89872341l74870m13990p43523m35753k15702k99206J40381M22745m18548m13800
3291.4A87120075l87020o48632N5218j94168p02591l39279Q5277J12152m7645k28958
3301A84824429n53780k91729l23010n80520j15986j60770l91198j10359O4926j41334
3310.7A82220669j71890n4074p44476j004582n3997L2998m17672p000l80573q24890
3320.3A78594513j22337j69049m06894l67031n04857m27417k77443J2970m60472o11554
3330A75260429N2357l93486q14228n59521l17344m9763k31781n47962m68025l63255
3339.6A71567421j85356o0482l58505n12257p39174p18555p1278L8948j27773o0292
$$ y = [193215275, 192711926, 192591572, 192317047, 192038231, 191159763, 190515289, 190118294, 189945736, 190214577, 189872341, 189497471, 189083481, 188339958, 187904205, 187688503, 187389297, 187529678, 187952423, 187533875, 187120075, 186733055, 186084423, 186139641, 185945473, 185242882, 184903603, 184988880, 185101032, 185053387, 184824429, 184270649, 183978920, 183655910, 183075390, 182959404, 182798634, 182407436, 182297077, 182362003, 182220669, 182048779, 181994705, 181250229, 180245647, 180191650, 180224648, 179806976, 179799976, 179419403, 178594513, 178472176, 178303127, 177896233, 177529202, 177024345, 176596928, 176319485, 176332455, 175871983, 175260429, 175312786, 174919300, 174105072, 173545551, 173228207, 173178444, 172946663, 172398701, 171930676, 171567421, 171382065, 171321583, 170963078, 170450821, 169711647, 168993092, 168921814, 168960762, 168832989, 168772697]
3349.3A68772697n9700k61573J34315M61407m03328n78785l43247j37443L18489K480
3358.9A67905312j26915j17608l21941j29242j4629k61975j50222L1070j41010K88220
3368.6A66961060P0171m56925j26895j32847l872j09043l39737M1351J19591K0389
3378.2A66043243J2207K5254j8826J40419J62029k22892k59590o8322J37253J12972
3387.8A66063747K76356L15247l92456j49823O03276J79348m77524j61781L38497q2264
3397.5A66512623k98939K6779J07365L5477J33075J94912j03531J56746L22514L1433
3407.1A67118454J2856j69468L6487J21346K45495P15217K47269k82879k93732K64530
3416.8A68015575N38121K26535P21665P70550K899m37451m04129P1888J32561J37329
$$ y = [168772697, 168712997, 168451424, 168585739, 169047146, 168643818, 168065033, 167721786, 167584343, 167902832, 167905312, 167778397, 167660789, 167338848, 167209606, 167194977, 166933002, 166782780, 166813850, 166672840, 166961060, 167031231, 166574306, 166447411, 166314564, 166310692, 166201649, 165861912, 165903263, 166022854, 166043243, 166055450, 166080704, 166061878, 166202297, 166364326, 166141434, 165881844, 165813522, 165950775, 166063747, 166340103, 166655350, 166262894, 166113071, 166716347, 166895695, 166418171, 166256390, 166594887, 166512623, 166213684, 166240463, 166347828, 166383305, 166516380, 166711292, 166607761, 166764507, 167087021, 167118454, 167131310, 166961842, 166998329, 167119675, 167365170, 168080387, 168327656, 168044777, 167751045, 168015575, 168553696, 168780231, 169501896, 170272446, 170275345, 169837894, 169433765, 169505653, 169638214, 169775543]
3426.4A69775543M47045N11055N52883N47447L56655M29936K21042m5700J67503m0664
3436.1A72922745L5820N42087Q22487L48797k27127M92687O70662L31955J21880J80835
3445.7A76242828J108761N81494r8153L09010K86846J07365J91517O66484P66030P94182
3455.3A80956364M37431L67413Q12110M19560M64058M79584R8514K19307N92709M76818
3465A85323868K85835Q76579N44873N47657R77897J02635J00269Q06999Q57926L45459
3474.6A90769997M15363J212921Q76904K97165P97481R64508R4738k37560M10385R26666
3484.3A96528568O14033M54006R89571P63836N35354Q42438P68643N06019O51455J049805
3493.9B03703728P28740L70522N63869P05357N73139N71118J032142J212769Q02765
$$ y = [169775543, 170222588, 170733643, 171286526, 171833973, 172190628, 172620564, 172841606, 172795906, 172963409, 172922745, 172958565, 173500652, 174323139, 174671936, 174444809, 174937496, 175608158, 175940113, 176061993, 176242828, 177351589, 177933083, 177834930, 178143940, 178430786, 178538151, 178729668, 179396152, 180162182, 180956364, 181393795, 181761208, 182573318, 182992878, 183456936, 183936520, 184035034, 184254341, 184847050, 185323868, 185609703, 186486282, 187031155, 187578812, 188556709, 188659344, 188759613, 189566612, 190424538, 190769997, 191185360, 192398281, 193275185, 193572350, 194369831, 195334339, 195429077, 195191517, 195601902, 196528568, 197142601, 197596607, 198586178, 199350014, 199885368, 200727806, 201496449, 202002468, 202653923, 203703728, 204432468, 204802990, 205366859, 206072216, 206645355, 207216473, 208248615, 209461384, 210264149]
3502.6B10264149O29615Q98133P39479M66251N92346J240750P79991l06416R36699
3511.3B16240997J325341O45103N03292P35130J361733O40564K38838R00898R59644
3520B23551540J226693J462841Q62331J77937P14950J361141R26838J54896O40812
3528.6B31079979J489525J754570Q90178M17881J235199R47056J705857J323490l02067
3537.3B40541668J188297J325360J234283J301537J016902J325036J329803J049404
3545B50312290K65618J022319J108399J394329J427402J422329K257958Q03928Q53176
3553.7B60867748N77622J374950K649021J159306J199455J307755J598434Q48045J025162
3562.4B72607498J444569J593895M059658J473179M18605Q71926l6545K627163J488457
$$ y = [210264149, 210893764, 211791897, 212531376, 212997627, 213589973, 214830723, 215610714, 215304298, 216240997, 217566338, 218211441, 218714733, 219449863, 220811596, 221452160, 221690998, 222591896, 223551540, 224778233, 226241074, 227103405, 227281342, 227996292, 229357433, 230284271, 230439167, 231079979, 232569504, 234324074, 235214252, 235632133, 236867332, 237814388, 239520245, 240843735, 240541668, 241729965, 243055325, 244289608, 245591145, 246608047, 247933083, 249262886, 250312290, 250577908, 251600227, 252708626, 254102955, 255530357, 256952686, 259210644, 260014572, 260867748, 261445370, 262820320, 265469341, 266628647, 267828102, 269135857, 270734291, 271582336, 272607498, 274052067, 275645962, 279705620, 281178799, 281597404, 282469330, 282432785, 285059948, 286548405]
3571.1B86548405J738052J875382J458759J623478J761131J855888P32480K325611
3578.8B99919186J747913R76963J729069J955738J911697P39079L856869L022403k22187
3587.5C15636730J724587K1515K932186K725906K403565J890296Q31948L160972M11263
3596.1C31738968K265053L596458J205101K687187J098519J183853K855606J958694
3603.9C48589439J682015K775116L083038L96538L278274J404877K38762O441345J831017
3612.5C69720421j651802M318275J138268L382644M838486J787567J919213L60794
3620.3C85813866J647339L586807L070869K316971K793045L090630L290634O631012
3628D12241173J984176q273506M521904N668869N204544L125038O05660K474785L566055
$$ y = [286548405, 288286457, 290161839, 291620598, 293244076, 295005207, 296861095, 297593575, 299919186, 301667099, 302644062, 304373131, 306328869, 308240566, 308979645, 312836514, 315858917, 315636730, 317361317, 317382832, 320315018, 323040924, 325444489, 327334785, 328166733, 331327705, 331738968, 334004021, 337600479, 338805580, 341492767, 342591286, 343775139, 346630745, 348589439, 350271454, 353046570, 356129608, 356526146, 359804420, 361209297, 361448059, 367889404, 369720421, 368068619, 372386894, 373525162, 376907806, 381746292, 383533859, 385453072, 385813866, 387461205, 391048012, 394118881, 396435852, 399228897, 402319527, 405610161, 412241173, 414225349, 405951843, 410473747, 416142616, 421347160, 424472198, 425077858, 427552643, 431118698]
3636.6D31118698L612671J830750J817932L205375M142228K588005P73773K879524
3644.4D51968956M025536N918426J321640k198372O094399K674446O19278R0637M518661
3653D75033607M714737M052163O254654m646302J520462N676804K114410K492523J364480
3661.7D98577538K702217J828460K141075L044014J449051M858437L571815N20516
3669.4E18693123J441383n763130K325325R092979J0109253R27811j6195564K215347
3677.1E22846527Q545265N314980k320366M09546L192978J874084J552086J353607
3684.9E42768707Q65059M036293P607575p549172m582710Q991699m065132j378784
3692.6E46693535N183906J198502J280479K50702J23101J741829J047592L234672L850327
$$ y = [431118698, 434731369, 436562119, 438380051, 441585426, 445727654, 448315659, 449089432, 451968956, 455994492, 461912918, 463234558, 461036186, 467130585, 469805031, 470424309, 470514946, 475033607, 479748344, 483800507, 490055161, 485408859, 486929321, 492606125, 494720535, 497213058, 498577538, 501279755, 503108215, 505249290, 508293304, 509742355, 514600792, 518172607, 518693123, 520134506, 514371376, 516696701, 525789680, 535898933, 536826744, 520631180, 522846527, 531391792, 536706772, 534386406, 534795952, 537988930, 539863014, 541415100, 542768707, 543633766, 547670059, 555277634, 547728462, 543145752, 552137451, 548072319, 546693535, 551877441, 553075943, 554356422, 554607124, 554730225, 556472054, 557519646, 560754318, 564604645]
3701.3E64604645m695702l074951N009346K014046m35105J001969L556442M709244
3709E72689934o838303M121781O609840j4055748L235474M271469K78587J004219K514114
3717.7E73831367J878739l502007R05075N643044k012939l434144M121666J003151
3725.4E78433952j94549k237625j06316M075623O14395M576339j615219o783523J0039749
3734E86802826L333931r226723k766075R64928J481361K650681L757057l481865K657127
3742.7E86173248J3225365q820839j9662361R752197O312103O550179l067932j1604195
3750.4E78857765J1172066m097366p557373O321411M941597M161300n204620J549377
3758.2E90144157O220551p312126k396507L347320R19495N08995M536705j865502o012458
$$ y = [564604645, 559908943, 556833992, 561843338, 563857384, 563422279, 564424248, 567980690, 572689934, 565851631, 569973412, 576583252, 562527504, 565762978, 570034447, 570313034, 571317253, 573831367, 575710106, 572208099, 573113174, 578756218, 576743279, 573309135, 577430801, 578433952, 578239403, 576001778, 575895462, 579971085, 580585480, 585161819, 583546600, 576763077, 586802826, 590136757, 580910034, 578143959, 579108887, 580590248, 583240929, 586997986, 583516121, 586173248, 599398613, 590577774, 570915413, 580667610, 586979713, 593529892, 590461960, 578857765, 590029831, 585932465, 578375092, 584696503, 589638100, 593799400, 588594780, 590144157, 596364708, 589052582, 586656075, 590003395, 590922890, 591431885, 595968590, 594103088, 588090630]
3766.8E88090630L177108N744896J365738r663620P31316L204765K91939J512298j41258
3775.5E94313812Q27065L46412L034363R91516q615684K171402L008117J451493K446899
3784.2E99975395l344612j916733R42116J219330R23233k14424M30565l79258k92472
3792.9E97343140N9623J775971M207573l068085n995560J034661M846878P629814n154038
3801.5F02679977j1549301L246918K437630M847297P101593q273353n933113M199638
3809.3E98757286J707115J08147K51503p45087J419640O875458k17133j5486336M015351
3817.9E96685944O172256N323753M431725j7637787j130142M650841J711044L230438
3825.7F03438072P77855l704300j94893J309853L720970L107910q676414J342354P801895
$$ y = [588090630, 591267738, 597012634, 598378372, 588714752, 589446068, 592650833, 592942772, 594455070, 594313812, 595140877, 595487289, 598521652, 599513168, 590897484, 593068886, 596077003, 597528496, 599975395, 596630783, 594714050, 595656166, 596875496, 597798729, 597584305, 598014870, 597635612, 597343140, 597402763, 599178734, 603386307, 600318222, 594322662, 595357323, 600204201, 607834015, 602679977, 591130676, 594377594, 596815224, 601662521, 608764114, 600490761, 594557648, 598757286, 600464401, 600572548, 600824051, 600078964, 601498604, 608374062, 608156929, 592670593, 596685944, 602858200, 608181953, 612613678, 594975891, 593845749, 598496590, 600207634, 603438072, 604215927, 600511627, 600316734, 601626587, 605347557, 608455467, 599779053, 601121407, 608923302]
3834.3F08923302n311852q14934R355088q426094o740113P721825m268646q63533O685486
3843F06260529k199440m563790K510147J617317n76019J568718o18591J865387P342415
3851.7F13206673k659645K799491j7375297k471924J1047096j039352k582665K050133
3859.4F02974510K166710K876244n336533k84080O616745n677948o166459L993416
3867.1F01162605N946503O970558o888542j1057510L292312O736908M451485r860268
3874.8F00754051q87260L743324K86217K688713M709778n224953q698044M784508J573257
3883.5F03729591K438813P356529j2744713j303444L602944N66597N163574M92935
3891.2F09302826q876228J6441L200188q61245J264458J468315K645645K134476j0468941
$$ y = [608923302, 603611450, 602796516, 612151604, 603725510, 596985397, 604707222, 600438576, 599575043, 606260529, 604061089, 599497299, 602007446, 603624763, 603048744, 604617462, 603998871, 605864258, 613206673, 610547028, 613346519, 595971222, 593499298, 604546394, 603507042, 600924377, 602974510, 605141220, 608017464, 602680931, 602396851, 609013596, 603335648, 597169189, 601162605, 607109108, 614079666, 607191124, 596133614, 599425926, 606162834, 610614319, 600754051, 599866791, 603610115, 603896332, 606585045, 611294823, 606069870, 597371826, 602156334, 603729591, 606168404, 613524933, 600780220, 599476776, 603079720, 603646317, 608809891, 609302826, 600426598, 600443039, 603643227, 602781982, 604046440, 605514755, 608160400, 610294876, 599825935]
3899.9E99825935M753113L306084o183281M287414k844581j846962L13988o829K181893
3908.6F03786774L34510L51487o21109k97242M3602n22041J273804J960487k844391
3917.3F03465881l148727M540825L99589m356460K124634K093010J208457j986160
3925F04341049l860626P78847J525154J754989j67846j52054K170105k420540k081451
3933.7F01887627R76448k26937O7406L03688l18146Q4076J05896J502838K061844l333893
3943.3F03110847j952476P80029P39517J625748j921654j39923K07672k166481J974373
3952F02257652P92504j209107m65431Q05054N40085q18215M30603l8109J246338L20702
3961.6F03862076k282601k95410N82886P36732n3291l80936J59188K17743k11754j56021
$$ y = [599825935, 604579048, 607885132, 601701851, 605989265, 603144684, 601297722, 601611710, 601604881, 603786774, 604121284, 604472771, 603851662, 603554420, 603598022, 603075981, 604349785, 606310272, 603465881, 600317154, 604857979, 605257568, 600901108, 603025742, 605118752, 606327209, 604341049, 600480423, 601259270, 602784424, 604539413, 604371567, 604219513, 606389618, 603969078, 601887627, 602864075, 602637138, 602704544, 603008232, 602690086, 602774162, 602880058, 604382896, 606444740, 603110847, 601158371, 601938400, 602677917, 604303665, 602382011, 602242088, 602449760, 600283279, 602257652, 603050156, 601841049, 601375618, 602180672, 602720757, 601902542, 602333145, 602295036, 603541374, 603862076, 601579475, 601284065, 601866951, 602603683, 602550392, 602169456, 602328644, 602546387, 602334633, 602178612]
3971.3F02178612K1286m65546M95606J87492l24173l00369K47497M46205r78241K4491
3980.9F01532860P64808J09826l87230J66931K74391L395R75723p7514j08910m71802
3990.6F02782478p32650M17137j58997L16811R4871j92375k43835n6382M96521l79867
4000.2F02343712
$$ y = [602178612, 602199898, 601734352, 602229958, 602417450, 602093277, 601792908, 602040405, 602486610, 601508369, 601532860, 602297668, 602407494, 602020264, 602187195, 602461586, 602464981, 603440704, 603363190, 603254280, 602782478, 602049828, 602466965, 602307968, 602624779, 602719650, 602527275, 602283440, 602227058, 602723579, 602343712]
##END=$$ End of the data block
