##TITLE=$$ Begin of the data block
##JCAMP-DX=5.00 $$ ACD/SpecManager v 10.08
##SPECTROMETER/DATA SYSTEM=Varian
##DATE=15 Jan 2013 11:00:56
##DATA TYPE=INFRARED SPECTRUM
##DATA CLASS=XYDATA
##ORIGIN=
##OWNER=
##NPOINTS=3735
##FIRSTX=399.26403809
##LASTX=4000.35498047
##MAXX=4000.35498047
##MINX=399.26403809
##MAXY=67.36100769
##MINY=16.63998222
##XFACTOR=1.0000000000
##YFACTOR=0.000000100000000
##FIRSTY=35.94659042
##DELTAX=0.96440572
##XUNITS=1/CM
##YUNITS=TRANSMITTANCE
##XYDATA=(X++(Y..Y))
399.3C59465904o656799n531883J579780k996406q70323J153640J093979L986206N73731
407.9C51797829j092453k087174p16057K074967l488198m606513J724510K09503K61879
416.6C44078293l469887j5404510J0195617R822426j64070J537094M940338o36749
424.3C50898552q793869j826058K845727L440513m32663l505134M051666j676521n032731
433C39969482R56688K40631k823905Q96720O713143L330154O75011j456452k839546
441.7C45661926Q61092O17065k395401l501243N57441K477189j896553k777634J317787
450.4C40921669K744522j949501l057671l142395j623458J233635J486740L225326
458.1C39838867j500091n20935K54058k49176P5417k353973j757889o124268l539543
$$ plain form
399.3 359465904 352809105 347277222 348857002 345860596 344990273 346143913 347237892 351224098 351797829
407.9 351797829 350705376 348618202 347902145 349977112 346488914 341882401 343606911 343816414 344078293
416.6 344078293 340608406 325203896 335399513 345221939 345057869 346594963 351535301 350898552
424.3 350898552 342104683 340278625 343124352 346564865 346132202 342627068 346678734 345002213 339969482
433 339969482 340926170 341166801 338342896 339239616 345952759 349282913 349957924 348501472 345661926
441.7 345661926 346523018 347140083 344744682 341243439 341800880 344278069 342381516 339603882 340921669
450.4 340921669 343666191 341716690 338659019 335516624 333893166 335126801 336613541 339838867
458.1 339838867 338338776 337817841 338071899 337822723 337898140 335544167 333786278 327662010 324122467
466.8C24122467P245903M508667l09601q37631j554565n897599p62214N064506J553383
475.5C33133316j774292o617622j085282M809952L52402K87094j570282k279205j864968
484.1C23391113k71034M48036j833801L253250M085503j999550p263699k703590O879597
492.8C23985825K129631l56102O04858J16119L93448k184562j515618L15438O9313
501.5C23558350k234459j770039K274799K028466j937065k000027J488933p629n4588
510.2C21346741J862907j704712k364673p687M07753K74239j862278j727868n49316
518.9C15675106q79497N39951j040821k178231N93396J591587P20348O29978J03588
527.5C15755405j426334j813202j301594O90976K089119n6649j124935p52582q35057
$$ plain form
466.8 324122467 331368370 335877037 335567436 334729805 333175240 327277641 326515427 331579933 333133316
475.5 333133316 331359024 324741402 323656120 328466072 328818474 329105568 327535286 325256081 323391113
484.1 323391113 323120079 323568115 321734314 324987564 329073067 327073517 319809818 317106228 323985825
492.8 323985825 326115456 325759354 326364212 326480331 326873779 324689217 323173599 323489037 323558350
501.5 323558350 321323891 319553852 321828651 323857117 321920052 319920025 321408958 321401329 321346741
510.2 321346741 323209648 321504936 319140263 319132576 319540329 319814568 317952290 316224422 315675106
518.9 315675106 314795609 315335560 314294739 312116508 312709904 314301491 315021839 315651817 315755405
527.5 315755405 314329071 312515869 311214275 311905251 313994370 313937721 312812786 312060204 311225147
536.2C11225147q02974M97551L53870p37515N35183p20272k181263n45501J407337
544.9C09031563P65972o26354l11947j813946o61049J07689j102886M02584o5842j167164
554.5C04558620j574344r52645K61994N61733k71683q68911O2542J7299Q70343L90186
564.2C03055134l32546k84081r26990J361846L78342j640205N90191J308059L24021
572.9C03833771N97095P25117r77535j412659k93465K16771M40654m85954j598091
581.5C01045704p44686Q14018Q12645L35293N56259J321316m38137k330437m08001
590.2C00963974J399746K124920M14734n16014K43320N59158Q17738l89233k35729
598.9C05382614p06215k175884r99184m77333K97928Q95252k02198j007309m93946
$$ plain form
536.2 311225147 310422173 310919724 311273594 310536079 311071262 310350990 308169727 307624226 309031563
544.9 309031563 309797535 309171181 308859234 307045288 306384239 306491928 305389042 305791626 305725784 304558620
554.5 304558620 302984276 302031631 302293625 302855358 302583675 301714764 301777306 301794605 302664948 303055134
564.2 303055134 302722588 302438507 301511517 302873363 303251705 301611500 302201691 303509750 303833771
572.9 303833771 304430866 305155983 304178448 302765789 302472324 302689095 303129749 302643795 301045704
581.5 301045704 300301018 301115036 301927681 302262974 302819233 304140549 303702412 301371975 300963974
590.2 300963974 302363720 304488640 304903374 304387360 304630680 305189838 306007576 305618343 305382614
598.9 305382614 304676399 302500515 301501331 301023998 301321926 302217178 302014980 301007671 300513725
607.6C00513725p44724j639366o23760L85017J88732p08179k5215P66410m09755l95871
617.2B97307014J68152K2621k16503K92206Q02765M55093P63836O63739Q7471J223430
626.9C01569824J644879L58753J110611K507095J924591J080837L67985K7104Q23021
635.5C11414700J070480O04210J654873K929344J419086K86885J427192N26238R22546
644.2C22255554J966400L33214P08885J117897R65920P75795Q06427J492729L89366
652.9C30812187k70614K24227J223145O58188m05083p09572j558075p97424L79601
661.6C29556580L51982r18885l48968K041817K064018J090431k894058r69620o4697
670.3C29908600O02417J481170R07631K095414J850166J010208J068268P24716J221390
$$ plain form
607.6 300513725 299769001 298129635 297505875 297890892 298079624 297371445 297346230 298112640 297702885 297307014
617.2 297307014 297475166 297497787 297281284 297573490 298376255 298831348 299595184 300258923 300346394 301569824
626.9 301569824 303214703 303573456 304684067 307191162 309115753 310196590 310564575 310591679 311414700
635.5 311414700 312485180 313089390 314744263 317673607 319092693 319379578 320806770 321333008 322255554
644.2 322255554 324221954 324555168 325264053 326381950 327347870 328123665 328930092 330422821 330812187
652.9 330812187 330541573 330765800 331988945 332647133 332242050 331532478 329974403 329176979 329556580
661.6 329556580 329908562 328989677 328640709 330682526 332746544 333836975 330942917 329973297 329908600
670.3 329908600 330511017 331992187 332899818 334995232 336845398 337855606 338923874 339648590 340869980
678.9C40869980R33990J375275J066246m06685O30417J524239J287117J951751J868096
687.6C51100426L07884k83279K78282K73399J85394J193581J605301J37596k23389
696.3C54575195J216698J300774N41534m2725n34400L80134P32994R78966J356926
705C60506096Q48999J135445Q11119J099548J681366J042175N64156r7962K22474R22203
714.6C68735619N61142Q3580J217460J827240O59523N85442P66334N96733O74057J245690
724.3C76952820J007118Q56743J793938J852760J464271L07236P60536J164208N19790
733C86679420J030426k4147l88107J38855L54004J353531K311211J722374K44102J68495
742.6C93590164K32506N78728N39550P48444J279831N80139J209221K361031J605034
$$ plain form
678.9 340869980 341803970 343179245 344245491 343838806 344469223 345993462 347280579 349232330 351100426
687.6 351100426 351408310 351125031 351403313 351676712 351862106 353055687 354660988 354798584 354575195
696.3 354575195 355791893 357092667 357634201 357591476 357057076 357437210 358170204 359149170 360506096
705 360506096 361355095 362490540 363301659 364401207 366082573 367124748 367688904 367590942 367813416 368735619
714.6 368735619 369296761 369380341 370597801 372425041 373084564 373670006 374436340 375033073 375707130 376952820
724.3 376952820 377959938 378816681 380610619 382463379 383927650 384234886 384995422 386159630 386679420
733 386679420 387709846 387685699 387297592 387436447 387790451 389143982 391455193 393177567 393421669 393590164
742.6 393590164 393822670 394401398 394940948 395689392 396969223 397549362 398758583 401119614 402724648
751.3D02724648K13165K15149J25770O35338J341705J343041J627426P47757J271248
760D10245247J428451J092301J532440J450768J152229j47019N61600m76799j502266
768.6D15336952j38931O9885J026001Q37441Q93097O62536o1455K74353M54560L02810
778.3D19657249n28068m42047o57234M83627R78432M26178J366615J396446J703262
787D24384460M53797o46401p55272m02755N00374L49273Q34961O45142K68249q33244
796.6D24798584r42459l11470j031380j689415k114982r90220j275024r23347o15120
805.3D14905167j482659m74777j405334k473526j738778j277732k125054k602386k356720
814C98968201j298027O8969p61261m94346m2877j70212J13792N0469K65846L57590
$$ plain form
751.3 402724648 402937813 403152962 403278732 403914070 405255775 406598816 408226242 408973999 410245247
760 410245247 411673698 412765999 414298439 415749207 416901436 416754417 417316017 416839218 415336952
768.6 415336952 415198021 415267906 416293907 417131348 418024445 418686981 418625526 418899879 419354439 419657249
778.3 419657249 419129181 418687134 418029900 418513527 419491959 419918137 421284752 422681198 424384460
787 424384460 424838257 424191856 423436584 423033829 423534203 423883476 424718437 425363579 425631828 424798584
796.6 424798584 423856125 423544655 422513275 420823860 418708878 417718658 416443634 415520287 414905167
805.3 414905167 413422508 412947731 411542397 409068871 407330093 406052361 403927307 401324921 398968201
814 398968201 397670174 397739143 396977882 396483536 396440659 396270447 396384239 396434708 396700554 397058144
823.6C97058144J517448J873322K497062L087273L070488L717003L191337L372650
831.3D19384727K313614K400437K969475J488876J636581K473870L330269L349037
839D39346886L264274J640549K004662L053093J509857J427993J42479M50402N85670
847.7D53425865Q51288K152061K209588K509880J392860K107124J604653J359825J539879
856.4D69153023N68237J606827J578560K135849J225166J043854J658821R60541R02328
865.1D80833206Q5564p39861k462043k637978l060722k905541k073784k018585j259232
873.8D63761024j773567j110573r25369o94046m74853p74613J77880J11694o6643k80723
883.4D57950211M03480K1782p25403j200638j469955r10339j691857q92105j091156
$$ plain form
823.6 397058144 398575592 400448914 402945976 406033249 409103737 412820740 416012077 419384727
831.3 419384727 421698341 424098778 427068253 428557129 430193710 432667580 435997849 439346886
839 439346886 442611160 444251709 446256371 449309464 450819321 452247314 452389793 452840195 453425865
847.7 453425865 454277153 456429214 458638802 461148682 462541542 464648666 466253319 467613144 469153023
856.4 469153023 469721260 471328087 472906647 475042496 476267662 477311516 478970337 479930878 480833206
865.1 480833206 480918770 480178909 477716866 475078888 472018166 469112625 467038841 465020256 463761024
873.8 463761024 461987457 460876884 459951515 459257469 458782616 458008003 458185883 458297577 458230934 457950211
883.4 457950211 458353691 458375473 457650070 456449432 454979477 454069138 452377281 451485176 450394020
892.1D50394020m08173Q00705L83721N20935k14768K41089j181831j347656n99175
900.8D48588867j667290j312255o82297J095390J834641L099327L048324K186585K264862
909.4D58456154O00166J205254M35524j053276j767922r90638q7166j736603j590233
918.1D53471260k029648k338180k279129k329178l167992m355507l861465l658753
925.8D29451408k582283k665825l160247l654290l233032j575317k129479k198066
933.6D08252869k125283j533241r38454j402702j059608o66809m30527q91724j239471
942.2C97965050j638375j316223j102409j218834l09105k90489O9351K84500N30167
950.9C92973633R6969r70687r30901j807480j757812j816864k581177k595139k569771
$$ plain form
892.1 450394020 449985847 450786552 451170273 451691208 451476440 451717529 450535698 449188042 448588867
900.8 448588867 446921577 445609322 444927025 446022415 447857056 450956383 454004707 456191292 458456154
909.4 458456154 459056320 460261574 460697098 459643822 457875900 456885262 456798096 455061493 453471260
918.1 453471260 451441612 449103432 446824303 444495125 441327133 436971626 433110161 429451408
925.8 429451408 426869125 424203300 421043053 417388763 414155731 412580414 410450935 408252869
933.6 408252869 406127586 404594345 403655891 402253189 401193581 400526772 400096245 399204521 397965050
942.2 397965050 396326675 395010452 393908043 392689209 392380104 392089615 392158966 392443466 392973633
950.9 392973633 393070602 392099915 391169014 389361534 387603722 385786858 383205681 380610542 378040771
959.6C78040771k490310k262726j903458j813965j970901k815323k281952j822967
967.3C60679169k486000j849747k408600k791405j741790j929093l088264l645783
975C40738487l679008l767014l912353m405060m123154l990097m651375m747238m910812
983.7C02552376m664078l758564m153805n059967n106449m283733l980732l961964
991.4B67583084l038025l368473l105411l035355l175869k333565k920990k689666
999.1B43915730k344647k336750k621174k423115j970596k271614j258068j442089
1006.8B27247677j773129k028370k251396j492424j427803j694584k041416j655617
1014.6B12882938j567382j433850k140713k471523k425861k290135q80355k103482
$$ plain form
959.6 378040771 375550461 373287735 371384277 369570312 367599411 364784088 362502136 360679169
967.3 360679169 358193169 356343422 353934822 351143417 349401627 347472534 344384270 340738487
975 340738487 337059479 333292465 329380112 324975052 320851898 316861801 312210426 307463188 302552376
983.7 302552376 297888298 294129734 289975929 284915962 279809513 275525780 271545048 267583084
991.4 267583084 264545059 261176586 258071175 255035820 251859951 249526386 246605396 243915730
999.1 243915730 241571083 239234333 236613159 234190044 232219448 229947834 228689766 227247677
1006.8 227247677 225474548 223446178 221194782 219702358 218274555 216579971 214538555 212882938
1014.6 212882938 211315556 209881706 207740993 205269470 202843609 200553474 199673119 197569637
1022.3A97569637j780739j688480k614155j857757j804314p93858j203727j336155
1030A84490452j176987q67233j019440j064815J73664k79465O11954O46000J257152
1038.7A82771282J135159J024456K271652P33242N90744L94802P13139p54013j405697
1047.4A87474766l1147j290760o15196p32365l91102q42037j668778j394024j030330
1056A79479027K42920j114025k78283M73652J604290J655751O45198J925736J116714
1064.7A85750980K233525J668720J193867J336994R24091J503620R1877J70231J74179
1073.4A95048084R05133r7695P2746J831761L74431L26310K784P18842N33295J271438
1083B00987129J967983M53663P69368P39288J932030J038837R12781J529274J447906
$$ plain form
1022.3 197569637 195788898 194100418 191486263 189628506 187824192 187030334 185826607 184490452
1030 184490452 183313465 182446232 181426792 180361977 180535641 180256176 180868130 181514130 182771282
1038.7 182771282 183906441 184930897 187202549 187935791 188526535 188921337 189634476 188880463 187474766
1047.4 187474766 187443619 186152859 185537663 184805298 184414196 183572159 181903381 180509357 179479027
1056 179479027 179721947 178607922 178329639 178803291 180407581 182063332 182708530 184634266 185750980
1064.7 185750980 187984505 189653225 190847092 192184086 193108177 194611797 194703674 194873905 195048084
1073.4 195048084 195953217 195855522 195928268 197760029 198134460 198460770 198463554 199182396 199715691 200987129
1083 200987129 202955112 203408775 204178143 204917431 206849461 207888298 208801079 210330353 211778259
1091.7B11778259K197285Q96759J763077J582775J455269J655216O58016J210804J332684
1100.4B24530144J059112M42238J304855J336365J048527J225395J174603Q81176j88790
1109.1B32813625J236534Q97427P4730K98958Q85467K006646Q31832P78237M95090
1117.7B40318546K17400p4539k67582N49259P3471J35784L00484J131840J198253R60026
1127.4B44542942J082420J317616K048321J219234J681099K201614K393799K239781
1135.1B58726826J647072J788559J568107K147465J986580J541157J324272R92260
1142.8B71722298P53269J041832J289882J37330p7286k60811K66304R69543l05o03218
1152.5B75238838q55942p63530p44725N6515m38385j532211q46596p34463m50687r52663
$$ plain form
1091.7 211778259 213975544 214872303 216635380 218218155 219673424 221328640 221986656 223197460 224530144
1100.4 224530144 225589256 226031494 227336349 228672714 229721241 230946636 232121239 233002415 232813625
1109.1 232813625 234050159 234947586 235022316 235321274 236206741 238213387 239045219 239823456 240318546
1117.7 240318546 240535946 240461407 240193825 240743084 240816555 240952339 241252823 242384663 243582916 244542942
1127.4 244542942 245625362 246942978 248991299 250210533 251891632 254093246 256487045 258726826
1135.1 258726826 260373898 262162457 263730564 265878029 267864609 269405766 270730038 271722298
1142.8 271722298 272475567 273517399 274807281 274944611 274867325 274606514 274872818 275842361 275842056 275238838
1152.5 275238838 274382896 273619366 272874641 272931156 272492771 270960560 270113964 269379501 268928814 267976151
1162.1B67976151l71991J026402J405372J729165J572322K207928K430973K900582
1169.8B80876904K887439K587490L087025L319855L347835L041210K988930K904110
1177.5C05040798L059063K673359K730961L118229K494182K264786K234879J997451
1185.3C25613708J635361J695976J710434J100197P18727Q83179K10915j06812L07312
1193.9C33768997l24707m12979l52440o39114j013680q58535p1412o98547j483078
1202.6C27914505j030350n12047j059570j055221k31667n26924m31786m0435k72904
1211.3C22753601k80762k4604N2795n05676q72727o11763k59437k62966K4623k14862
1220.9C19798222j055394n78689j85318j45188l78112r35231j005153j150704q71734
$$ plain form
1162.1 267976151 267604160 268630562 270035934 271765099 273337421 275545349 277976322 280876904
1169.8 280876904 283764343 286351833 289438858 292758713 296106548 299147758 302136688 305040798
1177.5 305040798 308099861 310773220 313504181 316622410 319116592 321381378 323616257 325613708
1185.3 325613708 327249069 328945045 330655479 331755676 332474403 333357582 333568497 333461685 333768997
1193.9 333768997 333444290 333031311 332678871 332039757 331026077 330167542 330096130 329397583 327914505
1202.6 327914505 326884155 326372108 325312538 324257317 324025650 323498726 323066940 323026505 322753601
1211.3 322753601 322472839 322448235 322501030 321995354 321122627 320510864 320251427 319988461 320013084 319798222
1220.9 319798222 318742828 318164139 317978821 317833633 317455521 316520290 315515137 314364433 313492699
1229.6C13492699o40793m88186o09207o93417j13754m53663o06060n02605k50798j07002
1239.3C09027214l86639J87645J4897j91155j99623k87971j20964o46229n23682k06604
1248.9C06666889l16620k34070L65315L92704m77810m86030k31534Q2856L27587K79598
1258.5C06368885K8381l7422J93958K1611N03273P49397N29137R15317J125622Q21037
1268.2C11219196Q44975R92699O56051Q24509J125259J118527Q65650Q38280J439342
1276.9C19924488J489887R25675Q24547R61837J077957J613617J554146J279373J236382
1285.5C30887909J319389J194115Q91113J307564J257782J098022O70891Q40798J073265
1294.2C40540848O53801P19604J40915J70288k67J34125O08749M96979M62189q5373
$$ plain form
1229.6 313492699 312851906 312363720 311754513 311061096 310947342 310493679 309887619 309385014 309134216 309027214
1239.3 309027214 308640575 308828220 308843117 308651962 308452339 308164368 308043404 307397175 306873493 306666889
1248.9 306666889 306350269 306116199 306481514 306874218 306396408 305910378 305678844 305761700 306089287 306368885
1258.5 306368885 306397266 306359844 306553802 306575413 307078686 307828083 308357220 309272537 310398159 311219196
1268.2 311219196 312064171 313056870 313712921 314537430 315662689 316781216 317646866 318485146 319924488
1276.9 319924488 321414375 322340050 323164597 324126434 325204391 326818008 328372154 329651527 330887909
1285.5 330887909 332207298 333401413 334292526 335600090 336857872 337955894 338626785 339467583 340540848
1294.2 340540848 341194649 341914253 342055168 342225456 342225189 342359314 342968063 343465042 343927231 343841858
1303.9C43841858K03743l41225q36792o91948n97954j06086n70107o82525n50347j99547
1313.5C39469070n73005p21092J3465j45340L52326N70183M28161M73404R14383J176949
1323.2C41958504N45196O30112N10597O37474K38610k80648l60336p61795p31201p01866
1332.8C41684647l95470k31476P1335p9041l21960p5226j30310O38466L35999M96673
1342.4C41993637P54242O51054R29566O40488Q49075N88569J66169k67449j09863l12080
1352.1C45883408p52945k22893l83721k29225k82325q0033l59649k70386k6589r42840
1361.7C42332802l55835j384545n18951k37274j084557l83911q48961o79588m22859
1370.4C36416321j9226J97868j56708l89137m66156M84772j86997k58445J21917M51546
$$ plain form
1303.9 343841858 344045601 343704376 342867584 342175636 341577682 341471596 340901489 340218964 339668617 339469070
1313.5 339469070 338896065 338174973 338188438 338043098 338395424 338965607 339393768 339867172 340781555 341958504
1323.2 341958504 342503700 343133812 343644409 344281883 344520493 344239845 343879509 343117714 342386513 341684647
1332.8 341684647 341289177 341057701 341129036 341049995 340728035 340652809 340522499 341160965 341496964 341993637
1342.4 341993637 342747879 343398933 344328499 344968987 345818062 346406631 346572800 346305351 346195488 345883408
1352.1 345883408 345130463 344907570 344523849 344294624 344012299 343932266 343572617 343302231 343275642 342332802
1361.7 342332802 341976967 340592422 340073471 339836197 338751640 338367729 337518768 336839180 336416321
1370.4 336416321 336397095 336594963 336438255 336049118 335582962 336067734 335880737 335622292 335744209 336195755
1380.1C36195755P1449j029892r45282j244774q16078p80449r40780j637345j135254
1388.7C27737350n74302j786804j605759j670685j338196k025928k831230j534405
1396.4C14370041k184029j858501l144779k197590j286888k374573j952362j606426
1404.2B97764893k286530k805996j669331j698627k035713j325436j530533j519222
1411.9B82893505j511497q64029r07421j457882j025315j131801J9645j529560q99200
1420.6B73586445L75995l7117L24460j002903O27956P37572N36937J212197J93004
1429.2B76554546J059037N37948J376801J656265J161194J582069P77264J187763J195946
1437.9B87088833K268772J605816J260300J390647Q07629J244717P26967J781272J385079
$$ plain form
1380.1 336195755 336267204 335237312 334292030 333047256 332231178 331450729 330509949 328872604 327737350
1388.7 327737350 327163048 325376244 323770485 322099800 320761604 318735676 315904446 314370041
1396.4 314370041 312186012 310327511 307182732 304985142 303698254 301323681 299371319 297764893
1404.2 297764893 295478363 292672367 291003036 289304409 287268696 285943260 284412727 282893505
1411.9 282893505 281382008 280517979 279610558 278152676 277127361 275995560 276015205 274485645 273586445
1420.6 273586445 273962440 273925323 274249783 273246880 273874836 274612408 275149345 276361542 276554546
1429.2 276554546 277613583 278151531 279528332 281184597 282345791 283927860 284705124 285892887 287088833
1437.9 287088833 289357605 290963421 292223721 293614368 294421997 295666714 296393681 298174953 299560032
1446.6B99560032J320171R45683J128101K248707J147556J671486J119614J984939
1454.3C11126289J832104Q69827K324791j5144L320522J891938K942199K097245J468315
1463C27858086K418823Q48770K570457J832963K999496K746773K637672L888207K935371
1471.7C50736618L281670J659736L636284L544350K687950K522774K379799K351951
1479.4C72801132K066574K456703J861992J990319J697426J122322J665954P74803
1487.1C86437225O90308J580543l96156r17473N64766L86887m14429m55971o64863
1495.8C86810837m640541j92223j290245k895737j7738j145477j425171p52106Q83293
1504.5C75334892J015625l301697n321960L11737J328011j279412J09330j272889k287788
$$ plain form
1446.6 299560032 300880203 301825886 302953987 305202694 306350250 308021736 309141350 311126289
1454.3 311126289 312958393 313828220 316153011 316137867 319458389 321350327 324292526 326389771 327858086
1463 327858086 330276909 331125679 333696136 335529099 338528595 341275368 343913040 347801247 350736618
1471.7 350736618 354018288 355678024 359314308 362858658 365546608 368069382 370449181 372801132
1479.4 372801132 374867706 377324409 379186401 381176720 382874146 383996468 385662422 386437225
1487.1 386437225 387127533 388708076 388311920 387394447 387959213 388346100 387931671 387475700 386810837
1495.8 386810837 382170296 381978073 380687828 377792091 377774353 376628876 375203705 374451599 375334892
1504.5 375334892 376350517 373048820 367726860 368038597 369366608 368087196 368196526 366923637 364635849
1513.1C64635849j78871q58498l81660k119217k185517J487618J926002J14098j990623
1521.8C60449181p15638M78554K453499J247025O89239P19261n08041N31463R21479
1530.5C66266022O40831N20057O26793j290817J198044J245804J033859K448540k158852
1539.2C70530281l521843M092560J428070j801910P66182J963577n59387J371727J108055
1547.9C75377312J385841J124230p14264J100921R60694R80529j546936N70298K289886
1556.5C81528511J277885k988052n182037L200493N36384M78363q82606p04117k554283
1565.2C74710541k995796j023903j563378q14399p124901j544380j154175l013840
1572.9C55475769k543220k437020p42912j2072601k310524k562371l981437l959313
$$ plain form
1513.1 364635849 364456978 363598480 363216820 361097603 358912086 360399704 362325706 362439804 360449181
1521.8 360449181 359733543 360212097 362665596 363912621 364601860 365321121 364813080 365344543 366266022
1530.5 366266022 366906853 367426910 368053703 366762886 367960930 369206734 370240593 372689133 370530281
1539.2 370530281 367008438 371100998 372529068 370727158 371493340 373456917 372897530 374269257 375377312
1547.9 375377312 376763153 377887383 377173119 378274040 379234734 380215263 378668327 379238625 381528511
1556.5 381528511 382806396 379818344 374636307 377836800 378373184 378851547 377968941 377264824 374710541
1565.2 374710541 371714745 370690842 369127464 368313065 361188164 359643784 358489609 355475769
1572.9 355475769 352932549 350495529 349752617 337680016 335369492 332807121 328825684 324866371
1580.6C24866371n292644l141976n228977l862877n116787m303512l973809n034732
1588.4B88911057l383351n627613l613090n205422l278217l964882m452973k444534
1596.1B56940975m689941k446137m564857k282868l342800k976036k048321m390411
1603.8B30199604j448956l218841p91531k788372j433448j307946k912731K19688k262096
1612.5B14255371O371j871777M17767L00521n322837J090641j113472J220722j399441
1621.1B07583866J059609k28329k213154J282864q18501J767445j410008J087075L44543
1629.8B08455410L18604O85215l26024K272816l7937L021469k235088J450233J057282
1638.5B14661980O41956K350731n7373K496967O04649J912784J586094l36284K642078
$$ plain form
1580.6 324866371 319573727 316431751 311202774 307339897 302223110 297919598 293945789 288911057
1588.4 288911057 285527706 279900093 276287003 271081581 267803364 263838482 259385509 256940975
1596.1 256940975 252251034 249804897 245240040 242957172 239614372 236638336 234590015 230199604
1603.8 230199604 228750648 225531807 224740276 221951904 220518456 219210510 216297779 216517467 214255371
1612.5 214255371 214261742 212389965 212807732 213108253 207785416 208876057 207762585 208983307 207583866
1621.1 207583866 208643475 208415146 206201992 207484856 206666355 208433800 207023792 208110867 208455410
1629.8 208455410 208774014 209459229 209133205 211406021 211368084 214389553 212154465 213604698 214661980
1638.5 214661980 215303936 217654667 217597294 220094261 220698910 222611694 224197788 223861504 226503582
1647.2B26503582j300945L182354R93652L281136K191429k673035L103676N24006L608036
1655.9B39413891P47547K493954J410331K194939K525978J982613L663864M75368L569603
1664.5B58478088K333069L165798L031598K909393M289665J241398M926090K390022
1672.3B82765121L811551L438873L040199L913822L356228M868584L194923M570561
1680C12959862K984028M295635N346603K667618N758896J642799N892144M520187M536819
1688.6C50604591M890862M176597M916344M013329M924926N335770N931587J263123
1696.4C86057129M756699O710090N951538M816666r8229O975518N654030M817314L597908
1705D29238663L453941K474403K332650M277763L141174K168389K452354L137245L764267
$$ plain form
1647.2 226503582 225202637 228384991 229378643 232659779 234851208 232178173 235281849 235805855 239413891
1655.9 239413891 240161438 242655392 244065723 246260662 248786640 250769253 254433117 254908485 258478088
1664.5 258478088 260811157 263976955 267008553 269917946 274207611 275449009 280375099 282765121
1672.3 282765121 286576672 290015545 293055744 296969566 300325794 305194378 308389301 312959862
1680 312959862 315943890 320239525 325586128 328253746 334012642 335655441 341547585 346067772 350604591
1688.6 350604591 355495453 359672050 364588394 368601723 373526649 378862419 384794006 386057129
1696.4 386057129 390813828 397523918 403475456 408292122 408193893 415169411 420823441 425640755 429238663
1705 429238663 432692604 435167007 437499657 441777420 444918594 447086983 449539337 452676582 456440849
1713.7D56440849J114884N13801L666573L676681k933197J617203L291168K262688
1721.4D69650650J622810R29985J080208J915055J586837R96437J599541K271767J52244
1730.1D81805534L73803L956642M529190K3918l955765L687782L851929K220726L536797
1738.8E00030556J849861j298905M007645M183846K366676K337799L810005L608322
1746.5E20895805L081360L354607K480354N499306L106499J905365N458602L937188
1754.2E49719086L999481L899498J347847K582130L551789L059311L910789L81546
1761.9E72451477K22359L996277K412529K080650K507172K168693o01005K631263M633332
1770.6E92502747Q69331j143990j827240L877297K753944J11923L041192J617927J988716
$$ plain form
1713.7 456440849 457555733 458069534 461736107 465412788 462479591 464096794 467387962 469650650
1721.4 469650650 471273460 472203445 473283653 475198708 476785545 477781982 479381523 481653290 481805534
1730.1 481805534 482179337 486135979 490665169 490689087 486733322 490421104 494273033 496493759 500030556
1738.8 500030556 501880417 500581512 504589157 508773003 511139679 513477478 517287483 520895805
1746.5 520895805 523977165 527331772 529812126 535311432 538417931 540323296 545781898 549719086
1754.2 549719086 553718567 557618065 558965912 561548042 565099831 568159142 572069931 572451477
1761.9 572451477 572673836 576670113 579082642 581163292 583670464 585839157 585238152 587869415 592502747
1770.6 592502747 593372078 592228088 590400848 594278145 597032089 597144012 600185204 601803131 603791847
1779.3F03791847J038704o90460J124535J739692J492119k59209R99642K040558J393280
1788F12670708J071434K121925J331825J205101q02269j309318L619995J029472o24733
1796.7F20314140J696320K663994J200638r97467K490959K99644M86984J756821N23872
1805.3F30435905R60579L96119O85577J414032K167587j31111O18324J420861K80799
1814F38248672J242676R4185O61888j02768N56870J333084K36893J654815N04685J388016
1823.7F45819016J498718k402573r4147K427369K455139L72619l773727J84784K874679
1832.3F49361877P67441P85446P10907O15921N90058r34372P55768j08185O31027Q48618
1842F54024506J770095J892624n468063K013321K752685L67814n16663L07236J268539
$$ plain form
1779.3 603791847 604830551 604140091 605264626 607004318 608496437 608237228 609236870 611277428 612670708
1788 612670708 613742142 615864067 617195892 618400993 617598724 616289406 619909401 620938873 620314140
1796.7 620314140 622010460 624674454 625875092 624877625 627368584 627668228 628155212 629912033 630435905
1805.3 630435905 631396484 631792603 632478180 633892212 636059799 635928688 636547012 637967873 638248672
1814 638248672 639491348 639585533 640247421 640144653 640701523 642034607 642271500 643926315 644431000 645819016
1823.7 645819016 647317734 644915161 644821014 647248383 649703522 650076141 646302414 646487198 649361877
1832.3 649361877 650129318 650914764 651625671 652241592 652831650 651897278 652653046 652544861 653175888 654024506
1842 654024506 655794601 657687225 652219162 654232483 656985168 657352982 656836319 657143555 658412094
1850.7F58412094n16586O2332k05231Q06656Q55560M94538J207123K14157M15497m79508
1860.3F61266632R5902k28425L2807L98331K79007J626281J49994J044388n31158j641160
1869.9F62492599R76868J067352M95759o44761M50364r7657L71933P24640K86484O12717
1879.6F66736298j78452O29501K7695L15933j14746n49545M1046p7362J686020L96423
1889.2F68912811j028976O77337J133652m5395k0370J13602j218873L18451K5330J01166
1898.9F68968735M24270M48990N92499Q3694O57731m74625J49918Q010l60336K10953
1908.5F70709839k09427J24741j81961J168746L25776J80435K75574o1646J278000
1917.2F73610077j947937j182938N57099O22329J122742l51868m96063L13645P95898
$$ plain form
1850.7 658412094 657895508 657957840 657752609 658559265 659414825 659909363 661116486 661330643 661746140 661266632
1860.3 661266632 661362534 661134109 661166916 661565247 661844254 663470535 663620529 664664917 664133759 662492599
1869.9 662492599 663469467 664536819 665032578 664387817 664838181 664740524 665112457 665837097 666123581 666736298
1879.6 666736298 666557846 667187347 667215042 667530975 667416229 666866684 666907730 666830368 668516388 668912811
1889.2 668912811 667883835 668561172 669694824 669649429 669629059 669742661 668523788 668842239 668867569 668968735
1898.9 668968735 669393005 669841995 670434494 670518188 671175919 670701294 670851212 670859222 670498886 670709839
1908.5 670709839 670500412 670625153 670443192 671611938 671937714 672118149 672393723 672332077 673610077
1917.2 673610077 671662140 670479202 671036301 671658630 672781372 672429504 671933441 672247086 673042984
1925.9F73042984p7820K13852k56576n97306k7542k52380L15552k38648M93851K70691
1935.5F72886658K49786J48544m04434L36838o91071O53763k96173j866455O07376
1944.2F71624832P26471M07562j03531M78211j53427k41623J12533n8059k25296o48880
1953.8F71918793Q1863m20990L69873M96979M7684J07269l63922J81427l78647j5335
1963.5F72024994m21982k30331M74167k80915l2272k6779N39245m2495J87988L10058
1973.1F72501678l33251l27530o64139K74963L662K72675K52457m4098R3460m42658
1982.8F71587219k1515m40368J32446M1809k33002k05307m34417Q39691M04205q90884
1992.4F70779877p55768O36215J69602l83683L7384k90603k1286p40815j10321j39312
$$ plain form
1925.9 673042984 672965164 673179016 672922440 672325134 672297592 672045212 672360764 672122116 672615967 672886658
1935.5 672886658 673136444 673284988 672880554 673217392 672526321 673180084 672883911 671017456 671624832
1944.2 671624832 672351303 672758865 672655334 673133545 672980118 672738495 672851028 672792969 672567673 671918793
1953.8 671918793 672000656 671579666 671949539 672446518 672494202 672601471 672237549 672418976 672040329 672024994
1963.5 672024994 671603012 671372681 671846848 671565933 671533661 671506882 672046127 672003632 672191620 672501678
1973.1 672501678 672168427 671840897 671176758 671451721 671455383 671728058 671980515 671936417 672029877 671587219
1982.8 671587219 671565704 671125336 671257782 671299591 671066589 670861282 670426865 671266556 671670761 670779877
1992.4 670779877 670024109 670660324 670829926 670446243 670483627 670193024 670171738 669430923 669320602 669181290
2002.1F69181290P5226N37796l53013K68326k62069K6092k66037n52521j59683l74756
2011.7F68120651K23465m04663m7760r4604j71204k88849l85132J87302l27683m6920
2021.3F66764603p59049N2719N64499j85318K2202k00653K39944o44531l73764k61841
2031F65218811n89981o2561j56784J18255m56466K35367J60217l28522j06201k79007
2040.6F63753128j79138o80618l44620j55869O28357M1886m73328K52838j27334K14309
2050.3F62929611m61578j40457k55356n28565l2272l14865L30048l0823K37884j73034
2059.9F61560593k37198q7052n47027M39682l55759n12619j66702J34201J03607j25809
2069.6F60205917J81427m11148O8054j12686l3950l35541l62396L48815j78756J57547
$$ plain form
2002.1 669181290 669256516 669794312 669441299 669709625 669447556 669473648 669207611 668655090 668495407 668120651
2011.7 668120651 668344116 667939453 667891693 667797089 667625885 667337036 666951904 667139206 666811523 666764603
2021.3 666764603 666005554 666058273 666622772 666437454 666459656 666259003 666498947 665854416 665480652 665218811
2031 665218811 664628830 664566269 664409485 664527740 664071274 664306641 664466858 664138336 664032135 663753128
2040.6 663753128 663573990 662893372 662548752 662392883 663021240 663063126 662589798 662842636 662715302 662929611
2050.3 662929611 662468033 662327576 662072220 661543655 661511383 661196518 661526566 661495743 661733627 661560593
2059.9 661560593 661323395 661236343 660689316 661128998 660773239 660260620 660093918 660228119 660331726 660205917
2069.6 660205917 660387344 659976196 660044250 659931564 659897614 659562073 659199677 659548492 659369736 659527283
2079.2F59527283j00937R2926j45035k21558n8746m03900M7684m45481q3999l00293
2088.9F57907944J0376J97220k46888K61612n36499m10461l36609Q163l54004n22918
2098.5F55977936K90222j64948K19269k19116k5635m348j42670L9673m30985J6098
2108.1F55555496m67758L0975k8076l03421p8506q3771K34375n51605O5231q9722l02810
2118.7F53980408k97013m18243j36490n25513N31311J02158J11771M05044N6839J50910
2128.4F53961182o95572m15344m57535j2436k4567m4632L03040j26496K98310M6615
2138F52832565K48337j45492k21634j60981l01666L08151k58178J52130J52740O3477
2147.7F52669449p935L8758K24762l36533l586n67779n3940K94571K23999L90014p8964
$$ plain form
2079.2 659527283 659426346 659519272 659374237 659152679 659093933 658690033 658737717 658292236 658208237 657907944
2088.9 657907944 657918320 658115540 657868652 658130264 657593765 657183304 656846695 656854858 656500854 655977936
2098.5 655977936 656268158 656103210 656322479 656103363 656077728 656073380 655930710 655970383 655539398 655555496
2108.1 655555496 655087738 655118713 655090637 654787216 654708710 654624939 654859314 654307709 654372940 654283218 653980408
2118.7 653980408 653683395 653265152 653128662 652603149 653134460 653236618 653348389 653753433 653810272 653961182
2128.4 653961182 653265610 652850266 652392731 652380295 652355728 652311096 652614136 652487640 652785950 652832565
2138 652832565 653080902 652935410 652713776 652552795 652251129 652559280 652301102 652453232 652605972 652669449
2147.7 652669449 652661514 652700272 652925034 652588501 652584915 652017136 651963196 652257767 652481766 652871780 652792816
2158.3F52792816K43759k51770M8828L1357J57852K4949l99857K6092n90820K50702
2167.9F52333908L74222M78439M34952k78625M5852p9346K21405n07583k66190J4496
2177.6F52771530K09122M99115l15781L85208K45209L69644m4632k50854J983o05087
2187.2F53265457J59302N1575K23922N6839K13166M19769M349K56805j49460L91541
2196.9F54893265r4376j80359j19171m29001J69144o1111L37219J96686M66079J29929
2206.5F55308304k37732J27106j98594o8740m92554J26572K89001N50690K61535l79333
2216.1F55286255K26288k77024L38974k62069m91562R6206k2277L38211m196M14657
2225.8F55643463k19574O4240N7144m18549K24838n9204Q4000o02875J76316K56805
$$ plain form
2158.3 652792816 653036575 652784805 652833633 652864990 653022842 653047791 652647934 652674026 652083206 652333908
2167.9 652333908 652708130 653186569 653621521 653342896 653388748 653309402 653530807 653023224 652757034 652771530
2177.6 652771530 652980652 653479767 653163986 653549194 653794403 654164047 654119415 653868561 653870544 653265457
2187.2 653265457 653424759 653476334 653700256 653757095 653970261 654390030 654394379 654651184 654501724 654893265
2196.9 654893265 654798889 654618530 654499359 654070358 654239502 654178391 654515610 654712296 655178375 655308304
2206.5 655308304 655070572 655197678 654999084 654930344 654437790 654564362 654853363 655404053 655665588 655286255
2216.1 655286255 655512543 655235519 655574493 655312424 654820862 654917068 654894791 655233002 655228806 655643463
2225.8 655643463 655423889 655488129 655545273 655126724 655351562 655292358 655376358 654773483 654949799 655206604
2235.4F55206604k22321K27662j83716M67529O638p9041l57895j42669J63574n44129
2245.1F54542236K4643R537O03027j44424k61231L83912j90812J58310j97525j6632
2254.7F54911041k48565N4626K73285j0605L01056m959L71246k12631k09351j01928
2264.4F55123215j27945L662k94342n6381l59269M83551J07651p2708J31149l24554
2274F54614029K12707k80838J58539Q0643k16751m46777j09482O65741k7008J24435
2283.7F54775238l96271r2544l96881l21274N53207m17785O10l75443O7368P1564j3810
2294.3F53453979Q84400j68152q5831k58636M4403j21918l07770K99378j53885j2360
2303.9F53573608l65066L05557J51672j95999J07880R3460N75180p8354O7139o01120
$$ plain form
2235.4 655206604 654984283 655211945 655028229 655495758 655502396 655423355 655065460 654922791 655086365 654542236
2245.1 654542236 654566879 654576416 655179443 655035019 654773788 655157700 654966888 655125198 654927673 654911041
2254.7 654911041 654662476 654717102 654990387 654979782 655280838 655275879 655647125 655434494 655225143 655123215
2264.4 655123215 654995270 654998932 654704590 654648209 654288940 654772491 654880142 654807434 654938583 654614029
2274 654614029 654826736 654545898 654704437 654785080 654568329 654121552 654012070 654677811 654650803 654775238
2283.7 654775238 654378967 654286423 653889542 653568268 654121475 653703690 653704300 653328857 653396225 653467789 653453979
2294.3 653453979 654338379 654170227 654084396 653825760 653870163 653748245 653440475 653739853 653585968 653573608
2303.9 653573608 653208542 653514099 653665771 653469772 653577652 653671112 654246292 654167938 654235077 653633957
2313.5F53633957k49786J82800l96195L37067J34048M42505j907M9362q2016n2109
2323.2F53997726K63977n5389Q84171k75956n04531n78003K36740P09610j77307K12097
2332.8F54713135j016922j32065j86081r308J51291j5030N47333n61981M51050j068268
2342.5F52873154l66516J151962l62854n96314j451492j136322M11301J956634O44150
2351.2F53123703m12750k62604j022644J069412J046524O94199n76706p94067K34985
2359.8F53100052N7449o39114p55997J103974j033860l13568l26691q48999K66877
2368.5F50610123q98362k44827n69458j035919j228180k58102k8153q13904p25708
2377.2F44807510q24051j45263o81992l45306k58179o82678l967k99530k67334n49469
$$ plain form
2313.5 653633957 653384171 653566971 653170776 653507843 653641891 654084396 654082489 654131851 654049835 653997726
2323.2 653997726 654261703 654206314 655090485 654814529 654309998 653731995 653968735 654678345 654501038 654713135
2332.8 654713135 653696213 653564148 653378067 653368759 653520050 653505020 654052353 653490372 653941422 652873154
2342.5 652873154 652506638 653658600 653295746 652699432 651247940 650111618 650522919 652479553 653123703
2351.2 653123703 652710953 652448349 651425705 652495117 653541641 654235840 653659134 652865067 653100052
2359.8 653100052 653157501 652518387 651762390 652866364 651832504 651518936 651192245 650343246 650610123
2368.5 650610123 649711761 649466934 648897476 647861557 646633377 646375275 646347122 645533218 644807510
2377.2 644807510 643983459 643838196 643156204 642810898 642552719 641870041 641866074 641566544 641299210 640749741
2386.8F40749741j81275r9258o19240l68576l45154K72141k51198k76413J16386m80613
2396.5F38516541m14124j51138o7101m98352m65736k98348Q5144Q5488j09520m8142
2406.1F36634712o16188j76163k24113l19939k93502p56836m27285k93007r8838J4038
2415.8F33442879l6202n46951m91028m0932l93219n34133l99895p744k25105j55602
2425.4F30612068k17514n19409l75900l04795m310n68009m07409k63481m06075l72696
2435.1F27172470o28242J52549r0332m28276m19960m01649k64054m15268j61132m67301
2444.7F24048805n10826n00221k10610k16751l12462o9198n39932m12331n28755p6103
2454.3F20671616p1106o20766m48380l58810j28975p12242l59802n13764o66504j35460
$$ plain form
2386.8 640749741 640568466 640469208 639849968 639481392 639136238 639408379 639157181 638880768 638997154 638516541
2396.5 638516541 638102417 637951279 637884178 637385826 636920090 636621742 636706886 636792374 636682854 636634712
2406.1 636634712 636018524 635842361 635618248 635298309 635004807 634247971 633820686 633527679 633428841 633442879
2415.8 633442879 633406677 632859726 632368698 632327766 631934547 631400414 631000519 630992775 630767670 630612068
2425.4 630612068 630394554 629875145 629499245 629194450 629190140 628622131 628214722 627951241 627545166 627172470
2435.1 627172470 626544228 626696777 626606445 626178169 625758209 625356560 625092506 624677238 624516106 624048805
2444.7 624048805 623537979 623037758 622827148 622610397 622297935 622228737 621688805 621276474 620747719 620671616
2454.3 620671616 620600510 619979744 619531364 619172554 619043579 618331337 617971535 617457771 616791267 616655807
2464F16655807n61943l06358m73709O48j49955o51131k62146m07448l00979o59829
2473.6F12882957m46243m32319k90375j93711n34668j58119n72395o43883n92537n07660
2483.3F08511047o70929l13034o6642j044960m54560l05366k77062l43170o68793j80664
2492.9F04185867l59764m46434p37037o01159o67495m56353O7139m17595o75125p19185
2502.6E99172859k05993n95055q66509o57157p01714j92947j48621j14479o75430n39322
2512.2E94475632J1139J1177m43306j340714p03964l89786k72751k8991l26500m72985
2521.9E90518951m44221j60370k35062j25961n63927q19130p64846n49469j05744n98488
2531.5E86151733m60052k28615l12805n67513j56822K1515p36732k87285m06914o23169
$$ plain form
2464 616655807 616093864 615787506 615313797 615314445 615164490 614513359 614251213 613843765 613542786 612882957
2473.6 612882957 612436714 612004395 611714020 611520309 610985641 610827522 610255127 609611244 609018707 608511047
2483.3 608511047 607840118 607527084 607460442 606415482 605960922 605655556 605378494 605035324 604366531 604185867
2492.9 604185867 603826103 603379669 602642632 602041473 601373978 600917625 600984764 600567169 599892044 599172859
2502.6 599172859 598966866 598371811 597505302 596848145 596146431 595953484 595804863 595690384 595014954 594475632
2512.2 594475632 594486771 594497948 594054642 592713928 592009964 591620178 591347427 591318436 590991936 590518951
2521.9 590518951 590074730 589914360 589679298 589553337 588989410 588170280 587405434 586855965 586750221 586151733
2531.5 586151733 585691681 585463066 585150261 584582748 584425926 584447441 583710709 583423424 583016510 582393341
2541.1E82393341n76973m58717l12157m70810j79634j58653M1733p79267q19092k53028
2550.8E78426743n75982l74069p42569l94706k62528k76642j71928m67797q1329l13454
2560.4E74765739m55093n49164o15501q82569o56166j12571n03922j86271j94092k36054
2570.1E70374336j90544l55530m48913n32456k99682o38085n59272m56429k33803k97813
2579.7E66361809n20096j30501l10707m00925q02612o10046k73857k19117k76527o82793
2589.4E62134628k68402l96271l31077n01785n81513m07905p49665l98063o01693k25372
2599E57672882k99721p64122l55682m67148m92630m75960j18103l18756n54886n79567
2608.6E53246307o43844n54161q38814m09165m63218m59633l80173n04761k84538n52711
$$ plain form
2541.1 582393341 581816368 581357651 581045494 580574684 580395050 580236397 580278130 579498863 578679771 578426743
2550.8 578426743 577850761 577476692 576734123 576339417 576076889 575800247 575628319 575160522 575079193 574765739
2560.4 574765739 574310646 573761482 573145981 572263412 571607246 571494675 570990753 570804482 570610390 570374336
2570.1 570374336 570183792 569828262 569379349 568846893 568547211 567909126 567349854 566893425 566659622 566361809
2579.7 566361809 565841713 565711212 565400505 564999580 564196968 563586922 563313065 563093948 562817421 562134628
2589.4 562134628 561866226 561469955 561138878 560637093 560055580 559647675 558898010 558499947 557898254 557672882
2599 557672882 557373161 556609039 556253357 555786209 555293579 554817619 554699516 554380760 553825874 553246307
2608.6 553246307 552602463 552048302 551209488 550800323 550337105 549877472 549497299 548992538 548708000 548155289
2618.3E48155289p71828r17969l07197k64778o28243n55077n98640n01900p13043m20456
2627.9E42476158l92685l77922o30073q94852m65431j69258K45285o33049j069336
2636.6E38088837o34194k14042l91770j195068p56073m75655j17607n96542p41654
2645.3E32966232n9852m98085n93109p51992k50549l26271o25839m59748p29751m20761
2654.9E28250275n89066l37067l69110n68313m15497k72026k60544r15108m90303n38902
2664.6E23494339n11780k58674m93546k33078k14271K288m07982m54940m86412o68641
2674.2E19767303n45196p30133k16446k19727k25105n66597n38750j20391n80559j49002
2683.9E15875397q2398m16908o34880o56433m65202l34435m15497o62956j72806l71246
$$ plain form
2618.3 548155289 547383461 546465492 546158295 545893517 545265274 544710197 544111557 543609657 542896614 542476158
2627.9 542476158 542083473 541705551 541075478 540180626 539715195 539545937 539791222 539158173 538088837
2636.6 538088837 537454643 537240601 536848831 535653763 534897690 534422035 534304428 533707886 532966232
2645.3 532966232 532906380 532408295 531815186 531063194 530812645 530486374 529860535 529400787 528671036 528250275
2654.9 528250275 527661209 527324142 526955032 526386719 525971222 525699196 525438652 524523544 524033241 523494339
2664.6 523494339 522982559 522723885 522230339 521997261 521782990 521785278 521377296 520922356 520435944 519767303
2674.2 519767303 519222107 518491974 518275528 518055801 517830696 517264099 516725349 516604958 516024399 515875397
2683.9 515875397 515792999 515376091 514741211 514084778 513619576 513285141 512869644 512206688 512033882 511662636
2693.5E11662636k99492j74904m77638m63028o79894l98140n73768l88603p0649j90773
2703.1E07945747l43208o47621l44811l44238k78740m75693p05566n47714j80817j68686
2712.8E03908653q20846k54784j31454k41509l7498l97683m70657m49409k32582m33503
2722.4E00438728m18243l8261J54724m47083p23839q163m22859n97611o92482m56886
2732.1D96788025J33057j63689k30599l05519j33819j24817j00403j66893j74522l71857
2741.7D95148964q88672j46255n7335k29493j83792o2256R5521m38042l04947l83453
2751.4D92550240m31214l47709j47477p1029n56031n98716m25835R8114j24321l53165
2761D89592857l25851j53999j374q13789n79529k92206n35507n96924N5352J88674
$$ plain form
2693.5 511662636 511363144 511188240 510710602 510247574 509567680 509169540 508595772 508207169 508136520 507945747
2703.1 507945747 507602539 506954918 506610107 506265869 505987129 505511436 504805870 504258156 504077339 503908653
2712.8 503908653 503087807 502833023 502701569 502460060 502422562 502024879 501554222 501104813 500872231 500438728
2722.4 500438728 500020485 499982224 500136948 499689865 498966026 498957863 498535004 497937393 497244911 496788025
2732.1 496788025 496921082 496757393 496526794 496221275 496087456 495962639 495862236 495695343 495520821 495148964
2741.7 495148964 494260292 494114037 494056702 493827209 493643417 493581161 493676682 493238640 492933693 492550240
2751.4 492550240 492119026 491771317 491623840 491552811 490996780 490398064 489972229 490070343 489946022 489592857
2761 489592857 489267006 489113007 489111633 488297844 487718315 487426109 486890602 486293678 486349030 486537704
2770.7D86537704q16688o09398l15895j8997m16947p90977m74510n87464m02488n35965
2780.3D81568375l6240l28064o68449l38707p12357k45361j42479j13373n17464j107559
2789.9D77358322r32999p08274l91045n10139l20015n51949p35054p06024q19817n49125
2799.6D71133881p48444q40530o89125m27819p48367p03621l43170m26788k40860o99082
2809.2D65266075r99870j246491j112098r51844q31947l38631r01260j060638r11904
2817.9D56911392o02913o47354q02650o25725j317673j211967q81462r17893j177215
2826.6D48726540q51136l53698q97675r38339r15718j110420j602478j145516q90198
2835.3D40021362j596756j081810r58328j197166j510659j765098k337990k255516
$$ plain form
2770.7 486537704 485721016 485111618 484795723 484776726 484359779 483568802 483094292 482506828 482104340 481568375
2780.3 481568375 481532135 481204071 480535622 480196915 479484558 479239197 479096718 478983345 478465881 477358322
2789.9 477358322 476425323 475717049 475326004 474815865 474495850 473943901 473208847 472502823 471683006 471133881
2799.6 471133881 470385437 469544907 468855782 468427963 467679596 466975975 466632805 466206017 465965157 465266075
2809.2 465266075 464266205 463019714 461907616 460955772 460123825 459785194 458883934 457823296 456911392
2817.9 456911392 456308479 455661125 454858475 454232750 452915077 451703110 450821648 449903755 448726540
2826.6 448726540 447875404 447521706 446624031 445685692 444769974 443659554 442057076 440911560 440021362
2835.3 440021362 438424606 437342796 436384468 435187302 433676643 431911545 429573555 427318039
2843D27318039j506767k370339k510986k159577k134780k710686k600479j698990j975250
2851.7D07650185j413346j105690n28259l40652o39840R92l58238l77312n06096j54647
2861.3D02227097Q1062m87976m43077p28150o07948p55692p42797o13823j159859j534195
2870.9C95234642j082153l34893o74514n99366o56280p31506o04439p95555n33791
2879.6C89222145p99866q42781q43506o69860p64542j254082r19571q54263p15446
2888.3C81558228q66623j065712j207390j377030j038398r54285r85603j373215j033211
2897C71656761l74451n94711j157188j334763n47333l32260r38072j138992o23207
2905.7C64615784r25064j344910n40695n40200j483802k034378j090584p32041j602554
$$ plain form
2843 427318039 425811272 423440933 420929947 418770370 416635590 413924904 411324425 409625435 407650185
2851.7 407650185 406236839 405131149 404602890 404262238 403622398 403623390 403265152 402887840 402381744 402227097
2861.3 402227097 402308159 401820183 401377106 400648956 400041008 399285316 398542519 397928696 396768837 395234642
2870.9 395234642 394152489 393817596 393143082 392543716 391887436 391155930 390551491 389755936 389222145
2879.6 389222145 388422279 387579498 386735992 386066132 385301590 384047508 383127937 382273674 381558228
2888.3 381558228 380691605 379625893 378418503 377041473 376003075 375048790 374063187 372689972 371656761
2897 371656761 371282310 370687599 369530411 368195648 367648315 367316055 366377983 365238991 364615784
2905.7 364615784 363690720 362345810 361805115 361264915 359781113 357746735 356656151 355924110 354321556
2914.3C54321556j538925j533203j817169j796227j440811j454086j223488o29006
2922.1C42888641r11140j005135n64880j12572l21808o8969M86450K9754K59743N16091
2931.7C41196175L4408M23317J092224O78444M72641O61316Q94127J145859N47905
2940.4C47146416M29077J013679J509896J103935M33044M72985M15039M68864M11797
2949.1C53404732J165771J100273J16501N33028L32870R9831K85530K24190K35176
2957.7C57497902P74345J199532M81415M54139P99714P72781O18172P53784R37538
2966.4C64289322O66237N70259N52101J100388J079788P26242R43985J038170O96182
2975.1C71662674K81410J019173J076622M33502K85378L70674N17006O4621Q239N82276
$$ plain form
2914.3 354321556 352782631 351249428 349432259 347636032 346195221 344741135 343517647 342888641
2922.1 342888641 341977501 340972366 340407486 340294914 339973106 339904137 340390587 340420341 340680084 341196175
2931.7 341196175 341230583 341653900 342746124 343424568 343897209 344558525 345452652 346598511 347146416
2940.4 347146416 347575493 348589172 350099068 351203003 351636047 352109032 352524071 352992935 353404732
2949.1 353404732 354570503 355670776 355787277 356320305 356653175 356753006 357038536 357262726 357497902
2957.7 357497902 358272247 359471779 359953194 360407333 361207047 361979828 362598000 363351784 364289322
2966.4 364289322 364955559 365525818 366077919 367178307 368258095 368984337 369928322 370966492 371662674
2975.1 371662674 371944084 372963257 374039879 374473381 374758759 375129433 375646439 375711060 375719299 376301575
2984.7C76301575R22432J1253j12724L83415j49765L75976N66330K83013j29357o18171
2994.4C77833977m47426k14005J60599l35121m24194m43001n64385j52969o36482n68505
3004C74208488n29708o97136l48015l48816l55835o39687p54127k04582j62468p84836
3013.7C69383278r86519r07173m85878k32391n42450q72460r17091m95453r52339r69162
3023.3C62022362k76833o35300p80792o66694p22618r22127q12569o14395q00438p21931
3033C55068665n00565m24843j002006j202927p23724m37012o26259j007729p60345
3041.6C48383255o85272q28591r50851r99527p24335o83098j012077j139069o44378
3050.3C40716057o84281j040611q86574o26258n04342n66902q81691j338501j113434
$$ plain form
2984.7 376301575 377224007 377235260 377122536 377505951 377356186 377732162 378298492 378581505 378452148 377833977
2994.4 377833977 377386551 377172546 377333145 376998024 376573830 376130829 375566444 375413475 374776993 374208488
3004 374208488 373678780 372981644 372633629 372284813 371928978 371289291 370535164 370330582 370168114 369383278
3013.7 369383278 368396759 367489586 367003708 366771317 366228867 365356407 364439316 363943863 362991524 362022362
3023.3 362022362 361745529 361110229 360329437 359662743 358940125 358017998 357205429 356591034 355790596 355068665
3033 355068665 354568100 354143257 353141251 351938324 351214600 350777588 350151329 349143600 348383255
3041.6 348383255 347697983 346869392 345918541 344919014 344194679 343511581 342499504 341360435 340716057
3050.3 340716057 340031776 338991165 338104591 337478333 336973991 336407089 335525398 334186897 333073463
3059C33073463o62918m11644n26695q81882q96530r91516o94237l07464n70412r84497
3068.6C26145668p79495o46363o11305l49655r04884q83789n47600n82466o79932r14745
3078.3C19245434m53835n96237r56631p53841l79906p06806j417618p74364k59628
3087C12946568k20013m48074o78158p23458j011276q03470n68161l54634p67498j136417
3096.6C06235409p93133o79474m87213o36940p86724n14031l45897q90408r86118m50268
3106.2B99665203o66084p22885p45144j205902j287937m58928l75366p71656l40614
3114.9B93090687n76077n33924n13592j130218j117725n30377m34132q75434p60899
3123.6B86618309r74770r85488q30307o14739l35770p81288q44516r93729m67796l02659
$$ plain form
3059 333073463 332410545 331998901 331472206 330590324 329693794 328702278 328008041 327700577 327130165 326145668
3068.6 326145668 325366173 324719810 324108505 323758850 322853966 321970177 321422577 320840111 320160179 319245434
3078.3 319245434 318791599 318195362 317238731 316484890 316104984 315398178 313980560 313206196 312946568
3087 312946568 312726555 312278481 311600323 310876865 309865589 309062119 308493958 308139324 307371826 306235409
3096.6 306235409 305442276 304762802 304275589 303638649 302851925 302337894 301991997 301101589 300115471 299665203
3106.2 299665203 298999119 298276234 297531090 296325188 295037251 294578323 294202957 293431301 293090687
3114.9 293090687 292514610 291980686 291467094 290336876 289219151 288688774 288254642 287379208 286618309
3123.6 286618309 285643539 284658051 283827744 283213005 282877235 282095947 281251431 280257702 279789906 279487247
3133.3B79487247j104717p63263k67487n30624j191349p46003n99556j100635r84039
3141.9B72199574o73123n22461j100387o27938l96595p41062o04057o43883l65295
3150.6B66524773q96454r33686p02857j009598q06504n93319p89146j077042q04595
3159.3B58911572j043225m92801K0675o96659q36124q71926o61354q37288o38256o40163
3168.9B52214451j070347m84085m62608r93061j393795n60284l30162o09608k58312
3177.6B46052189r78603n66979m34303j059227o13384k54155o77910j025772n45654
3186.3B39896202p81937p30381o94236p46441j90449m61769p46594j112957p73468
3195B33657970m62608p37514o05984q06084m02412l43113p96585r01718q64277m01879
$$ plain form
3133.3 279487247 278382530 277619267 277351780 276821156 275629807 274883804 274284248 273183613 272199574
3141.9 272199574 271526451 271003990 269903603 269275665 268879070 268138008 267533951 266890068 266524773
3150.6 266524773 265628319 264694633 263991776 262982178 262175674 261582355 260793209 259716167 258911572
3159.3 258911572 257868347 257375546 257396221 256699562 255863438 254991512 254330158 253492870 252854614 252214451
3168.9 252214451 251144104 250660019 250197411 249204350 247810555 247250271 246920109 246310501 246052189
3177.6 246052189 245073586 244506607 244072304 243013077 242399693 242145538 241467628 240441856 239896202
3186.3 239896202 239114265 238383884 237689648 236943207 236752758 236290989 235544395 234431438 233657970
3195 233657970 233195362 232457848 231851864 231045780 230643368 230300255 229503670 228601952 227737675 227335796
3204.6B27335796k3613j29070p26623r33361o25649l09620m63314n89828n96791j030903
3214.3B21907024o01329l11680n62821m21428o50406o68602k23770m62914q40855n40847
3223.9B16622372m88701o13346l30944m7303o17485r96494k11410J04675k53449j003112
3233.5B12164803q83885m04243p03106m12007m64172o11305n03426l84846n99556p27882
3243.2B06470375K36816j16615o31752o34403q44708l47213m88243m61255n13095o18496
3252.8B02051411l04127k76852P3204m29268q42990j83335j72119n64194o70299n68505
3262.5A98112926l19061r6683M0340k59228q15258m53224l29933n98373n5867l79505
3272.1A94846134q16707l92037k74696l51906o02322l19919o4373l09372p0877l27397
$$ plain form
3204.6 227335796 227312183 227183113 226456490 225523129 224897480 224587860 224124546 223534718 222937927 221907024
3214.3 221907024 221305695 220994015 220431194 220009766 219359360 218690758 218466988 218004074 217163219 216622372
3223.9 216622372 216133671 215520325 215189381 215142078 214524593 213528099 213316689 213421364 213167915 212164803
3233.5 212164803 211280918 210876675 210173569 209761562 209297390 208686085 208182659 207797813 207198257 206470375
3243.2 206470375 206707191 206590576 205958824 205324421 204479713 204132500 203644257 203183002 202669907 202051411
3252.8 202051411 201747284 201470432 201543636 201114368 200271378 200088043 199915924 199351730 198681431 198112926
3262.5 198112926 197793865 197697182 197737522 197478294 196663036 196209812 195879879 195281506 195225639 194846134
3272.1 194846134 194029427 193637390 193362694 193010788 192408466 192088547 192024174 191714802 191643925 191316528
3281.8A91316528o11763k57053j93024k32277m34589l78742j41716k40917k85187j52855
3291.4A88388405o7387n90839p27062j28670j05820o41289n08232K62604M11186l6297
3301A86256599q67557n89256J76506m62609m33979J37806j38607o72092l84026p3280
3310.7A82949505l75919k55547m48704j96495Q9493l38535m09737k31895L2482l83950
3320.3A80430698o07891l33309n6248j67884o48308l75538k98748l10574o75964o42777
3330A76313457O1570l11680l57819j76620r9182k53163p21969p14436m82826m6139
3339.6A73211193j93729l10936l39451n47009k74524j94855l75328n01881j52206o4736
3349.3A70256538j51844O7959j81274m18320k19917j74065m46834p6676J6518j45703
$$ plain form
3281.8 191316528 190704765 190447712 190254688 190022411 189587822 189209080 189067364 188826447 188541260 188388405
3291.4 188388405 188321018 187730179 187003117 186874447 186768627 186127338 185619106 185881710 186292896 186256599
3301 186256599 185389042 184799786 184976292 184513683 184079704 184217510 184078903 183406811 183022785 182949505
3310.7 182949505 182573586 182318039 181869335 181672840 181762333 181423798 181014061 180782166 180814648 180430698
3320.3 180430698 179822807 179489498 179433250 179265366 178617058 178241520 177942772 177632198 176956234 176313457
3330 176313457 176375027 176063347 175705528 175528908 175429726 175176563 174454594 173740158 173257332 173211193
3339.6 173211193 173017464 172706528 172367077 171820068 171545544 171350689 170975361 170473480 170321274 170256538
3349.3 170256538 170104694 170172653 169991379 169573059 169353142 169179077 168732243 168655567 168672085 168526382
3358.9A68526382J17169j62850l24840j90506L57685K42538l80153j90792j66283K08798
3368.6A68037148N3176n11551q9473K47803J983k54879j22070j29662o0997J77193
3378.2A67348671J54324j33801k13890J70841K23580J7299k04296r2182r8286m34761
3387.8A66737499l37677K136M39702L76033J10321O256j97830n4664M41265N08060
3397.5A68031101J6384k22225k09331L30505l1662n64194J40171o6604m9362K63710
3407.1A67638493L10554K95982q5697K92416K84538P3700J9131J76067M21524p7514
3416.8A69349194Q8367L01991K69336L1624m13647R8095O09284O56509M75159M03213
3426.4A71869125K12384O7138L72219M33979L57972K55355J06068j02634p2441M21161
$$ plain form
3358.9 168526382 168643551 168480701 168155861 167965355 168323040 168565578 168185425 167994633 167828350 168037148
3368.6 168037148 168090324 167578773 167489300 167737103 167739086 167484207 167362137 167232475 167171478 167348671
3378.2 167348671 167502995 167369194 167155304 167326145 167549725 167567024 167362728 167270546 167172260 166737499
3387.8 166737499 166399822 166401958 166841660 167217693 167328014 167334270 167136440 167081776 167523041 168031101
3397.5 168031101 168047485 167825260 167615929 167946434 167914772 167350578 167490749 167424145 167374783 167638493
3407.1 167638493 167949047 168245029 168159332 168451748 168736286 168809986 168829117 169005184 169426708 169349194
3416.8 169349194 169437561 169739552 170008888 170040512 169626865 169724960 170334244 170990753 171465912 171869125
3426.4 171869125 172081509 172148647 172520866 172954845 173312817 173568172 173674240 173571606 173499165 173920326
3436.1A73920326O87256L95832K92568J60218M5242O02417K16808j30844N26810Q22563
3445.7A77539196O31638j13182L54843N74245j32160L56445J190338Q54912k00367
3454.4A81055908J32160P05510K64434M04416R30194Q54130k2030J5641P96432Q94375
3464A86031170R95560N80329k10990q9627K32029M32415R30634P66639O79570O23684
3473.7A90971413J26648L43647O73503R44787O76879N01137P53212O84738R06239N54218
3483.3A97136421P54795P81651L11947O56986M81605O12050P73353N90572M34056M51660
3493B02985096Q70666P89795N37911L98826R13373J057891N01652N11856R39560Q34732
3502.6B10341358K96459J395150J200218J02978Q28762J080131K54631j3275J136093
$$ plain form
3436.1 173920326 174607582 175003414 175295982 175456200 175501442 176103859 176320667 176189823 176716633 177539196
3445.7 177539196 178170834 178057652 178412495 178986740 178854580 179211025 180401363 181256275 181055908
3454.4 181055908 181188068 181893578 182158012 182562428 183492622 184346752 184324722 184340363 185136795 186031170
3464 186031170 187026730 187607059 187396069 187306442 187538471 187970886 188901520 189668159 190347729 190971413
3473.7 190971413 191098061 191441708 192115211 193059998 193736877 194238014 194991226 195675964 196582203 197136421
3483.3 197136421 197891216 198672867 198984814 199641800 200123405 200735455 201508808 202099380 202533436 202985096
3493 202985096 203855762 204645557 205183468 205582294 206495667 207553558 208055210 208567066 209506626 210341358
3502.6 210341358 210637817 212032967 213233185 213336163 214164925 215245056 215499687 215486412 216622505
3511.3B16622505J283913P13520R94205O83022L76758P46251R87568O29997N68867
3520B23606606J021881J428241R21650J10321J159649J414166Q66089O68392P14168
3528.6B31911163Q84743J090374J338978O76594Q34884J422158J442966N68924J30234
3537.3B40301018J506443J641826J550675J104984P50332J176147J096077Q06962P92922
3546B50727386J486531P19757J420612J479263J370965K495575J99184P22866J275425
3554.7B61897564J390209K333374P65476Q95558J085701J609287J365509J825447K230301
3563.4B75398426P39918K567844J268959J089554J067543n46360K725639J959534J443005
3572B87714062J650772J766224J652908J205330J720219J165466K450752J805000N30606
$$ plain form
3511.3 216622505 217906418 218619938 219614143 220297165 220673923 221420174 222407742 223037739 223606606
3520 223606606 224628487 226056728 226978378 227088699 228248348 229662514 230528603 231196995 231911163
3528.6 231911163 232795906 233886280 235225258 235901852 236736736 238158894 239601860 240170784 240301018
3537.3 240301018 241807461 243449287 244999962 246104946 246855278 248031425 249127502 249934464 250727386
3546 250727386 252213917 252933674 254354286 255833549 257204514 259700089 259899273 260622139 261897564
3554.7 261897564 263287773 265621147 266386623 267282181 268367882 269977169 271342678 273168125 275398426
3563.4 275398426 276138344 278706188 279975147 281064701 282132244 281585884 284311523 286271057 287714062
3572 287714062 289364834 291131058 292783966 293989296 295709515 296874981 299325733 301130733 301661339
3580.7C01661339J528034K583084K207413P98988L816929L190403n76897O16799K83870
3589.4C16109962L125306K715912K602005J857795Q82874K875976K34070K438698L476410
3598.1C36319008J012497L223839K281952R66300J864625J699409K358551L246040
3605.8C52972221K156105l38897L275909J073113O76193O792259K351914j077767L500671
3614.5C71381721N97039L531379M275094K106285K579422M73632J739350K808151L254089
3623.1C92746162L191414K612992K261200L367309P600556K051887p964172L780021
3630.9D09647369N386506N970344K259789n36538K534867L653946L873634K124100
3638.6D34914017K123565L193512L807335K337647J078491L601341N224457O498413
$$ plain form
3580.7 301661339 303189373 305772457 307979870 308778858 312595787 315786190 315209293 315826092 316109962
3589.4 316109962 319235268 321951180 324553185 326410980 327293854 330169830 330403900 332842598 336319008
3598.1 336319008 337331505 340555344 342837296 343803596 345668221 347367630 349726181 352972221
3605.8 352972221 355128326 354789429 358065338 359138451 359814644 366606903 368958817 367881050 371381721
3614.5 371381721 371978760 375510139 379785233 381891518 384470940 384944572 386683922 389492073 392746162
3623.1 392746162 395937576 398550568 400811768 404179077 411779633 413831520 405867348 409647369
3630.9 409647369 415033875 421004219 423264008 422727470 425262337 428916283 432789917 434914017
3638.6 434914017 437037582 440231094 444038429 446376076 447454567 451055908 456280365 462778778
3646.3D62778778r1820k047653O167374J409645n93720n89332N435180N571175M507523
3655D82547150O252517m847183J950874N952836K242240K203103J034278K588807J922226
3663.6E01846848K445526K971687J566696N295143L266907p01561R61418m987945K810440
3672.3E15475159Q976364J0283089L849105j5160675N0125P442551N124207j827660
3680E34212265j20544K783355J837921J501656J596489J046028M468804Q341789p089806
3688.7E48577957n093307Q577194m283486j796684N081711J455536J559105R5749m22097
3697.4E53751678J732064R78584K812195L664589m094429k289391M913140K297782
3705.1E63766212j7204J75629K860603M657631o337585M542350O864434j3885346K573128
$$ plain form
3646.3 462778778 462686958 460639305 466806679 468216324 467622604 467033272 472468452 478039627 482547150
3655 482547150 488799667 483952484 485903358 491856194 494098434 496301537 497335815 499924622 501846848
3663.6 501846848 504292374 507264061 508830757 514125900 517392807 516691246 517652664 512664719 515475159
3672.3 515475159 524451523 534734612 538583717 523423042 523473167 530915718 536039925 534212265
3680 534212265 534091721 536875076 538712997 540214653 541811142 542857170 547325974 555667763 548577957
3688.7 548577957 543484650 552061844 547778358 545981674 551063385 552518921 554078026 554173775 553751678
3697.4 553751678 555483742 556462326 559274521 562939110 558844681 556555290 561468430 563766212
3705.1 563766212 563749008 563924637 566785240 571442871 565105286 569647636 576512070 562626724 565199852
3713.8E65199852M173164Q56057J157341K097244J657219l195305R45396O000405j774979
3722.5E77116394m213142M293708J823922J77078k950516j379471L554764J459580
3730.2E79882317N982360j570091q307152R745789K450027j0712432o26030L134613
3737.9E79979401J464080J670876K318268l573151M022522J3956146p755966k0118141
3745.6E71964035R170113O328659O233673l507004j0704994J1737022m429016q691749
3753.3E78100739N820808M262848L868866m129181K319260O653060p611427k850075
3761E86434898L326798P79610N95359M289055j779518n716934K776184N940094K143707
3769.7E98789253q839454N83877K701302Q6784J232834o67229L44353P89032L448639
$$ plain form
3713.8 565199852 569373016 570229073 571386414 573483658 575140877 571945572 572890968 578891373 577116394
3722.5 577116394 572903252 577196960 579020882 579197960 576247444 574867973 578422737 579882317
3730.2 579882317 585864677 584294586 575987434 585733223 588183250 577470818 576844788 579979401
3737.9 579979401 581443481 583114357 585432625 581859474 585881996 599838142 592082176 571964035
3745.6 571964035 581134148 587462807 593696480 590189476 579484482 591221504 586792488 578100739
3753.3 578100739 583921547 588184395 592053261 587924080 590243340 596896400 589284973 586434898
3761 586434898 589761696 590541306 591136665 595425720 593646202 587929268 590705452 596645546 598789253
3769.7 598789253 589949799 590533676 593234978 593321762 594554596 593887367 594231720 595020752 598469391
3778.4E98469391L17764q061790K395706J890297P85293K729569k864266j599769J102524
3787.1E95164719R65042N14564j65252N50422l80668K77595N18646J542473M058800
3795.8F03046341k771530n056496J420593M077797O837731m980011j0867348L511658
3803.5E95218735J911888L997040O028709r005585m627990M805450J189880n82542
3811.2E98935585J100769P55959J319618O424179K49290j5061493M011155O206550
3818.9F03941612N442047M414139j8195610k606201M800301K885055L206902M29039
3826.6F04317284m485703l47366K151603L624192J574821r086952K952461P984391
3834.3F08684731o587067o14815R883957q279572o977081Q648262l702240j054306
$$ plain form
3778.4 598469391 598787155 590725365 593121071 595011368 595796661 598526230 595661964 594062195 595164719
3787.1 595164719 596129761 596644325 596479073 597029495 596648827 596926422 597445068 598987541 603046341
3795.8 603046341 600274811 595218315 596638908 600716705 607554436 602574425 591707077 595218735
3803.5 595218735 597130623 601127663 607156372 598150787 593522797 598328247 599518127 598935585
3811.2 598935585 600036354 600792313 602111931 608536110 608785400 593723907 597735062 603941612
3818.9 603941612 609383659 613797798 595602188 592995987 597796288 600681343 603888245 604317284
3826.6 604317284 599831581 599484215 601635818 605260010 606834831 597747879 600700340 608684731
3834.3 608684731 602097664 601482849 611366806 603087234 596110153 604758415 601056175 600001869
3842.1F00001869O912804k173462l796768K391014R77936k00043J137810j781426K500344
3850.7F05970078P445526o008683J477471j6146202j194802J1222954p20825j643829
3858.4F00401688K390899K757111L233414o014138o57844O667442m004288n813636
3866.2E98960648K560081N341835P590485o718254j1281548L230019O193123M405365
3873.9F10281754r701310j031150M049491L56827J992035L834381m971657p162628
3881.6E97647743N403710J172676K045212P133979j2966690r63096L775024J112099
3889.3F04360657N215912n08347r271507M39033L578453j385040P52678J282196K668495
3898F07132530K606278j0105133M824638L007011o072731M394455k508926j485634
$$ plain form
3842.1 600001869 606914673 604741211 600944443 603335457 604313393 604113350 605251160 603469734 605970078
3850.7 605970078 613415604 607406921 608884392 592738190 591543388 602766342 602045517 600401688
3858.4 600401688 602792587 605549698 608783112 602768974 602111130 608778572 604774284 598960648
3866.2 598960648 601520729 606862564 614453049 607734795 596453247 599683266 605876389 610281754
3873.9 610281754 600580444 599549294 603598785 603955612 605947647 609782028 604810371 597647743
3881.6 597647743 603051453 604224129 606269341 613403320 600436630 599473534 603248558 604360657
3889.3 604360657 609576569 609068222 599796715 600235748 603814201 602429161 603181839 604464035 607132530
3898 607132530 609738808 599633675 604458313 607465324 601392593 605787048 603278122 601792488
3905.7F01792488m38576l15933K389412O35033L78914o17752K66571M47082o40068
3914.4F03897171R79919J981278l440857l982658M417724N95513l924828J767769K037926
3923.1F04328957J233787k362099k820549J420708J173287J319770k57301k28691K055092
3931.7F05862961k079811j911316J027908K9564L10860L66096l29208j02501j84288
3940.4F02990265R67178J430321k892723j449814J210442P79037R45587j880874M35333
3949.1F02534752Q32786k249488J782570O00128j682930o2714P76291N94215q430N1117
3958.7F03168297j105843P81403L03383k287217J05362P89299P66373N99289l15895
3967.4F02804451p69997j34201P94983Q1215o23932k25601R23576K14844p13882k15683
$$ plain form
3905.7 601792488 601353912 601037979 603427391 604062424 604441338 603823586 604090157 604537239 603897171
3914.4 603897171 604877090 606858368 603417511 599434853 603852577 604448090 600523262 602291031 604328957
3923.1 604328957 605562744 603200645 600380096 601800804 602974091 604293861 604036560 603807869 605862961
3931.7 605862961 603783150 601871834 602899742 602929306 603240166 603606262 603277054 603174553 602990265
3940.4 602990265 603957443 605387764 602495041 601045227 602255669 603034706 603980293 602099419 602534752
3949.1 602534752 603367538 601118050 602900620 603500748 601817818 601755104 602531395 603125610 603117180 603168297
3958.7 603168297 602062454 602843857 603147240 600860023 600965385 601754684 602521057 603120346 602804451
3967.4 602804451 602034454 601900253 602695236 602776451 602152519 601926918 602850494 603065338 602351456 602135773
3977.1F02135773K99225J79100n50309n69992J59760Q92601K23999L24631k93427p56950
3986.7F02044411O74133K94456L53470m66728l13530L32871q15468k01149r9144N38597
3996.3F02341919N69534K59819J05439m46740
4000.2F02829971
$$ plain form
3977.1 602135773 602434998 602614098 602063789 601493797 601653557 602546158 602770157 603094788 602801361 602044411
3986.7 602044411 602718544 603013000 603366470 602899742 602586212 602919083 602103615 601902466 601803322 602341919
3996.3 602341919 602911453 603171272 603276711 602829971
4000.2 602829971
##END=$$ End of the data block
