##TITLE=$$ Begin of the data block
##JCAMP-DX=5.00 $$ ACD/SpecManager v 10.08
##SPECTROMETER/DATA SYSTEM=Varian
##DATE=16 Apr 2013 15:36:14
##DATA TYPE=INFRARED SPECTRUM
##DATA CLASS=XYDATA
##ORIGIN=
##OWNER=
##NPOINTS=3735
##FIRSTX=399.26403809
##LASTX=4000.35498047
##MAXX=4000.35498047
##MINX=399.26403809
##MAXY=64.12110901
##MINY=11.54345417
##XFACTOR=1.0000000000
##YFACTOR=0.000000100000000
##FIRSTY=16.67940903
##DELTAX=0.96440572
##XUNITS=1/CM
##YUNITS=TRANSMITTANCE
##XYDATA=(X++(Y..Y))
399.3A66794090m9572754j786794J0787878J0787868j091985o95467K665634Q188944
407A46077414Q188943Q229390M025383m32225k372055j075248J948661M591332N808182
415.7A74989777N841922N259419M197292K615414R86118L36113J396942L736859N860977
424.3B05220833O318264M872608K702732J459122J971645L670807N153942N348778
432.1B36718731M264412K762279J710720J395989J654491K350350L501644M904709
439.8B59263325N830078N352383L131122j39885l094139m524250l950119j622639J724453
448.4B61970329N031796P077694O945457M648247J315594j432247k506180j917973
456.2B81132717m94900Q51269J610623J700382J320839R01718J003075J984462L640671
$$ y = [166794090, 117221336, 115434542, 126222420, 137010288, 135918303, 135222836, 137888470, 146077414, 154266357, 162495747, 166521130, 166088905, 163716850, 162641602, 164590263, 169181595, 174989777, 180831699, 186091118, 190288410, 192903824, 193889942, 194226055, 195622997, 199359856, 205220833, 211539097, 216411705, 219114437, 220573559, 222545204, 226216011, 231369953, 236718731, 240983143, 243745422, 245456142, 246852131, 248506622, 250856972, 254358616, 259263325, 265093403, 270445786, 273576908, 273437023, 270342884, 265818634, 261868515, 260245876, 261970329, 267002125, 274079819, 281025276, 285673523, 286989117, 285556870, 283050690, 281132717, 280637817, 281489086, 283099709, 284800091, 286120930, 287022648, 288025723, 290010185, 293650856]
464.8B93650856N256596O164627O280517O032906N769710N339013M349212K791405
472.6C35634842J249084L99590L54729O14967O97174P13425J209678K426453L822022
481.2C47121964M446678L831939K483254J451263J401329K093773K749253K869300
489C68448753K657814K659684L064346L460579L304443K568932J839752J720161K191315
497.6C91915779K628098K471542J825256J334648J498642K188263K868042L208161
505.3D09938431L346824L534356L659706L300018K272949J013947K56271L17078P80105
514D28419685R40018N08003j95007p17278j010246j381836j972580k441749k287102
522.7D19861908j448784m81720p3318m24385j152001j755676k074280k252273k366524
$$ y = [293650856, 298907452, 305072079, 311352596, 317385502, 323155212, 328494225, 332843437, 335634842, 336883926, 337283516, 337638245, 338253212, 338950386, 339663811, 340873489, 343299942, 347121964, 351568642, 355400581, 357883835, 359335098, 360736427, 362830200, 365579453, 368448753, 371106567, 373766251, 376830597, 380291176, 383595619, 386164551, 388004303, 389724464, 391915779, 394543877, 397015419, 398840675, 400175323, 401673965, 403862228, 406730270, 409938431, 413285255, 416819611, 420479317, 423779335, 426052284, 427066231, 427322502, 427639580, 428419685, 429359703, 429867706, 429672699, 428955421, 427945175, 426563339, 424590759, 422149010, 419861908, 418413124, 417931404, 417858086, 417433701, 416281700, 414526024, 412451744, 410199471, 407832947]
531.4D07832947k266655j857834j436615j557388k453804l645897m259796l836708
539.1C86518250k818909k175026k499008l477135m242516m222946l623733l109513
546.8C60349464l103752l453026l725814l720932l607560l620491l743362l756409
554.5C31618118l544197l250389l107948l179589l334999l457298l577652l756218
562.3C04409828l891620l753319l249836k612076k237167k321091k671661k898388
570B80774670k772045k388459k009506j801090j734371j685715j569634j364936j076184
578.6B64372730p31830m27075l12214m88224q93078j308708j504059j396808j094456
587.3B56216278p99026o60210o91795p88250q07381o55670l36361N4664L71018M82502
$$ y = [407832947, 405566292, 403708458, 402271843, 400714455, 398260651, 394614754, 390354958, 386518250, 383699341, 381524315, 379025307, 375548172, 371305656, 367082710, 363458977, 360349464, 357245712, 353792686, 350066872, 346345940, 342738380, 339117889, 335374527, 331618118, 328073921, 324823532, 321715584, 318535995, 315200996, 311743698, 308166046, 304409828, 300518208, 296764889, 293515053, 290902977, 288665810, 286344719, 283673058, 280774670, 278002625, 275614166, 273604660, 271803570, 270069199, 268383484, 266813850, 265448914, 264372730, 263640900, 263213825, 262901611, 262413387, 261520309, 260211601, 258707542, 257310734, 256216278, 255417252, 254757042, 254065247, 253276997, 252469616, 251813946, 251477585, 251532249, 251903267, 252385769]
597B52385769L43494K9583k89192m44126l78628j85165k0638L2654K9488Q5373K32257
607.6B51820869L73936L88374K70806J50356J54762K69261L49445K75402P8984q8578
617.2B54043617j04122L0193K25602M12979N84373P39784Q36850Q23593P27253O80961
626.9B59001083Q36659J236191J770000K253990K551956K636071K563286K427253K327156
635.5B77603645K345391K506408K734967K888546K873592K755852K736129K978516
643.3B99423046L434639L844261L938790L674812L281765L073196L186341L475227
651C27332077L643761L498993L113212K771530K748795L085251L534965L736534L484230
659.7C56949348K888985K287102J964645J939049J994324J931762J782151J767311
$$ y = [252385769, 252729263, 252758846, 252469654, 252025528, 251646900, 251461735, 251441097, 251473751, 251503239, 251588612, 251820869, 252194805, 252583179, 252853985, 253004341, 253159103, 253428364, 253777809, 254053211, 254132195, 254043617, 253939495, 253969688, 254195290, 254608269, 255192642, 255932426, 256769276, 257592869, 258320122, 259001083, 259837742, 261073933, 262843933, 265097923, 267649879, 270285950, 272849236, 275276489, 277603645, 279949036, 282455444, 285190411, 288078957, 290952549, 293708401, 296444530, 299423046, 302857685, 306701946, 310640736, 314315548, 317597313, 320670509, 323856850, 327332077, 330975838, 334474831, 337588043, 340359573, 343108368, 346193619, 349728584, 353465118, 356949348, 359838333, 362125435, 364090080, 366029129, 368023453, 369955215, 371737366, 373504677]
667.4C73504677K057457K576523L052787L256340L176995K989616K875977K894211
675.1C96384583K992897L099060L164901L154297L040962K844887K652168K554627
682.8D19888382K549858K518654K331848J995621J681099J593208J794777K148819
690.5D36502266K426262K470207K279854J968841J673356J499404J512719J727371
698.2D52060280K076874K409019K560158K469292K230873K021942J959228K015725
705.9D69803391K075500K058716J990814J955109J992836K062301K091027K049560
713.7D86079254J970368J901855J864662J851044J856766J898803J996880K144318
721.4E01563950K299919K411728K456436K467880K522965K680969K910156L079262
$$ y = [373504677, 375562134, 378138657, 381191444, 384447784, 387624779, 390614395, 393490372, 396384583, 399377480, 402476540, 405641441, 408795738, 411836700, 414681587, 417333755, 419888382, 422438240, 424956894, 427288742, 429284363, 430965462, 432558670, 434353447, 436502266, 438928528, 441398735, 443678589, 445647430, 447320786, 448820190, 450332909, 452060280, 454137154, 456546173, 459106331, 461575623, 463806496, 465828438, 467787666, 469803391, 471878891, 473937607, 475928421, 477883530, 479876366, 481938667, 484029694, 486079254, 488049622, 489951477, 491816139, 493667183, 495523949, 497422752, 499419632, 501563950, 503863869, 506275597, 508732033, 511199913, 513722878, 516403847, 519314003, 522393265]
729.1E22393265L054847K835389K590294K525825K681770K865982K814980K441406
736.8E44203758J918488J513366J345597J323700J308403J297645J407433J671829
744.5E55990219J910591J842766J360779O73714J58805M9973K56233M67224M29268
753.2E63139572J38893j96075l56751k88543j23482o5994k49329o56319j144409j537628
762.8E58659935j730690j741180j686173j697540j837540k072487k315330k502976
770.6E43076019k643280k801971l039818l359909l701782l982010m145813m187584
778.3E15213852m140015m057159m003830m043732m207725m456940m677582m738617
786D80888252m570083m199562l713036l184471k642479k088432j521454r26056k48184
$$ y = [522393265, 525448112, 528283501, 530873795, 533399620, 536081390, 538947372, 541762352, 544203758, 546122246, 547635612, 548981209, 550304909, 551613312, 552910957, 554318390, 555990219, 557900810, 559743576, 561104355, 561778069, 561936874, 561986847, 562243080, 562710304, 563139572, 563278465, 563082390, 562725639, 562437096, 562313614, 562247620, 561998291, 561341972, 560197563, 558659935, 556929245, 555188065, 553501892, 551804352, 549966812, 547894325, 545578995, 543076019, 540432739, 537630768, 534590950, 531231041, 527529259, 523547249, 519401436, 515213852, 511073837, 507016678, 503012848, 498969116, 494761391, 490304451, 485626869, 480888252, 476318169, 472118607, 468405571, 465221100, 462578621, 460490189, 458968735, 458042679, 457794495]
794.7D57794495N76286J538124K509956L319054L893585M332848M797287N317001N724106
803.4D89802742N809937N559005N212784N070763N219269N463333N529441N327225
811.1E32994499N000611M741020M577560M373512M012871L551979L169861K979088
818.8E65401001K919006K836075K654877K436409K279396K187424K063522J832046
826.5E84609756J539917J321106J254235J277122J244011J071282Q20541O37321O07338
835.2E94382629O67344O55288M53186R8648k32620l62244k50206k5901J08757K8000
844.8E95522881k47078n88112q60482r86595r46350p61528n08804l35159m02642p66601
854.5E89119530j288376j698342j791572j594429j346130j304589j553306j967049
$$ y = [457794495, 458370781, 459908905, 462418861, 465737915, 469631500, 473964348, 478761635, 484078636, 489802742, 495612679, 501171684, 506384468, 511455231, 516674500, 522137833, 527667274, 532994499, 537995110, 542736130, 547313690, 551687202, 555700073, 559252052, 562421913, 565401001, 568320007, 571156082, 573810959, 576247368, 578526764, 580714188, 582777710, 584609756, 586149673, 587470779, 588725014, 590002136, 591246147, 592317429, 593137970, 593775291, 594382629, 595049973, 595705261, 596158447, 596257095, 596024475, 595662231, 595412025, 595386124, 595494881, 595522881, 595275803, 594687691, 593827209, 592840614, 591894264, 591132736, 590623932, 590288773, 589886131, 589119530, 587831154, 586132812, 584341240, 582746811, 581400681, 580096092, 578542786, 576575737]
862.2E76575737k345276k569923k662888k733230k894478l204918l640862m093132
869.9E52431030m409752m493141m389076m273529m323235m572906m898529n141487
877.6E15929375n252343n313186n431938n625115n807266n876198n792045n581322
885.3D71249962n284386m916611m477462l975029l429108k852707k235565j550331
893D42528763p73049R4338J010322J903038K706223L405991M054794M720154N409622
901.7D65060196O042328O510277O775360O901817O990852P086831P153511P134857
909.4E19656029P025146O863899O676140O434365O098594N683327N274963M972268
917.2E68684731M808883M731484M648056M495620M269524M001160L715133L407250
$$ y = [576575737, 574230461, 571660538, 568997650, 566264420, 563369942, 560165024, 556524162, 552431030, 548021278, 543528137, 539139061, 534865532, 530542297, 525969391, 521070862, 515929375, 510677032, 505363846, 499931908, 494306793, 488499527, 482623329, 476831284, 471249962, 465965576, 461048965, 456571503, 452596474, 449167366, 446314659, 444079094, 442528763, 441755714, 441850052, 442860374, 444763412, 447469635, 450875626, 454930420, 459650574, 465060196, 471102524, 477612801, 484388161, 491289978, 498280830, 505367661, 512521172, 519656029, 526681175, 533545074, 540221214, 546655579, 552754173, 558437500, 563712463, 568684731, 573493614, 578225098, 582873154, 587368774, 591638298, 595639458, 599354591, 602761841]
924.9F02761841L060913K686958K343636K100029J969108J874962J713944J470451
932.6F19981842J264572J256409J470642J726799J768074J490517J048431P23496O82258
941.3F31413040Q48389J004982R93919Q23059O02761M22515L00026K20833J83373J86424
950.9F36999321J97906J62201N6954p7553j69029j78375j29891q5449r8839j85280
960.6F36491966l17421m33044m58260l56903j69906j297O1836K9220k136N5199J87111
971.2F35086365K89039K70653J44043O104o0349n2910k0561J3847Q2360K15797L77960
981.8F36352348M71993M27475K74887J27411Q3656J50147K50740L07083K98614K55013
991.4F38999367K05383J52512R6817O6185J04179K20337L59993M31747L74222K00348
$$ y = [602761841, 605822754, 608509712, 610853348, 612953377, 614922485, 616797447, 618511391, 619981842, 621246414, 622502823, 623973465, 625700264, 627468338, 628958855, 630007286, 630730782, 631413040, 632261429, 633266411, 634260330, 635083389, 635686150, 636108665, 636408691, 636629524, 636812897, 636999321, 637197227, 637359428, 637416382, 637338829, 637169800, 636991425, 636861534, 636776085, 636677246, 636491966, 636174545, 635741501, 635283241, 634926338, 634756432, 634755135, 634816971, 634846191, 634844055, 634899254, 635086365, 635375404, 635646057, 635790100, 635796204, 635735855, 635682945, 635662384, 635676231, 635758591, 635974388, 636352348, 636824341, 637251816, 637526703, 637654114, 637737770, 637887917, 638138657, 638445740, 638744354, 638999367, 639204750, 639357262, 639454079, 639520264, 639624443, 639844780, 640204773, 640636520, 641010742, 641211090]
1001.1F41211090j3733j77154k31934j72119m3793P4387J09558L6774j06354k52075
1010.7F40434647l58811m36134n11437n80825o04401n55573m68788m17785m43612n07621
1020.3F35549660n29480m71154l79829l41186l91350m82216n30930n00068m23928l60717
1030F31138802l27530k89002k10571j14098p1220j36032k85454m27093m79546m40102
1039.6F28358154l80325l70674m12445m40140l89786k57110j01357K518J0528p4043
1049.3F25945320k02446k96516k83814j52588J8769J05552M7570q1673j29471j4458
1058.9F24956245J80092K77138J81923j8883j42441r5138L9902J01204J9989j14327
1068.6F25385704j60217p3548N2376Q7509j0490j71928k89383l07541k44294j52130
$$ y = [641211090, 641197357, 641020203, 640788269, 640616150, 640572357, 640646744, 640756302, 640793076, 640686722, 640434647, 640075836, 639639702, 639128265, 638547440, 637943039, 637387466, 636918678, 636500893, 636057281, 635549660, 635020180, 634549026, 634169197, 633828011, 633436661, 632954445, 632423515, 631923447, 631499519, 631138802, 630811272, 630522270, 630311699, 630197601, 630126381, 629990349, 629704895, 629277802, 628798256, 628358154, 627977829, 627607155, 627194710, 626754570, 626364784, 626107674, 626006317, 626008835, 626019363, 625945320, 625742874, 625446358, 625162544, 625009956, 625028725, 625134277, 625181847, 625100174, 624970703, 624956245, 625136337, 625413475, 625595398, 625576515, 625434074, 625338936, 625378838, 625480042, 625500031, 625385704, 625225487, 625151939, 625204315, 625291824, 625281334, 625109406, 624820023, 624512482, 624268188, 624116058]
1078.2F24116058p8773n1689p9766j49498k22511k53868k25410j63613j23405j50795
1087.9F22616730k51999l89481n00679n26581m44297k86141j32866o8702j23902k51274
1097.5F19640808l59840l86277l37257k75345k61154l14140m11225n14068n87158o04096
1107.1F15590248n60570m92782m70543n46875o96488q13903p93419o26984m21867l11280
1116.8F09855537l40652m38767m94995m59365l67394k89345k71988l29361m58946o29997
1126.4F05774727p56302p04269l82500J60484P30515J104240J180039J030311Q22182
1135.1F08959427O86149O51856O78482P23572P71522Q13370Q20999P59087O24046M68140
1144.8F15956650L75709M04053N30052O50254O43844M64363J89781j8119k7581J63613
$$ y = [624116058, 624037285, 623985596, 623905830, 623756332, 623533821, 623279953, 623054543, 622890930, 622767525, 622616730, 622364731, 621975250, 621474571, 620947990, 620503693, 620217552, 620084686, 620015984, 619892082, 619640808, 619280968, 618894691, 618557434, 618282089, 618020935, 617706795, 617295570, 616781502, 616194344, 615590248, 615029678, 614536896, 614066353, 613519478, 612822990, 612009087, 611215668, 610588684, 610166817, 609855537, 609514885, 609076118, 608581123, 608121758, 607754364, 607465019, 607193031, 606863670, 606404724, 605774727, 605018425, 604314156, 603931656, 604092140, 604822655, 605926895, 607106934, 608137245, 608959427, 609645576, 610297432, 610975914, 611699486, 612471008, 613284378, 614105377, 614864464, 615488510, 615956650, 616332359, 616736412, 617266464, 617916718, 618560562, 619024925, 619214706, 619196587, 619169006, 619332619]
1154.4F19332619M24995N91278N83344M46205K88238J82915J29166Q6250L5706k594
1164F22098122m921J9378L5134K8724L6354J13907K69928M29802M76036L45078R3841
1174.6F23941383j28173j84479n2223J66397L26042L39203K20604N1193q7166j51977
1184.3F24440804j39428o9847J9493Q2322Q1481J6480p1068j24168j11008m1771M4746
1194.9F24128036J12381J41907J33209J02921P7744Q6250J32789J85547J94512J32904
1204.5F25428200K8190n5580o6643l128R3346J75896K19497K22817J94015J44349R0942
1215.1F26471901N0735K6970J755m3831j01776j31073r1286J5068J33248J95122J72576
1225.8F26699409J01014M6692N0125R2086J12420O4697l8071j29547j45340p9422R461
$$ y = [619332619, 619757614, 620348892, 620932236, 621378441, 621666679, 621849594, 621978760, 622065010, 622100716, 622098122, 622093201, 622112579, 622147713, 622176437, 622212791, 622326698, 622596626, 623026428, 623502464, 623847542, 623941383, 623813210, 623628731, 623576508, 623742905, 624068947, 624408150, 624628754, 624679947, 624592781, 624440804, 624301376, 624231529, 624251022, 624333344, 624414825, 624431305, 624360237, 624236069, 624125061, 624083290, 624128036, 624240417, 624382324, 624515533, 624618454, 624696198, 624782448, 624915237, 625100784, 625295296, 625428200, 625456390, 625400810, 625334167, 625331039, 625424385, 625600281, 625819778, 626042595, 626236610, 626380959, 626471901, 626522636, 626549606, 626551361, 626507530, 626405754, 626274681, 626183395, 626198463, 626331711, 626526833, 626699409, 626800423, 626847115, 626897240, 626989326, 627101746, 627166443, 627128372, 626998825, 626853485, 626774063, 626783524]
1236.4F26783524N0277K2927k8077m4097j1902K4414J0338o3248j55411k15492k26784
1247F26146469k07710j83830j67313j60522j64605j78718j89553j78985j48049j25923
1256.6F24441261j46904k10991k79083l07121k91824k71378k81754l15742l27530k84882
1266.3F21724052k04963j43166j42326j93329k49405k66991k43148k10495k04850k36282
1275.9F19629097k85873l25432l37639l26004l07846k98958l03764l13187l15590l08723
1285.5F16506081l04947l22533l68042m26330m70200m80576m60624m27628l91617l42903
1295.2F12510681k63748j51520l0937N9166R4376Q0947M6616J6937l509k7275o5003
1305.8F12266731j09443j38016j35002j11008j01814j39733k23808l13682l61977l50456
$$ y = [626783524, 626833801, 626856728, 626828651, 626784554, 626772652, 626797066, 626807404, 626744156, 626588745, 626373253, 626146469, 625938759, 625754929, 625587616, 625427094, 625262489, 625083771, 624894218, 624715233, 624567184, 624441261, 624294357, 624083366, 623804283, 623497162, 623205338, 622933960, 622652206, 622336464, 622008934, 621724052, 621519089, 621375923, 621233597, 621040268, 620790863, 620523872, 620280724, 620070229, 619865379, 619629097, 619343224, 619017792, 618680153, 618354149, 618046303, 617747345, 617443581, 617130394, 616814804, 616506081, 616201134, 615878601, 615510559, 615084229, 614614029, 614133453, 613672829, 613245201, 612853584, 612510681, 612246933, 612095413, 612064476, 612123642, 612218018, 612298965, 612345581, 612362518, 612359009, 612331734, 612266731, 612157288, 612019272, 611884270, 611773262, 611671448, 611531715, 611307907, 610994225, 610632248, 610281792]
1315.4F10281792l04222k63863k52647k65770k89269l19404l57018l93181m05388l82309
1325.1F07048721l44238l34816l85590m89921o09398p05490p63359p91626q04901q10662
1334.7F01008720q02497p61261o66008n12429l29628j72767q8463q1864j17302j54418
1344.4E97322083j81923k13662k54287k81220k64053k03858j44615j39923k08168l15437
1354E95114937m04053m36478m20532l99971m20112m93012n89409o57806o65894o30150
1363.7E89997520o03370o33888p23839q27408q88176q80699q24013p62558p39479p80563
1373.3E82333527q88329j038513j183586j273232j283035j234360j179161j158943
1381E73094368j170769j168709j098060r38873p24450n26619m17137m30450n47638
$$ y = [610281792, 609977570, 609713707, 609461060, 609195290, 608906021, 608586617, 608229599, 607836418, 607431030, 607048721, 606704483, 606369667, 605984077, 605494156, 604884758, 604179268, 603415909, 602624283, 601819382, 601008720, 600206223, 599444962, 598778954, 598266525, 597936897, 597764130, 597675667, 597593803, 597476501, 597322083, 597140160, 596926498, 596672211, 596390991, 596126938, 595923080, 595778465, 595638542, 595430374, 595114937, 594710884, 594274406, 593853874, 593453903, 593033791, 592540779, 591951370, 591293564, 590627670, 589997520, 589394150, 588760262, 588036423, 587209015, 586320839, 585440140, 584616127, 583853569, 583114090, 582333527, 581445198, 580406685, 579223099, 577949867, 576666832, 575432472, 574253311, 573094368, 571923599, 570754890, 569656830, 568717957, 567993507, 567466888, 567049751, 566619301, 566071663]
1389.7E66071663p07817q42781r08509r01145q50564p96356p65800p55882p33529o54449
1399.3E58154831m92973k68097l9254J26572K01416K17476K46620L45612N13763O92253
1409E59698219Q08869Q30536P82127P15866O64063O18171N52674M69474M11110M27056
1418.6E65978165N21736O38580O99730O64520N57061M38194L55224L14217K92740K72827
1428.3E70732994K54784K46391K41013K16636J57433Q0642L5515O7063J76925L10860
1437.9E72520256L98865M05578L48740K65312J72501O7024l7155q5793k7580J21040
1447.6E74148788K62108K91443J91879M4442n8899j07003j60255k54288l31382k84577
1457.2E73742256q0147J84021L46833L17382J45798l2997j13945r1743m0322m0130
$$ y = [566071663, 565363846, 564521065, 563612556, 562711411, 561860847, 561064491, 560298691, 559542809, 558809280, 558154831, 557661858, 557393761, 557354507, 557481079, 557682495, 557899971, 558146591, 558492203, 559005966, 559698219, 560507088, 561337624, 562119751, 562835617, 563499680, 564117851, 564670525, 565139999, 565551109, 565978165, 566499901, 567138481, 567838211, 568502731, 569059792, 569497986, 569853210, 570167427, 570460167, 570732994, 570987778, 571234169, 571475182, 571691818, 571849251, 571929893, 571965408, 572032471, 572209396, 572520256, 572919121, 573324699, 573673439, 573938751, 574111252, 574178276, 574141121, 574055328, 574027748, 574148788, 574410896, 574702339, 574894218, 574938660, 574879761, 574772758, 574612503, 574358215, 574026833, 573742256, 573662109, 573846130, 574192963, 574510345, 574656143, 574623146, 574509201, 574417458, 574377136, 574337006]
1466.8E74337006j17226k30827l05291k85644j83220p7896o0921j57318k99492l84865
1476.5E72234306l65677k85186k26326k32926k85568l45497l95355m33693m37622l68996
1486.1E68857460k26059p8010k0562q6097k04201k63863k13890j00403j1520L204m0626
1496.7E67615433r5864j19705q9302j1597N6992J9035j90963n08767p33566o66580
1506.4E65275116k88048J97945N16205N34515L35617R3651r5139k49176l99856m99993
1516E65420837m66880l04566j40114j16081k45132l91846m06113k66800r0675j1978
1525.7E62980652o6567j90010l06053l92380m64096n16510n11894m31518l25013k88124
1535.3E59488487l79257n54657o98090p21359o40335n49583n21584n38139n24216m47426
$$ y = [574337006, 574219780, 573988953, 573683662, 573398018, 573214798, 573136902, 573075981, 572918663, 572619171, 572234306, 571868629, 571583443, 571357117, 571124191, 570838623, 570493126, 570097771, 569664078, 569226456, 568857460, 568631401, 568553391, 568532829, 568446732, 568242531, 567978668, 567764778, 567664375, 567652855, 567656059, 567615433, 567519569, 567399864, 567310562, 567298965, 567355957, 567374992, 567184029, 566675262, 565941696, 565275116, 564987068, 565185013, 565701218, 566235733, 566571350, 566665001, 566569862, 566320686, 565920830, 565420837, 564953957, 564649391, 564509277, 564393196, 564148064, 563756218, 563350105, 563083305, 562992630, 562980652, 562914085, 562724075, 562418022, 562025642, 561561546, 561045036, 560533142, 560101624, 559776611, 559488487, 559109230, 558554573, 557856483, 557135124, 556494789, 555945206, 555423622, 554885483, 554361267, 553913841]
1545E53913841l64914l63998m64745o02531p09000p88688q86765r84840r75266p82394
1554.6E46990700n03617l85398n98183j038246j379128j360016j030426o96754o30036
1563.3E39368896q33930j094704j227799j238746j249962j313400j348191j261253
1571E29800911j094055j007195j114082j350937j529388j515160j349182j196900j190567
1579.7E18453445j320648j471214j534767j495018j413231j355515j345024j368408
1587.4E07149620j412125j477279j563492j646347j687241j667595j611633j572113
1595.1D94511795j585312j641731j697426j717262j704293j695938j729583j811448
1602.8D80928802j913795j997070k039299k046814k043991k045098k040939k015076
$$ y = [553913841, 553548927, 553184929, 552720184, 552117653, 551408653, 550619965, 549733200, 548748360, 547773094, 546990700, 546487083, 546101685, 545503502, 544465256, 543086128, 541726112, 540695686, 539998932, 539368896, 538534966, 537440262, 536212463, 534973717, 533723755, 532410355, 531062164, 529800911, 528706856, 527699661, 526585579, 525234642, 523705254, 522190094, 520840912, 519644012, 518453445, 517132797, 515661583, 514126816, 512631798, 511218567, 509863052, 508518028, 507149620, 505737495, 504260216, 502696724, 501050377, 499363136, 497695541, 496083908, 494511795, 492926483, 491284752, 489587326, 487870064, 486165771, 484469833, 482740250, 480928802, 479015007, 477017937, 474978638, 472931824, 470887833, 468842735, 466801796, 464786720]
1610.5D64786720j975288j968193k044296k196961k335510k337189k140808j808319
1618.2D47980156j486435j301384j271782j308861j298217j187172j008912q42323
1626D38275070p43141p05986o79703o17599n19448m27055l75328l41911k50817l6087
1635.6D33577995K87628O18058Q31108Q69484P78541O64711O25077O97937Q59794J052284
1645.3D40862617J217423J328125J402550J483993J592942J689415J693611J559524
1653D52830200J333924J135559J063652J118087J210633J250648J223145J185570J202392
1661.6D63553810J284447J386070J447334J433525J348305J231346J147957J162415
1669.4D73995209J295776J494713J651916J681977J587562J459008J398849J443024
$$ y = [464786720, 462811432, 460843239, 458798943, 456601982, 454266472, 451929283, 449788475, 447980156, 446493721, 445192337, 443920555, 442611694, 441313477, 440126305, 439117393, 438275070, 437531929, 436825943, 436146240, 435528641, 435009193, 434582138, 434206810, 433864899, 433614082, 433577995, 433865623, 434483681, 435314789, 436184273, 436962814, 437627525, 438252602, 438950539, 439810333, 440862617, 442080040, 443408165, 444810715, 446294708, 447887650, 449577065, 451270676, 452830200, 454164124, 455299683, 456363335, 457481422, 458692055, 459942703, 461165848, 462351418, 463553810, 464838257, 466224327, 467671661, 469105186, 470453491, 471684837, 472832794, 473995209, 475290985, 476785698, 478437614, 480119591, 481707153, 483166161, 484565010, 486008034]
1677.1D86008034J551208J666756J776810J911354K088890K274475K400169K423401
1684.8E02101097K366676K299347K282944K329483K400284K434807K385406K243805
1692.5E20843849K042961J842079J685410J570892J452408J285515J077576Q92372
1700.2E32693062P98073Q04939Q49991Q49762P66945O38427N39399N20057N71213O39458
1709.9E39671326O73484O61355O28585O04859N93185N68619N10254M28619L58048L19099
1719.5E45017433K94190K48870J75362J06812P6980P2785M1809m2496j33438j49918
1729.1E45708389o9198K6168J8616j20010k81983l13758j62926O5574J99318J45913
1738.8E45216103m0055k23846l11623l11355k91787k99949l18947l00598k25868j30501
$$ y = [486008034, 487559242, 489225998, 491002808, 492914162, 495003052, 497277527, 499677696, 502101097, 504467773, 506767120, 509050064, 511379547, 513779831, 516214638, 518600044, 520843849, 522886810, 524728889, 526414299, 527985191, 529437599, 530723114, 531800690, 532693062, 533491135, 534296074, 535146065, 535995827, 536762772, 537401199, 537940598, 538460655, 539031868, 539671326, 540344810, 541006165, 541634750, 542239609, 542832794, 543401413, 543911667, 544340286, 544698334, 545017433, 545311623, 545560493, 545735855, 545842667, 545919647, 545992432, 546034241, 545991745, 545858307, 545708389, 545639191, 545665359, 545683975, 545563965, 545281982, 544968224, 544805298, 544870872, 545070190, 545216103, 545176048, 544952202, 544640579, 544329224, 544037437, 543737488, 543418541, 543117943, 542892075, 542761574]
1748.4E42761574p6409r5596j62582k17285k18659j76926j39923j48315k03209k73399
1758.1E41049271l23830l38631l18756k73895k22244j88713j94970k35900k80762k99111
1767.7E38372459k89764k77786k79999k83318k63671k22474j91383j92680k07215j94702
1777.4E35969467j47934j13601j47553k49214l51448l80478l20397k16407j22986o3019
1787E33856430l7231n4665j28326k38457l19328l04261j91536n7449M768l2119j10512
1797.6E32387314j44272r7351q621M9629L3722m3144j30692j84975j95465j79100j57165
1808.2E31329880j35880j11809q6593p3815q4915j10893j27182j18141r9526j01547
1817.9E30279579j33781j65673j56745j01166l9788k1247n2491r5329j11427r9335
$$ y = [542761574, 542685165, 542589569, 542426987, 542209702, 541991043, 541814117, 541674194, 541525879, 541322670, 541049271, 540725441, 540386810, 540068054, 539794159, 539571915, 539383202, 539188232, 538952332, 538671570, 538372459, 538082695, 537804909, 537524910, 537241592, 536977921, 536755447, 536564064, 536371384, 536164169, 535969467, 535821533, 535707932, 535560379, 535311165, 534959717, 534579239, 534258842, 534042435, 533919449, 533856430, 533819199, 533764534, 533636208, 533397751, 533078423, 532774162, 532582626, 532525177, 532529945, 532497826, 532387314, 532243042, 532145691, 532137070, 532186699, 532220421, 532177277, 532046585, 531861610, 531666145, 531487045, 531329880, 531194000, 531082191, 530995598, 530921783, 530836868, 530725975, 530598793, 530480652, 530381126, 530279579, 530145798, 529980125, 529823380, 529722214, 529682426, 529661179, 529608688, 529513359, 529401932, 529302597]
1827.5E29302597r1782j10511j42556j59950j53999j47972j67618k10381k45208k38800
1837.2E27633820j84174j03340l5591j4191n3024j34812k16446k52838k28615j71699
1846.8E26239090j32141j41602j90010k38914k53830k26555j72844j17912q4992r0484
1856.4E24589806j39847k18659k95982l39088l33329k88887k30255j80969j54762j54839
1866.1E22253189j72768j90963j90506j67008j40800j43128j89590k63062l22647l35960
1875.7E20136757l03116k51732k13890k04964k21633k50245k75993k85835k71225k37084
1885.4E17621040k01797j84708j92528k10151k17667k08778j95389j95618k14843k42997
1895E15556564k64778k72217k65083k48032k27317k13585k17476k38953k62604k67982
$$ y = [529302597, 529210815, 529100304, 528957748, 528797798, 528643799, 528495827, 528328209, 528117828, 527872620, 527633820, 527449646, 527346306, 527310715, 527296524, 527243500, 527108688, 526892242, 526639404, 526410789, 526239090, 526106949, 525965347, 525775337, 525536423, 525282593, 525056038, 524883194, 524765282, 524680290, 524589806, 524449959, 524231300, 523935318, 523596230, 523262901, 522974014, 522743759, 522562790, 522408028, 522253189, 522080421, 521889458, 521698952, 521531944, 521391144, 521248016, 521058426, 520795364, 520472717, 520136757, 519833641, 519581909, 519368019, 519163055, 518941422, 518691177, 518415184, 518129349, 517858124, 517621040, 517419243, 517234535, 517042007, 516831856, 516614189, 516405411, 516210022, 516014404, 515799561, 515556564, 515291786, 515019569, 514754486, 514506454, 514279137, 514065552, 513848076, 513609123, 513346519, 513078537]
1904.7E13078537k48566k18544j99814k00500k11067k20146k27852k42653k63252k72751
1914.3E10773392k53296k09770j71547j69487k08474k60734k87476k66075k07062j47552
1923.9E08591919j28555j69297k51884l28751l52325l09525k28881j58921j30615j40533
1933.6E06392632j66779j95923k31171k76145l17917l32451l11470k73171k47879k46086
1943.2E03793640k48375k28615j86119j53846j67199k26364k89078l02314k50473j68228
1952.9E01573029j13106j18523j69983k26822k59285k70080k81067l02544l20205l09830
1962.5D99201584k65007k06375j66168j62392j86920k17705k38037k46391k48452k46696
1972.2D97017441k35176k10457j79100j57852j59569j83907k16484k41508k54135k58255
$$ y = [513078537, 512829971, 512611427, 512411613, 512211113, 512000046, 511779900, 511552048, 511309395, 511046143, 510773392, 510520096, 510310326, 510138779, 509969292, 509760818, 509500084, 509212608, 508946533, 508739471, 508591919, 508463364, 508294067, 508042183, 507713432, 507361107, 507051582, 506822701, 506663780, 506533165, 506392632, 506225853, 506029930, 505798759, 505522614, 505204697, 504872246, 504560776, 504287605, 504039726, 503793640, 503545265, 503316650, 503130531, 502976685, 502809486, 502583122, 502294044, 501991730, 501741257, 501573029, 501459923, 501341400, 501171417, 500944595, 500685310, 500415230, 500134163, 499831619, 499511414, 499201584, 498936577, 498730202, 498564034, 498401642, 498214722, 497997017, 497758980, 497512589, 497264137, 497017441, 496782265, 496571808, 496392708, 496234856, 496075287, 495891380, 495674896, 495433388, 495179253, 494920998]
1981.8D94920998k59476k57797k50855k38800k23923k05955j81770j53847j36681j49994
1991.5D92861900j98326k62756l12615l29361l16009k84767k40288j80702j18714q6021
2001.1D90532341j11580j91002k79922l28865l21083k79351k35710k01874j70326j37863
2010.7D88274765j19743j31836j66855j94702j89743j59684j39579j61591k23503k90756
2020.4D86496773l20587k92015k17591j34735q3885q6327j32370j89819k26669k34185
2030D84578590k28653k33154k52113k68555k58255k12822j47400r0141o6795r0561
2039.7D82730141j55869k38075l02162l17154k77901k09236j49574j21727j20888j26076
2049.3D80711479j26190j28021j43814j71280j92223j94244j87302j96380k33765k80991
$$ y = [494920998, 494661522, 494403725, 494152870, 493914070, 493690147, 493484192, 493302422, 493148575, 493011894, 492861900, 492663574, 492400818, 492088203, 491758842, 491442833, 491158066, 490917778, 490737076, 490618362, 490532341, 490420761, 490229759, 489949837, 489620972, 489299889, 489020538, 488784828, 488582954, 488412628, 488274765, 488155022, 488023186, 487856331, 487661629, 487471886, 487312202, 487172623, 487011032, 486787529, 486496773, 486176186, 485884171, 485666580, 485531845, 485447960, 485361633, 485229263, 485039444, 484812775, 484578590, 484349937, 484116783, 483864670, 483596115, 483337860, 483125038, 482977638, 482887497, 482820702, 482730141, 482574272, 482336197, 482034035, 481716881, 481438980, 481229744, 481080170, 480958443, 480837555, 480711479, 480585289, 480457268, 480313454, 480142174, 479949951, 479755707, 479568405, 479372025, 479138260, 478857269]
2059D78857269l01704k73438k10075j48239j16882j14975j20430j16959j12572j29814
2068.6D77212181j79634k44560k85187k70386k01874j13754n1117l8872p0304j18218
2078.2D75638275j58615j85738k05268k19689k21100k00233j60828j20926j01967j11694
2087.9D73952217j42898j81160k14501k35176k38495k24838k04468j93748k02294k19803
2097.5D71894836k22740j95160j46370j06926j01738j29203j63842j75895j52855j04523
2107.2D70395584n5275l0899m8714j08909j89247k51923k62909k15340j35726o8856
2116.8D69027786m9934q4114j49117k11792k47802k50206k27166j90887j51634j17150
2126.5D67347984r7580j05552j47171k08016k53219k50168j96991j31264j04561j38778
$$ y = [478857269, 478555565, 478282127, 478072052, 477923813, 477806931, 477691956, 477571526, 477454567, 477341995, 477212181, 477032547, 476787987, 476502800, 476232414, 476030540, 475916786, 475865669, 475826797, 475756493, 475638275, 475479660, 475293922, 475088654, 474868965, 474647865, 474447632, 474286804, 474165878, 474063911, 473952217, 473809319, 473628159, 473413658, 473178482, 472939987, 472715149, 472510681, 472316933, 472114639, 471894836, 471672096, 471476936, 471330566, 471223640, 471121902, 470992699, 470828857, 470652962, 470500107, 470395584, 470340309, 470309410, 470260696, 470151787, 469962540, 469710617, 469447708, 469232368, 469096642, 469027786, 468977852, 468893738, 468744621, 468532829, 468285027, 468034821, 467807655, 467616768, 467465134, 467347984, 467250404, 467144852, 466997681, 466789665, 466536446, 466286278, 466089287, 465958023, 465853462, 465714684]
2136.1D65714684k05575k47650k23770j41105m9706o027l7193j27602k29492k90909
2145.8D64155655k83394k19650j46561j12038j30691j72348j89133j58729j03951p3128
2155.4D62566032r7961j66740k36245k64244k39601j82915j27143r6627r6817j17531
2165D60940208j45988j73264j96189k10228k08054j86691j56403j38473j48316j77688
2174.7D59198914j98822j90583j60103j38015j46942j77498j97869j86577j53656j29394
2184.3D57519455j31760j50261j63498j61209j53999j56021j67694j77689j77879j73454
2194D55905991j73836j79176j78223j60446j30158j03836r6931j13678j45264j78909
2203.6D54445534k03820k14157k09961j98135j89476j91498k02217k08931k00310j75743
$$ y = [465714684, 465509109, 465261459, 465037689, 464896584, 464846878, 464840851, 464803658, 464676056, 464446564, 464155655, 463872261, 463652611, 463506050, 463394012, 463263321, 463090973, 462901840, 462743111, 462639160, 462566032, 462468071, 462301331, 462065086, 461800842, 461561241, 461378326, 461251183, 461154556, 461057739, 460940208, 460794220, 460620956, 460424767, 460214539, 460006485, 459819794, 459663391, 459524918, 459376602, 459198914, 459000092, 458809509, 458649406, 458511391, 458364449, 458186951, 457989082, 457802505, 457648849, 457519455, 457387695, 457237434, 457073936, 456912727, 456758728, 456602707, 456435013, 456257324, 456079445, 455905991, 455732155, 455552979, 455374756, 455214310, 455084152, 454980316, 454883385, 454769707, 454624443, 454445534, 454241714, 454027557, 453817596, 453619461, 453429985, 453238487, 453036270, 452827339, 452627029, 452451286]
2213.3D52451286j46141j27945j30958j55869j95579k38190k68059k70614k42691j99166
2222.9D50476074j66893j66473j92604k15187k03209j51367q8196n6458p9269j42174
2232.5D49014244k04163k29187k11105j74942j53847j63154j90354k10609k07825j85241
2242.2D47083817j59302j43929j43509j55410j76735k02332k22168k23579k01683j67580
2251.8D45287590j41869j38359j53503j73531j91383k10381k35176k56652k54632k18353
2261.5D43313751j63421j24588j27869j66206k02141j99929j56631j06926r3842j33285
2271.1D41838913k01225k55280k70691k55699k36206k26746k20489k03552j73836j42098
2280.8D39653091j17874r9487q4991q2856j08223j61934k21977k59247k64816k52151
$$ y = [452451286, 452305145, 452177200, 452046242, 451890373, 451694794, 451456604, 451188545, 450917931, 450675240, 450476074, 450309181, 450142708, 449950104, 449734917, 449531708, 449380341, 449292145, 449235687, 449156418, 449014244, 448810081, 448580894, 448369789, 448194847, 448041000, 447877846, 447687492, 447476883, 447269058, 447083817, 446924515, 446780586, 446637077, 446481667, 446304932, 446102600, 445880432, 445656853, 445455170, 445287590, 445145721, 445007362, 444853859, 444680328, 444488945, 444278564, 444043388, 443786736, 443532104, 443313751, 443150330, 443025742, 442897873, 442731667, 442529526, 442329597, 442172966, 442066040, 441972198, 441838913, 441637688, 441382408, 441111717, 440856018, 440619812, 440393066, 440172577, 439969025, 439795189, 439653091, 439535217, 439435730, 439350739, 439267883, 439159660, 438997726, 438775749, 438516502, 438251686, 437999535]
2290.4D37999535k38305k24266k03590j83067j84975k23274k79999l16353l07617k63901
2300D35574188k14081j77192j54419j46599j65825k20795k92625l38821l26653k62947
2309.7D33274231j91307j55487j69335k11982k45362k37617j81236j04294n9242q9798
2319.3D31628571j95618l25585m17785m45938m31481m11606m02259l96996l87306l75633
2329D27838364l58200l14255k23923j04866j6785j3618r2926j91803k44637k39868
2338.6D26037483k21405k33726k69127k70882j90773m2763R7733J50757R4642k6207
2348.3D25125732j50680k59400l78532n20592o41098o67762n86777m76685m30946m40369
2357.9D20572891l79791j46866J85776L90854K96173k3346k89307k76108k5215K05918
$$ y = [437999535, 437761230, 437536964, 437333374, 437150307, 436965332, 436742058, 436462059, 436145706, 435838089, 435574188, 435360107, 435182915, 435028496, 434881897, 434716072, 434495277, 434202652, 433863831, 433537178, 433274231, 433082924, 432927437, 432758102, 432546120, 432300758, 432063141, 431881905, 431777611, 431718369, 431628571, 431432953, 431107368, 430689583, 430243645, 429812164, 429400558, 428998299, 428601303, 428213997, 427838364, 427480164, 427165909, 426941986, 426837120, 426820335, 426806717, 426713791, 426521988, 426277351, 426037483, 425816078, 425582352, 425313225, 425042343, 424851570, 424808807, 424906540, 425057297, 425151939, 425125732, 424975052, 424715652, 424337120, 423816528, 423175430, 422507668, 421920891, 421444206, 421013260, 420572891, 420193100, 420046234, 420232010, 420622864, 420919037, 420895691, 420606384, 420330276, 420305061, 420510979]
2367.6D20510979K04429j526k00996k25563r6817L8185P3357K6397k6550m9019n8708
2378.2D20194168o9809n9471n493O2103P7820Q583j03531j77879j71318j14365p6332
2388.8D19564476j02005j79558k57911k89765k63214k07367j69029j76850k18925k52953
2398.4D17446899k43110j94931j47324j34964j56288j79672j79482j57356j35422j30195
2408.1D15788155j42899j68419k05574k52685k95296l07541k73094k02294j33209j06811
2417.7D13700333j38321k03820k53028k42348j69487q1749m5471r7580k12517l19824
2427.3D11936188l57933l19519k48757j96953j81579j82762j75896j58272j48544j62277
2437D09803696j95389k29645k48718k46964k26020j89248j45378j08833r3308r8152
$$ y = [420510979, 420715408, 420713882, 420512886, 420287323, 420190506, 420228691, 420302048, 420328445, 420301895, 420252876, 420194168, 420124359, 420064888, 420059395, 420121498, 420199318, 420207901, 420104370, 419926491, 419755173, 419640808, 419564476, 419462471, 419282913, 419025002, 418735237, 418472023, 418264656, 418095627, 417918777, 417699852, 417446899, 417203789, 417008858, 416861534, 416726570, 416570282, 416390610, 416211128, 416053772, 415918350, 415788155, 415645256, 415476837, 415271263, 415018578, 414723282, 414415741, 414142647, 413940353, 413807144, 413700333, 413562012, 413358192, 413105164, 412862816, 412693329, 412611580, 412566109, 412468529, 412256012, 411936188, 411578255, 411258736, 411009979, 410813026, 410631447, 410448685, 410272789, 410114517, 409965973, 409803696, 409608307, 409378662, 409129944, 408882980, 408656960, 408467712, 408322334, 408213501, 408120193, 408022041]
2446.6D08022041j07917j11657j20201j61743k47192l45230l96500l64227k71530j85586
2456.3D05710258j60369j91613k29034k28882j91765j52511j38703j47247j60179j70937
2465.9D03939018j89399k20681k47459k42424j97373j37786j03074j14097j58081k02027
2475.6D02126617k20642k13623k00042j99433k13356k24380k13623j80054j47133j44958
2485.2D00169373j79139k23007k39143k15950j80588j73988k09885k59743k78625k43645
2494.8C97965660j69639r3956m8714m8943r3536j68305k44751k87551k76566k24876
2504.5C96308823j74981j64413j96724k39258k54898k34718k00501j84707k02561k44560
2514.1C94211502k82898k88925k48489j73150r9678p0533j03913j75895k33918k37426
$$ y = [408022041, 407914124, 407802467, 407682266, 407520523, 407273331, 406928101, 406531601, 406167374, 405895844, 405710258, 405549889, 405358276, 405129242, 404900360, 404708595, 404556084, 404417381, 404270134, 404109955, 403939018, 403749619, 403528938, 403281479, 403039055, 402841682, 402703896, 402600822, 402486725, 402328644, 402126617, 401905975, 401692352, 401492310, 401292877, 401079521, 400855141, 400641518, 400461464, 400314331, 400169373, 399990234, 399767227, 399528084, 399312134, 399131546, 398957558, 398747673, 398487930, 398209305, 397965660, 397796021, 397702065, 397653351, 397604408, 397510872, 397342567, 397097816, 396810265, 396533699, 396308823, 396133842, 395969429, 395772705, 395533447, 395278549, 395043831, 394843330, 394658623, 394456062, 394211502, 393928604, 393639679, 393391190, 393218040, 393118362, 393047829, 392943916, 392768021, 392534103, 392296677]
2523.8C92296677j89324j33552j18370j59493k30904k86636k94304k52113j87988j39733
2533.4C90304260j31912j60217j96686k08855j87530j51863j32866j47438j88675k36817
2543.1C88561401k76413k98996k96402k61726k00882j42097j19439j43089j87340k12402
2552.7C86422615k02637j78337j72195j94397k24724k36206k20757j90200j61858j45264
2562.4C84496040j47743j75514k23580k65617k69241k27318j73950j56212j87531k31971
2572C82437363k41509k07901j71470j74561k13966k46888k39639k05040j84135j95389
2581.6C80356865k17285k18125j97830j87416k06642k34604k32620j91956j50261j51825
2591.3C78368301j96762k38418k31400j79405j28822j20507j54266j97372k23160k30103
$$ y = [392296677, 392107353, 391973801, 391855431, 391695938, 391465034, 391178398, 390884094, 390631981, 390443993, 390304260, 390172348, 390012131, 389815445, 389606590, 389419060, 389267197, 389134331, 388986893, 388798218, 388561401, 388284988, 387985992, 387689590, 387427864, 387226982, 387084885, 386965446, 386822357, 386635017, 386422615, 386219978, 386041641, 385869446, 385675049, 385450325, 385214119, 384993362, 384803162, 384641304, 384496040, 384348297, 384172783, 383949203, 383683586, 383414345, 383187027, 383013077, 382856865, 382669334, 382437363, 382195854, 381987953, 381816483, 381641922, 381427956, 381181068, 380941429, 380736389, 380552254, 380356865, 380139580, 379921455, 379723625, 379536209, 379329567, 379094963, 378862343, 378670387, 378520126, 378368301, 378171539, 377933121, 377701721, 377522316, 377393494, 377272987, 377118721, 376921349, 376698189, 376468086]
2600.9C76468086k30217k28004k21100k11525k10381k22473k34909k29568k05078j82877
2610.6C74291954j85814k11182k33230k29073k00309j66512j43776j33247j29319j32827
2620.2C72526665j49231j76239k03934k25983k46391k70500k88048k76604k28881j70289
2629.9C70290565j44844j74140k32087k64663k38381j69334j07384r3841j30692j87721
2639.5C68547478k30065k41623k28462k08435j98479k06337k25524k40555k38495k19841
2649.1C66309662k00119j95313k07634k22320k22817k04582j79329j64490j70555j93901
2658.8C64348602k20527k33498k22931j93977j66054j63116j94474k45704k86637k92930
2668.4C62128754k64397k22626j92680j85928j96534k09579k11296j92757j54648j12495
$$ y = [376468086, 376237869, 376009865, 375788765, 375577240, 375366859, 375144386, 374909477, 374679909, 374474831, 374291954, 374106140, 373894958, 373661728, 373432655, 373232346, 373065834, 372922058, 372788811, 372659492, 372526665, 372377434, 372201195, 371997261, 371771278, 371524887, 371254387, 370966339, 370689735, 370460854, 370290565, 370145721, 369971581, 369739494, 369474831, 369236450, 369067116, 368959732, 368865891, 368735199, 368547478, 368317413, 368075790, 367847328, 367638893, 367440414, 367234077, 367008553, 366767998, 366529503, 366309662, 366109543, 365914230, 365706596, 365484276, 365261459, 365056877, 364877548, 364713058, 364542503, 364348602, 364128075, 363894577, 363671646, 363477669, 363311615, 363148499, 362954025, 362708321, 362421684, 362128754, 361864357, 361641731, 361449051, 361263123, 361066589, 360857010, 360645714, 360452957, 360298309, 360185814]
2678.1C60185814r7046j36833k32544l40996l98445l66097k63862j57280j06926j24207
2687.7C57961578j71013j99699j93138j68839j56097j71509k13814k69737l17688l33099
2697.4C55766945l01743k37274j78947j60294j75323j81809j45874q4305n7640j12877
2707C54130859k35786l60146m20837m01268l30467k49214j84937j51520j56097j95007
2716.6C51445580k45553k77633k79427k65541k58942k59017k43264j95236j31416q7433
2726.3C49202118q2550j03722j26648j47400j82457k40020k96746l15628k86941k43416
2735.9C47176590k32163k68783l21274l40156l04299k37465j83944j72005j93138k17514
2745.6C44705849k20452k00119j70517j45874j32637j34315j58425k08396k69509l10135
$$ y = [360185814, 360088768, 359951935, 359719391, 359378395, 358979950, 358613853, 358349991, 358192711, 358085785, 357961578, 357790565, 357590866, 357397728, 357228889, 357072792, 356901283, 356687469, 356417732, 356100044, 355766945, 355465202, 355227928, 355048981, 354888687, 354713364, 354531555, 354385681, 354301376, 354243736, 354130859, 353895073, 353534927, 353114090, 352712822, 352382355, 352133141, 351948204, 351796684, 351640587, 351445580, 351200027, 350922394, 350642967, 350377426, 350118484, 349859467, 349616203, 349420967, 349289551, 349202118, 349119568, 349015846, 348889198, 348741798, 348559341, 348319321, 348022575, 347706947, 347420006, 347176590, 346944427, 346675644, 346354370, 346014214, 345709915, 345472450, 345288506, 345116501, 344923363, 344705849, 344485397, 344285278, 344114761, 343968887, 343836250, 343701935, 343543510, 343335114, 343065605, 342755470]
2755.2C42755470l04565k61917k22931k23580k54249k67944k28768j57776j19209j61781
2764.9C40552750k69165l72277m07524l61442k64321j56517o5307j3733k4987j07688
2774.5C38509789k31858l35846l68843l31230k72064k43912k59666k88926k90069k42233
2784.2C35645142j57891p2097k9221o1722j68037l00751l84827l66478k57721j34010
2793.8C33712387q1749j35422k54860l60565l92418l46260k65503k04124j90926k17094
2803.4C31263466k51579k61918k35557j84021j35574j19248j48544k14501k88391l37944
2813.1C29086189l47633l25508k93808k65923k36053j94512j49879j34926j75552k56310
2822.7C26706085l21312l18565k49481j69525j39084j69907k24113k57607k59170k48414
$$ y = [342755470, 342450905, 342188988, 341966057, 341742477, 341488228, 341220284, 340991516, 340833740, 340714531, 340552750, 340283585, 339911308, 339503784, 339142342, 338878021, 338721504, 338656197, 338642464, 338617477, 338509789, 338277931, 337942085, 337573242, 337242012, 336969948, 336726036, 336466370, 336177444, 335887375, 335645142, 335487251, 335415154, 335385933, 335324211, 335156174, 334855423, 334470596, 334104118, 333846397, 333712387, 333630638, 333495216, 333240356, 332879791, 332487373, 332141113, 331875610, 331671486, 331480560, 331263466, 331011887, 330749969, 330514412, 330330391, 330194817, 330075569, 329927025, 329712524, 329424133, 329086189, 328738556, 328413048, 328119240, 327853317, 327617264, 327422752, 327272873, 327137947, 326962395, 326706085, 326384773, 326066208, 325816727, 325647202, 325508118, 325338211, 325114098, 324856491, 324597321, 324348907]
2832.4C24348907k43492k42996k38838k35367k43568k60887k66686k46620k16675k14653
2842C21939125k60849l36151m01115m33770m45938m55952m59060m27571l43284k25582
2851.7C18149853j21746p3929r1705j54782k30312k88925l11871k92416k40592j82667
2861.3C16160908j48735j59169k12593k83699l32317l22552k48546j44959p0495o5327
2870.9C14172516j18408j81179k15893k29130k57130l11813l58028l46909k73685j92090
2880.6C11688251j65481k06070k67181k95811k81468k55355k45095k48127k45380k33746
2890.2C09244537k29473k42119k57988k60200k56977k78340l37696m03747m22878l71647
2899.9C06183472k85988k29225k34394k81372l23697l36074l27740l19290l16105l05710
$$ y = [324348907, 324105415, 323862419, 323623581, 323388214, 323144646, 322883759, 322617073, 322370453, 322153778, 321939125, 321678276, 321342125, 320941010, 320507240, 320061302, 319605350, 319146290, 318718719, 318375435, 318149853, 318028107, 317954178, 317862473, 317707691, 317477379, 317188454, 316876583, 316584167, 316343575, 316160908, 316012173, 315853004, 315640411, 315356712, 315024395, 314701843, 314453297, 314308338, 314237843, 314172516, 314054108, 313872929, 313657036, 313427906, 313170776, 312858963, 312500935, 312154026, 311880341, 311688251, 311522770, 311316700, 311049519, 310753708, 310472240, 310216885, 309971790, 309723663, 309478283, 309244537, 309015064, 308772945, 308514957, 308254757, 307997780, 307719440, 307381744, 306977997, 306555119, 306183472, 305897484, 305668259, 305433865, 305152493, 304828796, 304492722, 304164982, 303845692, 303529587, 303223877]
2909.5C03223877k80914k51599k36149k43263k65846k90909l10802l26214l37868l43780
2919.2C00336533l40691l28445l11432k95658k86427k86884k95277l04375l03497k82402
2928.8B97301445k37141j73607j07212n9738m9324q1157j39237j94893k23446k20337
2938.5B95815353k01931j89418j92433k05269k15721k18048k14138k08664k03113j98498
2948.1B93768120j98059k08855k36568k78054l21598l50589l52517l26805k83451k38094
2957.7B90973530k03953j88713j98097k37942l07713l90338m49734m48513l74756k55756
2967.4B87918015j46809r5711j17035j87454k65636l16945l27167l04985k72236k51541
2977B85632496k52571k68975k84671k88086k81906k75593k72808k66838k51789k35196
$$ y = [303223877, 302942963, 302691364, 302455215, 302211952, 301946106, 301655197, 301344395, 301018181, 300680313, 300336533, 299995842, 299667397, 299355965, 299060307, 298773880, 298486996, 298191719, 297887344, 297583847, 297301445, 297064304, 296890697, 296783485, 296723747, 296674423, 296593266, 296454029, 296259136, 296035690, 295815353, 295613422, 295424004, 295231571, 295026302, 294810581, 294592533, 294378395, 294169731, 293966618, 293768120, 293570061, 293361206, 293124638, 292846584, 292524986, 292174397, 291821880, 291495075, 291211624, 290973530, 290769577, 290580864, 290382767, 290144825, 289837112, 289446774, 288997040, 288548527, 288173771, 287918015, 287771206, 287675495, 287558460, 287371006, 287105370, 286788425, 286461258, 286156273, 285884037, 285632496, 285379925, 285110950, 284826279, 284538193, 284256287, 283980694, 283707886, 283441048, 283189259, 282954063]
2986.7B82954063k38781k77900l41244l93944m01382l60089l02448k71664k85949l25623
2996.3B79755039l50837l38498l02848k80705k97298l41320l73803l64151l16772k68421
3006B76520386k56100k87743l38840l73173l69205l29361k74258k28805k11983k31857
3015.6B73619061k82078l46756m04053m37641m41017m20189l92380l80402m02736m55418
3025.2B69656391n06267n10712m45843l35884k43225k20680k72846l55435m19216m51775
3034.9B65894508m76246n12561n43480n28469m50268l44887k77977k89078l58104m26922
3044.5B61686516m54636m47635m40884m53987m72679m70810m44889m19007m15783m31575
3054.2B57234631m42295m34418m22611m33598m74911n25894n59482n69916n73330n85556
$$ y = [282954063, 282715282, 282437382, 282096138, 281702194, 281300812, 280940723, 280638275, 280366611, 280080662, 279755039, 279404202, 279065704, 278762856, 278482151, 278184853, 277843533, 277469730, 277105579, 276788807, 276520386, 276264286, 275976543, 275637703, 275264530, 274895325, 274565964, 274291706, 274062901, 273850918, 273619061, 273336983, 272990227, 272586174, 272148533, 271707516, 271287327, 270894947, 270514545, 270111809, 269656391, 269150124, 268639412, 268193569, 267857685, 267614460, 267393780, 267120934, 266765499, 266346283, 265894508, 265418262, 264905701, 264362221, 263833752, 263383484, 263038597, 262760620, 262471542, 262113438, 261686516, 261231880, 260784245, 260343361, 259889374, 259416695, 258945885, 258500996, 258081989, 257666206, 257234631, 256792336, 256357918, 255935307, 255501709, 255026798, 254500904, 253941422, 253371506, 252798176, 252212620]
3063.8B52212620o01082o01864n77850n39360n03998m79031m59900m45385m46968m76837
3073.5B47080345n31902n85556o10733n97840n63068n31960n20324n27706n42813n53760
3083.1B41514683n54238n45864n37910n41725n62554n91030o08883o03676n83229n69667
3092.7B35815907n79644o04496o14681n84602n19371m55151m30908m56886n02549n25341
3102.4B30542278n04341m57477m20380m12598m25434m39586m50745m69723m98676n12924
3112B25950394m78745l93314l02563k69489l19233m12026m76436m69361m08840l52440
3121.7B22067947l45707l88813m43534m66977m40921l79219l17269k87857l00102l31535
3131.3B18366013l40214k97928k13089j27068q2874r3613j38206j84498k12307k20642
$$ y = [252212620, 251611538, 251009674, 250431824, 249892464, 249388466, 248909435, 248449535, 248004150, 247557182, 247080345, 246548443, 245962887, 245352154, 244754314, 244191246, 243659286, 243138962, 242611256, 242068443, 241514683, 240960445, 240414581, 239876671, 239334946, 238772392, 238181362, 237572479, 236968803, 236385574, 235815907, 235236263, 234631767, 234017086, 233432484, 232913113, 232457962, 232027054, 231570168, 231067619, 230542278, 230037937, 229580460, 229160080, 228747482, 228322048, 227882462, 227431717, 226961994, 226463318, 225950394, 225471649, 225078335, 224775772, 224506283, 224187050, 223775024, 223298588, 222829227, 222420387, 222067947, 221722240, 221333427, 220889893, 220422916, 219981995, 219602776, 219285507, 218997650, 218697548, 218366013, 218025799, 217727871, 217514782, 217387714, 217304840, 217211227, 217073021, 216888523, 216676216, 216455574]
3141B16455574k16007k01969j78719j47953j15871q9627p7724q7910j23482j77326
3150.6B15038986k27241k46258k21157j63593j03474o7024o0635p2823r1476j15356
3160.3B13669949j48240j81140j86539j38569m3373M9400P7877J9074q5869j61934
3169.9B12870636j62621j08127n9796o0253r7694j25294j14441q0967o2103p4501r9506
3180.5B11825333j06030q2855m6215j9894j5316k6207m0073m7741m9114n0564o0272
3191.1B11281052p9594r8648j03588r3003q2206q6975r9087q6556l0231M2763P0495
3201.7B10634422J2627j01643j91402j96991j38130r3098j18942j92528k32925j84212
3211.4B09197178p3300J3772J4190n4779j15795j08223m4308O848j1368q8596j58863
$$ y = [216455574, 216239567, 216037598, 215858879, 215710926, 215595055, 215505428, 215427704, 215339794, 215216312, 215038986, 214811745, 214565487, 214344330, 214180737, 214077263, 214010239, 213949604, 213876781, 213785305, 213669949, 213521709, 213340569, 213154030, 213015461, 212972088, 213021488, 213099365, 213118439, 213032570, 212870636, 212708015, 212599888, 212540092, 212479839, 212382145, 212256851, 212142410, 212061443, 211999340, 211924839, 211825333, 211719303, 211636448, 211590233, 211570339, 211555023, 211528816, 211488743, 211441002, 211391888, 211341324, 211281052, 211201458, 211102810, 210999222, 210906219, 210824013, 210737038, 210637951, 210551395, 210521164, 210563927, 210634422, 210647049, 210545406, 210354004, 210157013, 210018883, 209925785, 209806843, 209614315, 209381390, 209197178, 209123878, 209137650, 209151840, 209097061, 208981266, 208873043, 208828735, 208835583, 208824215, 208735619, 208576756]
3222B08576756j63613j04790l9634k8801q2989j57642j91384j51519n2472N7717J27315
3232.6B07788944J26286N8479m1275j27067j69030j70574j60046j62925j78242j81370
3242.2B06783180j49421q4706j3523L1853L4542o68n4340j02406j26133j18961r0885
3252.8B06108532n9528l9902l3875l4446l6507m3545o2580r3059j23406j37043j20582
3263.4B05324059p3815j1444L6678L6888k7236j34316k28558k53734j94550r3422j9207
3274B04361343j5239o7387j20983j29204r0923m5471l4218o5384j11618j39713j39046
3284.7B03402157j27564j28116j46961j71967j89457j98669k08073k20051k25830k17285
3294.3B01568184k00882j94588k08778k33689k49290k47803k42386k50339k70100k79464
$$ y = [208576756, 208413143, 208308353, 208268719, 208239918, 208156929, 207999287, 207807903, 207656384, 207603912, 207661629, 207788944, 207915230, 207973709, 207932434, 207805367, 207636337, 207465763, 207305717, 207142792, 206964550, 206783180, 206633759, 206549053, 206535530, 206567383, 206601925, 206601257, 206546917, 206444511, 206318378, 206199417, 206108532, 206049004, 206009102, 205975227, 205940781, 205904274, 205860729, 205798149, 205705090, 205581684, 205444641, 205324059, 205250244, 205238800, 205275478, 205312366, 205285130, 205150814, 204922256, 204668522, 204473972, 204380550, 204361343, 204346104, 204278717, 204157734, 204028530, 203937607, 203892136, 203857918, 203792534, 203680916, 203541203, 203402157, 203274593, 203146477, 202999516, 202827549, 202638092, 202439423, 202231350, 202011299, 201785469, 201568184, 201367302, 201172714, 200963936, 200730247, 200480957, 200233154, 199990768, 199740429, 199470329, 199190865]
3303.9A99190865k60067k20452j91135j96800k31057k63881k70901k55203k42634k56615
3313.6A96802120k99434l53203l98274m26674m41284m44736m30470l90377l28083k70615
3323.2A93018970k56042l07598m11091n18265n77430n66483n01919m20646l53756l15819
3332.9A88789921l10288l38421l96766m69990n30586n52254n23109m55284l82062l46298
3342.5A84484863l78875m74701n84488o39477o01082m94461l93887l63388m07466m77200
3352.2A79669838n22251n35736n49107n86319o35013o60458o44455o03638n68790n55382
3361.8A73808689n52196n41783n20153m99382m93660n07049n31922n55172n62019n42622
3371.4A68502731n00526m59480m53701n02739n87616o52962o42510n40351l89805k67334
$$ y = [199190865, 198930798, 198710346, 198519211, 198322411, 198091354, 197827473, 197556572, 197301369, 197058735, 196802120, 196502686, 196149483, 195751209, 195324535, 194883251, 194438515, 194008045, 193617668, 193289585, 193018970, 192762928, 192455330, 192044239, 191525974, 190948544, 190382061, 189880142, 189459496, 189105740, 188789921, 188479633, 188141212, 187744446, 187274456, 186743870, 186191616, 185668507, 185213223, 184831161, 184484863, 184105988, 183631287, 183046799, 182407322, 181806240, 181311779, 180917892, 180554504, 180147038, 179669838, 179147587, 178611851, 178062744, 177476425, 176841412, 176180954, 175536499, 174932861, 174364071, 173808689, 173256493, 172714710, 172194557, 171695175, 171201515, 170694466, 170162544, 169607372, 169045353, 168502731, 168002205, 167542725, 167089024, 166586285, 165998669, 165345707, 164703197, 164162846, 163773041, 163505707]
3381.1A63505707k32563k90222l90587m67949m83895m44164l86066l46928l42064l60517
3390.7A59760752l75433l63302l17622k56662k09837j94826k01759k03438j86835j69658
3400.4A57281380j84126k37713k96421l11127k62394j77231j00212n3987l1395k2059
3410A55604715l4313p9698j45483j88933j73855j08041m0246j7652m6034r2897j21947
3420.6A54555616j21364r9859o6472k3250K3689N3988M1847j9961j05762j66950j60675
3431.2A53910847p7420N0078J61600K01035J50747M8513l2921l0803N9833J80769K51103
3441.8A54873381K30560J48745P8897P5188J29471J86815J99346J68286J33991J29452
3451.5A56354132J49412J65329J63832J62658J85461K27843K55870K41223J93472J52406
$$ y = [163505707, 163273144, 162982922, 162592335, 162124386, 161640491, 161196327, 160810261, 160463333, 160121269, 159760752, 159385319, 159022017, 158704395, 158447733, 158237896, 158043070, 157841311, 157637873, 157451038, 157281380, 157097254, 156859541, 156563120, 156251993, 155989599, 155812368, 155712156, 155658169, 155626774, 155604715, 155570402, 155490704, 155345221, 155156288, 154982433, 154874392, 154834146, 154816494, 154770460, 154677563, 154555616, 154434252, 154334393, 154267921, 154244671, 154268360, 154322348, 154364195, 154344234, 154238472, 154071522, 153910847, 153833427, 153883505, 154045105, 154246140, 154396887, 154445400, 154412479, 154381676, 154441509, 154622278, 154873381, 155103941, 155252686, 155331583, 155406771, 155536242, 155723057, 155922403, 156090689, 156224680, 156354132, 156503544, 156668873, 156832705, 156995363, 157180824, 157408667, 157664537, 157905760, 158099232, 158251638]
3461.1A58251638J49393J83821K33498K81486L24612L59926L75061L62511L40748L46012
3470.8A61208706L95431M55285M61711L76931K32620J12095Q6040J57681K65999L39737
3480.4A64092236L50437L22761L00427L03783L20988L31707L35808L53889L97015M39071
3490.1A67548122M29917L43456K16923J35765J67427L02753M62246N60475N69324N21221
3499.7A71257629M63162M15401L76644L52574L64761M23336M99211N38616N07793M23622
3509.4A75622749L40424L03974L24287L77713M28447M44546M10042L35846K61936K39334
3519A79089298K91577L94344M93488N48611N56068N36461N06554M70657M33274M04663
3528.6A83724995L88641L75099L54443L42102L71208M52595N46436N86834N44167M55303
$$ y = [158251638, 158401031, 158584852, 158818350, 159099836, 159424448, 159784374, 160159435, 160521946, 160862694, 161208706, 161604137, 162059422, 162521133, 162898064, 163130684, 163242779, 163328819, 163486500, 163752499, 164092236, 164442673, 164765434, 165065861, 165369644, 165690632, 166022339, 166358147, 166712036, 167109051, 167548122, 167978039, 168321495, 168538418, 168674183, 168841610, 169144363, 169606609, 170167084, 170736408, 171257629, 171720791, 172136192, 172512836, 172865410, 173230171, 173653507, 174152718, 174691334, 175199127, 175622749, 175963173, 176267147, 176591434, 176969147, 177397594, 177842140, 178252182, 178588028, 178849964, 179089298, 179380875, 179775219, 180268707, 180817318, 181373386, 181909847, 182416401, 182887058, 183320332, 183724995, 184113636, 184488735, 184843178, 185185280, 185556488, 186009083, 186555519, 187142353, 187686520, 188141823]
3538.3A88141823L88565L81336M16679M57058M86947N15155N47352N72510N81303N83934
3547.9A93072662N98011O22197O32457O09856N61085N08213M63066M25606M03785M17958
3557.6A98314896M72278N29690N37319M84772M27494M33769N08900N81703N80082N11322
3567.2B03382225M57211M92153O07052P23877P72514P46727O90250O44264O17867O03580
3576.9B09737720O01101O17619O51016O84223O99330O93149O75278O54430O30207O02494
3586.5B16246567N78575N72834N95455O45352P07225P58286P74002P41539O73523O09264
3596.1B22902622N94197O43825P23362P69768P39994O46667N46913M92497M90532N08976
3605.8B29059353N18741N22900N44949N93643O45790O68106O48155O00319N43881M86126
$$ y = [188141823, 188530388, 188911724, 189328403, 189785461, 190272408, 190787563, 191334915, 191907425, 192488728, 193072662, 193670673, 194292870, 194925327, 195535183, 196096268, 196604481, 197067547, 197493153, 197896938, 198314896, 198787174, 199316864, 199854183, 200338955, 200766449, 201200218, 201709118, 202290821, 202870903, 203382225, 203839436, 204331589, 204938641, 205662518, 206435032, 207181759, 207872009, 208516273, 209134140, 209737720, 210338821, 210956440, 211607456, 212291679, 212991009, 213684158, 214359436, 215013866, 215644073, 216246567, 216825142, 217397976, 217993431, 218638783, 219346008, 220104294, 220878296, 221619835, 222293358, 222902622, 223496819, 224140644, 224864006, 225633774, 226373768, 227020435, 227567348, 228059845, 228550377, 229059353, 229578094, 230100994, 230645943, 231239586, 231885376, 232553482, 233201637, 233801956, 234345837, 234831963]
3615.4B34831963M27208L80134L68385M03519M70581N41153N97687O36215O46553O00777
3625.1B39904175M79984L12405J75132J41888K21710L48606M34723M39167L93601L64895
3634.7B43216286L94039M59690M93755M37775K96593J46751P9632J28250K35882L04928
3644.4B46193581K82478K00958J33991J20793J37215J40743J26610J28517J66759K12441
3654B47844086K15892J64929J03969Q8177J26724J70517J60370P8945l6315j26076
3663.6B48791218j53103j27297r4699r9106j41621j70765j26190o87J35518J87702
3673.3B48200970J21612l738r1744r8304o3248n4569r2335j36375j39618j01643n9834
3683.9B47481174m0740l3780j6079J0796K0428l033m2133o3877n6343l9425m0913o6795
$$ y = [234831963, 235259171, 235639305, 236007690, 236411209, 236881790, 237422943, 238020630, 238656845, 239303398, 239904175, 240384159, 240696564, 240871696, 241013584, 241235294, 241583900, 242018623, 242457790, 242851391, 243216286, 243610325, 244070015, 244563770, 245001545, 245298138, 245444889, 245524521, 245652771, 245888653, 246193581, 246476059, 246677017, 246811008, 246931801, 247069016, 247209759, 247336369, 247464886, 247631645, 247844086, 248059978, 248224907, 248328876, 248417053, 248543777, 248714294, 248874664, 248953609, 248917294, 248791218, 248638115, 248510818, 248416119, 248317013, 248175392, 248004627, 247878437, 247877750, 248013268, 248200970, 248322582, 248318844, 248227100, 248128796, 248065548, 248010979, 247918644, 247782269, 247642651, 247541008, 247481174, 247440434, 247406654, 247390575, 247401371, 247421799, 247418766, 247376633, 247312756, 247256413, 247216988, 247176075, 247109280]
3695.5B47109280j03283j35727j60351j74160j64318j20430n4760j049J6079O447M19
3706.1B46218147N608j2474r5101k28767l31974l15590j68400K1668J35669J17836
3715.7B45346622Q851j07174j78452k11677k33670k47097k30846j75305j04579n7240
3725.4B43809433m6577m5891j6671M7017J00155P0514q2588l20683n27000n72147m07429
3736B42008133j15357J35346K05784Q2054j26247k76490k90756j83163k3365J13831
3745.6B41529770J69430J14040l5744k05879k97737k57969j25694l185K6779l8796
3755.3B40875015j37520k03666k14081j82076j33361r0351p3567r1820j26972j40076
3764.9B39481525j06468m8828k1362n5752j24149j63708j35250n7697J5659M2076Q945
$$ y = [247109280, 247005997, 246870270, 246709919, 246535759, 246371441, 246251011, 246196251, 246195202, 246211281, 246217728, 246218147, 246223755, 246211281, 246116180, 245887413, 245555439, 245239849, 245071449, 245093117, 245228786, 245346622, 245355473, 245248299, 245069847, 244858170, 244624500, 244377403, 244146557, 243971252, 243866673, 243809433, 243762856, 243716965, 243700294, 243747311, 243847466, 243917980, 243835392, 243514709, 242987709, 242415562, 242008133, 241892776, 242028122, 242233906, 242315960, 242189713, 241913223, 241622467, 241439304, 241415939, 241529770, 241699200, 241813240, 241777496, 241571617, 241273880, 241015911, 240890217, 240887032, 240913811, 240875015, 240737495, 240533829, 240319748, 240137672, 240004311, 239913960, 239840393, 239748573, 239621601, 239481525, 239375057, 239326229, 239304867, 239249115, 239124966, 238961258, 238826008, 238768311, 238783970, 238826046, 238834991]
3775.5B38834991p9879k13566l58334m46930m10881k45704m0970P2422K7466j22319
3785.2B37016296k50244k70099k04144j42116j39103j63231j45130o9237K479L643
3794.8B35639114n3444q4857l3665N2109O2389n3177k18677k99206k35577j00403k2468
3805.4B34652138o7482j94016l14159l64609l30543k27395r5863l013l663p6866j13754
3816B32860775k1477J52817K28291O4735k62699m98142m40636j47495J15585J33896
3825.7B32185650n8308k37846k31400p6008M9286J7662j35269k73647k99797k22836
3835.3B30717487j19075n7126n9585j11942j82267k34279k40116j94474j15509k9258
3844.9B29373856M6310J04446J38474J34144P8277l0994j76640l23639m28161m56638
$$ y = [238834991, 238755112, 238541546, 238183212, 237736282, 237325401, 237079697, 237038727, 237111149, 237138615, 237016296, 236766052, 236495953, 236291809, 236149693, 236010590, 235847359, 235702229, 235632992, 235635471, 235639114, 235585670, 235500813, 235467148, 235519257, 235581646, 235528469, 235309792, 235010586, 234775009, 234674606, 234652138, 234584656, 234390640, 234076481, 233711872, 233381329, 233153934, 233058071, 233055058, 233051395, 232974529, 232860775, 232839298, 232992115, 233220406, 233285141, 233022442, 232524300, 232083664, 231936169, 232051754, 232185650, 232127342, 231889496, 231658096, 231582088, 231631374, 231649036, 231513767, 231240120, 230940323, 230717487, 230598412, 230541286, 230481701, 230369759, 230187492, 229953213, 229713097, 229518623, 229403114, 229373856, 229420166, 229524612, 229663086, 229797230, 229875507, 229844513, 229667873, 229344234, 228916073, 228459435]
3854.6B28459435m06418l04413j85909o9085L8090J08853R5005k4319j92814k95277
3864.2B27223148k56767j22452k2545m5166j48735k13661j75552r1438o3382j15566
3873.9B25967884j67580j37043m3583J1349l4599j25599j47495o2275L9043K8267j18561
3884.5B25209808k86350l29857k15511n1918J6708n7087j94378k74028k39602j28250
3894.1B23449535j9436L4428L1567l8k9965m2438m4804o5746j34411k43549l35408
3904.7B22599735l38268k33727q1996K4795M1180m177n1918p3014p9364q9608j02024
3915.3B21611614j08909j20526j56612k14424k62261k71568k48909k23274k05193j70765
3925B19629173r4719Q107Q4819Q6518R746j02291j92127k19212j78871j03206m5166
$$ y = [228459435, 228053017, 227748604, 227562695, 227493610, 227531700, 227640553, 227735558, 227711239, 227518425, 227223148, 226966381, 226843929, 226821384, 226776218, 226627483, 226413822, 226238270, 226146832, 226083450, 225967884, 225800304, 225663261, 225619678, 225631027, 225596428, 225470829, 225323334, 225261059, 225300102, 225328369, 225209808, 224923458, 224593601, 224378090, 224326172, 224342880, 224285793, 224091415, 223817387, 223577785, 223449535, 223430099, 223464527, 223496094, 223496056, 223466091, 223423653, 223378849, 223313103, 223178692, 222935143, 222599735, 222261467, 222027740, 221945744, 221970539, 222011719, 222007542, 221955624, 221882610, 221803246, 221713638, 221611614, 221502705, 221382179, 221225567, 221011143, 220748882, 220477314, 220228405, 220005131, 219799938, 219629173, 219534454, 219542561, 219627380, 219713898, 219723644, 219621353, 219429226, 219210014, 219031143, 218927937, 218882771]
3935.6B18882771m7341j14479k12994k94284l22342k79827j68438j8921J07651J46808
3945.2B17678604Q2836l4618j33381j80454j90239j80702j42956p3548j2474j7700
3954.9B16795368r3155j68018j73225j24970j02520j45664k05841k17762j89877j86825
3964.5B15187511k28214k53620k03476j03989l2272j5926k1076m0722j29967l01838
3974.2B13856411m38290l92933j93367n9242j47857l42293l89099k40822j30100k38972
3983.8B11283436m05541l27034k8858Q8749k08034n80941n36766k26097m22649N30567
3993.5B09166832M94099M07447K70787Q3980j52893m39892p76958
4000.2B09053402
$$ y = [218882771, 218835430, 218720951, 218507957, 218213673, 217891331, 217611504, 217443066, 217424145, 217531796, 217678604, 217761440, 217726822, 217593441, 217412987, 217222748, 217042046, 216899090, 216825542, 216813068, 216795368, 216702213, 216534195, 216360970, 216236000, 216133480, 215987816, 215781975, 215564213, 215374336, 215187511, 214959297, 214705677, 214502201, 214398212, 214365940, 214350014, 214328938, 214288216, 214158249, 213856411, 213418121, 213025188, 212831821, 212772579, 212624722, 212282429, 211893330, 211652508, 211522408, 211283436, 210877895, 210550861, 210522003, 210610752, 210402718, 209821777, 209285011, 209058914, 208636265, 209166832, 209660931, 210068378, 210339165, 210423145, 210270252, 209830360, 209053402]
##END=$$ End of the data block
