##TITLE=$$ Begin of the data block
##JCAMP-DX=5.00 $$ ACD/SpecManager v 10.08
##SPECTROMETER/DATA SYSTEM=Varian
##DATE=16 Apr 2013 15:45:14
##DATA TYPE=INFRARED SPECTRUM
##DATA CLASS=XYDATA
##ORIGIN=
##OWNER=
##NPOINTS=3735
##FIRSTX=399.26403809
##LASTX=4000.35498047
##MAXX=4000.35498047
##MINX=399.26403809
##MAXY=47.05935287
##MINY=7.65175962
##XFACTOR=1.0000000000
##YFACTOR=0.000000100000000
##FIRSTY=27.10013008
##DELTAX=0.96440572
##XUNITS=1/CM
##YUNITS=TRANSMITTANCE
##XYDATA=(X++(Y..Y))
$$ plain form
399.3 271001301 222435837 198625355 199569874 195604954 194236393 196129990 198023605 198201714
407 198201714 197663517 197832069 198312569 197864437 196895618 197860374 202701359 210219994 216472588 217971039
416.6 217971039 214567738 209429436 206438084 207467155 211550884 216054955 218573570 218248253 215962772
425.3 215962772 213604317 212965050 214895153 219069004 224330711 229299622 232903099 234649696 234609203
434 234609203 233183250 230878201 228292923 226271629 225853424 227734108 231539288 235682640 238244038
442.7 238244038 238310413 236619606 234908123 234588585 235974846 238591480 241948662 245825977 249885235
451.3 249885235 253327522 255241718 255394459 254593887 254173832 255092030 257492924 260964584 264925079
460 264925079 268595390 270811996 270403366 267235184 262929230 260122509 260480556 263220673 265791702
$$ packed form
399.3B71001301m8565464k3810482R44519l964920j368561J893597J893615J78109
407A98201714n38197J68552M80500m48132r68819R64756M840985P518635O252594J498451
416.6B17971039l403301n138302k991352J029071M083729M504071K518615l25317k285481
425.3B15962772k358455o39267J930103M173851N261707M968911L603477J746597m0493
434B34609203j425953k305049k585278k021294m18205J880684L805180M143352K561398
442.7B38244038O6375j690807j711483l19538J386261K616634L357182L877315M059258
451.3B49885235L442287J914196J52741q00572m20055R18198K400894L471660L960495
460B64925079L670311K216606m08630l168182m305954k806721L58047K740117K571029
$$ plain form
468.7 265791702 266346455 265676365 266565742 271029682 278116474 284512558 287426033 286969719 285814667
477.4 285814667 286605320 289693851 293188095 294937344 294398746 292810078 291893120 292498016 294259109
486.1 294259109 296187897 297431946 297630730 296869926 295527458 294171295 293445282 293840065 295408039
494.7 295408039 297639885 299686737 300858707 301049347 300717754 300414085 300276031 299985790 299217777
503.4 299217777 298078270 297032280 296390324 295947857 295221519 294038200 292799816 292089901 292033939
512.1 292033939 292125378 291722946 290692120 289513149 288761978 288517838 288278923 287407837 285622253
520.8 285622253 283094540 280181255 277139969 274095860 271190510 268653393 266663704 265134201
528.5 265134201 263666344 261784573 259284344 256388569 253549232 251057205 248821335 246526031
$$ packed form
468.7B65791702N54753o70090Q89377M463940P086792O396084K913475m56314j155052
477.4B85814667P90653L088531L494244J749249n38598j588668r16958O04896J761093
486.1B94259109J928788J244049J98784p60804j342468j356163p26013L94783J567974
494.7B95408039K231846K046852J171970J90640l31593l03669j38054k90241p68013
503.4B99217777j139507j045990o41956m42467p26338j183319j238384p09915n5962
512.1B92033939R1439m02432j030826j178971p51171k44140k38915q71086j785584
520.8B85622253k527713k913285l041286l044109k905350k537117j989689j529503
528.5B65134201j467857j881771k500229k895775k839337k492027k235870k295304
$$ plain form
536.2 246526031 243990440 241335392 238779926 236320114 233698006 230731564 227619152 224816341
543.9 224816341 222566490 220604572 218398743 215694370 212764187 210081615 207772961 205445442
551.6 205445442 202569199 199001713 195128822 191527977 188519211 185997581 183605766 181020393
559.4 181020393 178134785 175079422 172119713 169481468 167186832 165030727 162761803 160341587
567.1 160341587 158029661 156180973 154931345 154082298 153303595 152446518 151653566 151167288 151048307
575.8 151048307 151084280 150961714 150514936 149820642 149080744 148439713 147912235 147453012 147053709 146742840
585.4 146742840 146496334 146185837 145664816 144936247 144230185 143876867 144055605 144638824 145279436 145671062
595 145671062 145757027 145721502 145801039 146098003 146538839 146967440 147255793 147341251 147194719 146781168 146056108
$$ packed form
536.2B46526031k535591k655048k555466k459812k622108k966442l112412k802811
543.9B24816341k249851j961918k205829k704373k930183k682572k308654k327519
551.6B05445442k876243l567486l872891l600845l008766k521630k391815k585373
559.4A81020393k885608l055363k959709k638245k294636k156105k268924k420216
567.1A60341587k311926j848688j249628q49047p78703q57077p92952m86278j18981
575.8A51048307L5973j22566m46778o94294p39898o41031n27478m59223l99303l10869
585.4A46742840k46506l10497n21021p28569p06062l53318J78738N83219O40612L91626
595A45671062Q5965l5525P9537K96964M40836M28601K88353Q5458j46532m13551p25060
$$ plain form
605.6 146056108 144990158 143588562 141882668 139895763 137616129 135022039 132182055 129374428
613.4 129374428 127106705 125943127 126202173 127742653 130039330 132532635 134997969 137652264 140940628
622 140940628 145203247 150474777 156497831 162852573 169084034 174806175 179802017 184079971 187810726
630.7 187810726 191165428 194202900 196929131 199455376 202041950 204922562 208066998 211151066
638.4 211151066 213810291 215954227 217844276 219868622 222239170 224876575 227546310 230081844
646.2 230081844 232500343 234953651 237590466 240439301 243380356 246219444 248821640 251211662
653.9 251211662 253551540 255997009 258555908 261085186 263438435 265619774 267791424 270131283
661.6 270131283 272688465 275373344 278065434 280701294 283251095 285642681 287763214 289573040
$$ packed form
605.6A46056108j065950j401596j705894j986905k279634k594090k839984k807627
613.4A29374428k267723j163578K59046J540480K296677K493305K465334K654295L288364
622A40940628M262619N271530O023054O354742O231461N722141M995842M277954L730755
630.7A87810726L354702L037472K726231K526245K586574K880612L144436L084068
638.4B11151066K659225K143936J890049K024346K370548K637405K669735K535534
646.2B30081844K418499K453308K636815K848835K941055K839088K602196K390022
653.9B51211662K339878K445469K558899K529278K353249K181339K171650K339859
661.6B70131283K557182K684879K692090K635860K549801K391586K120533J809826
$$ plain form
669.3 289573040 291212711 292954082 295003204 297333908 299726677 301981754 304089108 306175804
677 306175804 308295059 310303936 311983356 313280754 314402771 315638218 317085991 318571167 319829922
685.7 319829922 320763512 321504784 322261238 323129158 324067497 325019569 326015968 327151070 328483200
694.4 328483200 329980431 331556740 333140182 334702835 336245079 337766914 339247704 340636864
702.1 340636864 341869011 342919044 343868980 344913826 346262894 347995758 349996414 352034225 353926048
710.8 353926048 355646172 357310791 359082222 361083794 363364372 365891380 368555031 371203804
718.5 371203804 373729744 376153984 378626900 381317940 384282188 387427521 390609512 393753738
726.2 393753738 396886101 400063095 403306236 406619415 410046616 413660240 417456894 421270981
$$ packed form
669.3B89573040J639671J741371K049122K330704K392769K255077K107354K086696
677C06175804K119255K008877J679420J297398J122017J235447J447773J485176J258755
685.7C19829922R33590P41272P56454Q67920R38339R52072R96399J135102J332130
694.4C28483200J497231J576309J583442J562653J542244J521835J480790J389160
702.1C40636864J232147J050033R49936J044846J349068J732864K000656K037811J891823
710.8C53926048J720124J664619J771431K001572K280578K527008K663651K648773
718.5C71203804K525940K424240K472916K691040K964248L145333L181991L144226
726.2C93753738L132363L176994L243141L313179L427201L613624L796654L814087
$$ plain form
733.9 421270981 424832115 427945709 430628242 433064880 435431404 437762146 439979668 442026482
741.6 442026482 443945618 445837364 447763100 449705925 451614075 453459625 455250359 456994324
749.3 456994324 458660583 460166245 461395340 462253342 462741814 463001633 463260918 463698196 464326897
758 464326897 465010872 465600319 466051140 466415634 466740379 467006836 467174835 467248955 467263069 467200317 466976318
768.6 466976318 466539574 465980530 465493698 465196495 464989548 464622192 463914108 462916412 461861801 460968170
778.3 460968170 460286560 459704781 459063721 458272476 457364082 456488113 455845680 455571251 455624886 455798264
787.9 455798264 455869331 455786476 455704575 455824165 456195183 456684570 457134094 457525291 457972908 458571587
797.6 458571587 459279480 459967575 460563736 461121941 461751289 462499161 463316536 464120445 464862823 465536537
$$ packed form
733.9D21270981L561134L113594K682533K436638K366524K330742K217522K046814
741.6D42026482J919136J891746J925736J942825J908150J845550J790734J743965
749.3D56994324J666259J505662J229095Q58002M88472K59819K59285M37278O28701
758D64326897O83975N89447M50821L64494L24745K66457J67999P4120J4114o2752k23999
768.6D66976318m36744n59044m86832k97203k06947l67356p08084r97696j054611q93631
778.3D60968170o81610n81779o41060p91245r08394q75969o42433k74429N3635J73378
787.9D55798264P1067q2855q1901J19590L71018M89387M49524L91197M47617N98679
797.6D58571587P07893O88095N96161N58205O29348P47872Q17375Q03909P42378O73714
$$ plain form
807.2 465536537 466141357 466665955 467101402 467450447 467717247 467902145 468020058 468115959 468243980 468424950
816.9 468424950 468635979 468850708 469076347 469332047 469591293 469772110 469813194 469761162 469761467 469936256 470259590
827.5 470259590 470550575 470593529 470277786 469650078 468866196 468107147 467518806 467181091 467089844 467153740
837.1 467153740 467227058 467177620 466950874 466583710 466155128 465714073 465244026 464692612 464036522 463325348
846.8 463325348 462659874 462125931 461740303 461450577 461174011 460829887 460344925 459658737 458760147 457732811
856.4 457732811 456745529 455957565 455396042 454909897 454255676 453261337 451946449 450512466 449209518
865.1 449209518 448177261 447366943 446597023 445698090 444637756 443529091 442518730 441653481 440840340
873.8 440840340 439928246 438831177 437586441 436315269 435135384 434095192 433156204 432216682 431166382
$$ packed form
807.2D65536537O04820N24598M35447L49045K66800J84898J17913R5901J28021J80970
816.9D68424950K11029K14729K25639K55700K59246J80817M1084n2032L05J74789L23334
827.5D70259590K90985M2954l15743o27708p83882p59049n88341l37715r1247O3896
837.1D67153740P3318m9438k26746l67164m28582m41055m70047n51414o56090p11174
846.8D63325348o65474n33943l85628k89726k76566l44124m84962o86188q98590j027336
856.4D57732811r87282p87964n61523m86145o54221r94339j314888j433983j302948
865.1D49209518j032257q10318p69920q98933j060334j108665j010361q65249q13141
873.8D40840340r12094j097069j244736j271172j179885j040192r38988r39522j050300
$$ plain form
882.4 431166382 429960365 428669853 427455521 426460419 425706444 425094414 424515800 423968086 423553925
891.1 423553925 423368263 423393135 423512764 423634872 423792877 424128456 424766083 425691948 426736946 427674103
900.8 427674103 428354149 428780060 429073753 429370918 429732170 430138512 430557823 431002922 431511002 432067719
910.4 432067719 432566528 432870827 432932739 432854118 432815590 432926369 433127823 433238335 433100128 432699814
920 432699814 432162552 431639938 431200142 430817642 430452881 430125351 429890480 429742889 429557495 429153404
929.7 429153404 428439789 427504158 426547661 425725594 425044594 424411163 423763504 423137245 422595749 422111435
939.3 422111435 421539726 420731659 419678802 418548584 417569885 416869469 416394196 415970345 415432129
948 415432129 414711876 413838539 412876205 411873741 410859299 409861412 408914528 408035011 407195625 406330948
$$ packed form
882.4D31166382j206017j290512j214332r95102p53975o12030n78614n47714m14161
891.1D23553925j85662K4872J19629J22108J58005L35579O37627R25865J044998R37157
900.8D27674103O80046M25911K93693K97165L61252M06342M19311M45099N08080N56717
910.4D32067719M98809L04299O1912p8621l8528J10779K01454J10512j38207m00314
920D32699814n37262n22614m39796l82500l64761l27530k34871j47591j85394m04091
929.7D29153404p13615r35631r56497q22067o81000o33431o47659o26259n41496m84314
939.3D22111435n71709q08067j052857j130218r78699p00416m75273m23851n38216
948D15432129p20253q73337r62334j002464j014442r97887r46884q79517q39386q64677
$$ plain form
957.7 406330948 405376434 404310150 403165321 402006989 400890694 399828262 398781776 397693024 396535950
966.3 396535950 395348396 394203682 393134613 392086868 390971298 389787407 388697510 387951698 387710648
975 387710648 387926865 388397293 388931274 389464340 390024033 390614967 391167679 391599426 391899872 392134094
984.7 392134094 392361984 392573204 392707596 392729568 392665596 392567253 392444611 392242279 391879845 391316566
994.3 391316566 390584984 389769173 388944016 388123779 387258682 386287079 385198402 384047241 382900925
1003 382900925 381772690 380610466 379353218 377993431 376579971 375165482 373760872 372341347 370879936
1011.7 370879936 369358673 367753792 366033974 364194069 362286377 360400810 358601379 356882973
1019.4 356882973 355191269 353471870 351690979 349813499 347791367 345600052 343286285 340957603
$$ packed form
957.7D06330948r54514j066284j144829j158332j116295j062432j046486j088752j157074
966.3C96535950j187554j144714j069069j047745j115570j183891j089897p45812k41050
975C87710648K16217M70428N33981N33066N59693N90934N52712M31747L00446K34222
984.7C92134094K27890K11220J34392K1972o3972r8343j22642k02332l62434n63279
994.3C91316566p31582q15811q25157q20237q65097r71603j088677j151161j146316
1003C82900925j128235j162224j257248j359787j413460j414489j404610j419525j461411
1011.7C70879936j521263j604881j719818j839905j907692j885567j799431j718406
1019.4C56882973j691704j719399j780891j877480k022132k191315k313767k328682
$$ plain form
1027.1 340957603 338705292 336536598 334391365 332223396 330052414 327923698 325825920 323665733
1034.8 323665733 321341743 318849030 316316700 313942871 311882439 310165787 308688354 307266178
1042.5 307266178 305730286 304019375 302216053 300488319 298964214 297636223 296382790 295086670
1050.2 295086670 293733139 292389126 291091194 289769211 288291302 286579247 284666939 282645054
1058 282645054 280566902 278430138 276250896 274128571 272202454 270524349 268977795 267340412 265447559
1066.6 265447559 263313904 261106911 259001789 257047520 255151787 253182373 251085644 248921356
1074.4 248921356 246796532 244770451 242816906 240870037 238897552 236929893 235026150 233226528
1082.1 233226528 231542912 229984665 228568935 227286339 226062641 224780884 223367271 221865063
$$ packed form
1027.1C40957603k252311k168694k145233k167969k170982k128716k097778k160187
1034.8C23665733k323990k492713k532330k373829k060432j716652j477433j422176
1042.5C07266178j535892j710911j803322j727734j524105j327991j253433j296120
1050.2B95086670j353531j344013j297932j321983j477909j712055j912308k021885
1058B82645054k078152k136764k179242k122325j926117j678105j546554j637383j892853
1066.6B65447559k133655k206993k105122j954269j895733j969414k096729k164288
1074.4B48921356k124824k026081j953545j946869j972485j967659j903743j799622
1082.1B33226528j683616j558247j415730j282596j223698j281757j413613j502208
$$ plain form
1089.8 221865063 220412617 219131908 218022709 216957531 215778294 214409180 212899170 211375389
1097.5 211375389 209952831 208660679 207422752 206104107 204607792 202967243 201363144 200031700
1105.2 200031700 199119644 198593426 198278370 197990646 197652798 197310238 197059689 196968384 197046032 197269115
1114.9 197269115 197618027 198093739 198711834 199487019 200422955 201512032 202739906 204080353 205475311
1123.5 205475311 206821651 208007145 209002419 209948616 211144524 212900944 215349579 218354244 221597576
1132.2 221597576 224773712 227740974 230540905 233309689 236173840 239192543 242355499 245613861
1139.9 245613861 248926525 252300758 255795078 259471169 263330517 267302475 271308212 275344486
1147.6 275344486 279500771 283882122 288507824 293281517 298059731 302750988 307354984 311918640
$$ packed form
1089.8B21865063j452446j280709j109199j065178j179237j369114j510010j523781
1097.5B11375389j422558j292152j237927j318645j496315j640549j604099j331444
1105.2B00031700r12056n26218l15056k87724l37848l42560k50549r1305P7648K23083
1114.9A97269115L48912M75712O18095P75185R35936J089077J227874J340447J394958
1123.5B05475311J346340J185494R95274R46197J195908J756420K448635L004665L243332
1132.2B21597576L176136K967262K799931K768784K864151L018703L162956L258362
1139.9B45613861L312664L374233L494320L676091L859348L971958M005737M036274
1147.6B75344486M156285M381351M625702M773693M778214M691257M603996M563656
$$ plain form
1155.4 311918640 316465626 320975723 325430717 329871826 334399796 339105377 343990784 348961296
1163.1 348961296 353902817 358773270 363616638 368480568 373322945 378010406 382420464 386545258
1170.8 386545258 390486450 394343071 398107758 401677742 404964294 407981644 410823822 413561172
1178.5 413561172 416169014 418557892 420664139 422507324 424168091 425723534 427201271 428577118
1186.2 428577118 429796906 430807266 431595268 432226677 432846756 433609352 434567566 435613823 436537743
1194.9 436537743 437171974 437508430 437694016 437918968 438300514 438847733 439505501 440211525 440917130 441582642
1204.5 441582642 442178574 442697945 443154678 443557205 443884430 444097786 444188004 444207764 444252930 444402046
1214.2 444402046 444667740 444999046 445325890 445602226 445814514 445961685 446037178 446030922 445944023 445793610
$$ packed form
1155.4C11918640M546986M510097M454994M441109M527970M705581M885407M970512
1163.1C48961296M941521M870453M843368M863930M842377M687461M410058M124794
1170.8C86545258L941192L856621L764687L569984L286552L017350K842178K737350
1178.5D13561172K607842K388878K106247J843185J660767J555443J477737J375847
1186.2D28577118J219788J010360P88002O31409O20079P62596R58214J046257R23920
1194.9D36537743O34231L36456J85586K24952L81546N47219O57768P06024P05605O65512
1204.5D41582642N95932N19371M56733M02527L27225K13356R0218J9760M5166J49116
1214.2D44402046K65694L31306L26844K76336K12288J47171P5493o256q6899j50413
$$ plain form
1223.8 445793610 445603218 445391426 445176430 444986534 444855461 444792595 444755325 444662933 444455566 444148636
1233.5 444148636 443825874 443564644 443361435 443128319 442767982 442258148 441670837 441112556 440641212 440229149
1243.1 440229149 439794502 439273109 438674927 438083420 437595177 437238274 436934547 436544800 435969696 435224686
1252.8 435224686 434423866 433688622 433064041 432509422 431954231 431355743 430712662 430047531 429389763 428766899
1262.4 428766899 428189507 427630882 427032509 426347961 425589714 424825935 424121094 423479729 422853470 422201805
1272 422201805 421536179 420898895 420305099 419719467 419094582 418425407 417757492 417138367 416570320 416011848
1281.7 416011848 415422745 414799042 414163971 413533325 412899132 412247238 411582603 410930176 410309410 409714699
1291.3 409714699 409121513 408509903 407876778 407225266 406550446 405840874 405096436 404338989 403600121 402897148
$$ packed form
1223.8D45793610j90392k11792k14996j89896j31073o2866l7270r2392k07367l06930
1233.5D44148636l22762k61230k03209k33116l60337n09834n87311n58281m71344m12063
1243.1D40229149m34647n21393n98182n91507m88243l56903l03727l89747n75104p45010
1252.8D35224686q00820p35244o24581n54619n55191n98488o43081o65131o57768o22864
1262.4D28766899n77392n58625n98373o84548p58247p63779p04841o41365o26259o51665
1272D22201805o65626o37284n93796n85632o24885o69175o67915o19125n68047n58472
1281.7D16011848n89103o23703o35071o30646o34193o51894o64635o52427o20766n94711
1291.3D09714699n93186o11610o33125o51512o74820p09572p44438p57447p38868p02973
$$ plain form
1301 402897148 402221947 401549835 400860252 400147934 399421997 398697815 397987633 397292175 396597252 395882187
1310.6 395882187 395138702 394383278 393645134 392937088 392237206 391503067 390707054 389857597 388989677 388137817
1320.3 388137817 387320251 386540413 385790977 385048637 384274254 383433723 382532806 381627235 380787277 380037117
1329.9 380037117 379325104 378557167 377669296 376676636 375656853 374681816 373757133 372820282 371798897
1338.6 371798897 370677223 369513893 368396301 367369270 366400528 365411453 364343529 363202591 362040024
1347.3 362040024 360894012 359743958 358524399 357184372 355740128 354275589 352886200 351614494
1355 351614494 350425186 349234428 347963829 346573563 345059547 343432083 341706429 339910240 338085823
1363.7 338085823 336268196 334455032 332601891 330655327 328594360 326435280 324195976 321860847
$$ packed form
1301D02897148o75201o72112o89583p12318p25937p24182p10182o95458o94923p15065
1310.6C95882187p43485p55424p38144p08046o99882p34139p96013q49457q67920q51860
1320.3C88137817q17566p79838p49436p42340p74383q40531r00917r05571q39958p50160
1329.9C80037117p12013p67937q87871r92660j019783r75037r24683r36851j021385
1338.6C71798897j121674j163330j117592j027031r68742r89075j067924j140938j162567
1347.3C62040024j146012j150054j219559j340027j444244j464539j389389j271706
1355C51614494j189308j190758j270599j390266j514016j627464j725654j796189j824417
1363.7C38085823j817627j813164j853141j946564k060967k159080k239304k335129
$$ plain form
1371.4 321860847 319391098 316771832 314045792 311290417 308555927 305818558 302988148 299959259
1379.1 299959259 296665745 293108959 289352837 285487995 281577301 277609444 273502560 269172192
1386.8 269172192 264614220 259923992 255221348 250548706 245848083 241052799 236208706 231502972
1394.5 231502972 227169800 223365040 220127983 217451324 215369720 213969707 213319778 213400917 214108028
1403.2 214108028 215310822 216909218 218839931 221048126 223466606 226020985 228647804 231304951
1410.9 231304951 233966465 236610069 239205856 241717892 244122124 246431236 248700142 250994987
1418.6 250994987 253344917 255720692 258065605 260349045 262587757 264815331 267040272 269245472
1426.3 269245472 271429443 273633518 275915756 278294106 280721684 283121834 285444412 287688770
$$ packed form
1371.4C21860847k469749k619266k726040k755375k734490k737369k830410l028889
1379.1B99959259l293514l556786l756122l864842l910694l967857m106884m330368
1386.8B69172192m557972m690228m702644m672642m700623m795284m844093m705734
1394.5B31502972m333172l804760l237057k676659k081604j400013o49929Q1139P07111
1403.2B14108028J202794J598396J930713K208195K418480K554379K626819K657147
1410.9B31304951K661514K643604K595787K512036K404232K309112K268906K294845
1418.6B50994987K349930K375775K344913K283440K238712K227574K224941K205200
1426.3B69245472K183971K204075K282238K378350K427578K400150K322578K244358
$$ plain form
1434.1 287688770 289881134 292043839 294187737 296321430 298452320 300577984 302685776 304768333
1441.8 304768333 306834393 308897324 310954456 312988739 314995766 317002869 319051456 321158714
1449.5 321158714 323303604 325451698 327586517 329706841 331800613 333840561 335820007 337788582
1457.2 337788582 339832573 342001572 344254036 346480675 348589096 350568657 352478180 354380760
1464.9 354380760 356296692 358211021 360106087 361968765 363769417 365450325 366952972 368262558
1472.6 368262558 369422188 370502548 371556702 372600403 373619232 374582710 375453529 376202049 376829834
1481.3 376829834 377375298 377880898 378342896 378700256 378888664 378914299 378869743 378872986 378986778 379191513
1491 379191513 379420891 379608116 379704781 379680634 379530258 379280891 378977165 378651619 378320541 378012199
$$ packed form
1434.1B87688770K192364K162705K143898K133693K130890K125664K107792K082557
1441.8C04768333K066060K062931K057132K034283K007027K007103K048587K107258
1449.5C21158714K144890K148094K134819K120324K093772K039948J979446J968575
1457.2C37788582K043991K168999K252464K226639K108421J979561J909523J902580
1464.9C54380760J915932J914329J895066J862678J800652J680908J502647J309586
1472.6C68262558J159630J080360J054154J043701J018829R63478Q70819P48520O27785
1481.3C76829834N45464N05600M61998L57360J88408K5635m4556L243J13792K04735
1491C79191513K29378J87225R6665k4147j50376k49367l03726l25546l31078l08342
$$ plain form
1500.6 378012199 377777061 377635231 377505150 377218666 376651154 375852280 375030518 374387169 373962593 373648415
1510.2 373648415 373331757 372997818 372687950 372395515 372051888 371623497 371186867 370866013 370691338 370543976
1519.9 370543976 370254936 369754639 369113922 368447914 367802048 367142830 366446533 365770454 365218735 364835777
1529.5 364835777 364539146 364173012 363644676 363020172 362473717 362119446 361877632 361519508 360873833 360004272
1539.2 360004272 359176598 358631516 358378792 358209648 357900505 357397308 356813126 356279030 355822067 355375481
1548.8 355375481 354871025 354303131 353722572 353191261 352728958 352262001 351610069 350577087 349138374
1557.5 349138374 347574768 346375275 345911064 346136017 346597633 346776352 346462135 345836830 345222549
1566.2 345222549 344764137 344344063 343769188 343003922 342209358 341571846 341108208 340642281 339963646 339011917
$$ packed form
1500.6C78012199k35138j41830j30081k86484n67512p98874q21762o43349m24576l14178
1510.2C73648415l16658l33939l09868k92435l43627m28391m36630l20854j74675j47362
1519.9C70543976k89040n00297o40717o66008o45866o59218o96297o76079n51719l82958
1529.5C64835777k96631l66134n28336o24504n46455l54271k41814l58124o45675q69561
1539.2C60004272q27674n45082k52724j69144l09143n03197n84182n34096m56963m46586
1548.8C55375481n04456n67894n80559n31311m62303m66957o51932j032982j438713
1557.5C49138374j563606j199493m64211K24953M61616J78719l14217o25305o14281
1566.2C45222549m58412m20074n74875p65266p94564o37512m63638m65927o78635r51729
$$ plain form
1575.8 339011917 337918968 336887856 336031265 335311737 334614258 333861427 333058281 332246933 331439781
1584.5 331439781 330607910 329721146 328780441 327803230 326791382 325728111 324608917 323460121 322313614
1593.2 322313614 321167183 319983768 318737259 317453842 316195049 314996586 313830757 312632790
1600.9 312632790 311367130 310063915 308791924 307598000 306468334 305338058 304132614 302809010
1608.6 302809010 301379414 299911175 298496761 297196560 295986443 294761124 293412609 291932297
1616.3 291932297 290444660 289124794 288062649 287194042 286366138 285475464 284547329 283685722 282955837
1625 282955837 282321663 281695709 281039257 280406971 279895515 279554996 279343719 279156590 278894749 278527794
1634.6 278527794 278118973 277800808 277702312 277861309 278190384 278542671 278835735 279118958 279506474 280034237
$$ packed form
1575.8C39011917j092949j031112q56591p19528o97479p52831q03146q11348q07152
1584.5C31439781q31871q86764r40705r77211j011848j063271j119194j148796j146507
1593.2C22313614j146431j183415j246509j283417j258793j198463j165829j197967
1600.9C12632790j265660j303215j271991j193924j129666j130276j205444j323604
1608.6C02809010j429596j468239j414414j300201j210117j225319j348515j480312
1616.3B91932297j487637j319866j062145q68607q27904q90674r28135q61607p29885
1625B82955837o34174o25954o56452o32286n11456l40519k11277j87129k61841l66955
1634.6B78527794m08821l18165r8496J58997L29075L52287K93064K83223L87516N27763
$$ plain form
1644.3 280034237 280592480 281019802 281270161 281474247 281817303 282353001 282947197 283414612 283711071 283986301
1653.9 283986301 284450436 285189342 286102695 287002907 287760296 288363876 288871613 289332275 289759274 290162716
1663.6 290162716 290580368 291061668 291621189 292213821 292766380 293241272 293674431 294146385 294709568 295338821
1673.2 295338821 295953617 296491051 296959953 297425480 297946453 298530025 299141083 299744549 300337219 300953884
1682.9 300953884 301658630 302523403 303583031 304784698 305990105 307064495 307991676 308891945 309897499
1691.5 309897499 310998783 312028580 312815456 313348885 313775043 314230003 314701462 315074368 315297852
1700.2 315297852 315473309 315759125 316202564 316689243 317059021 317254829 317353897 317474041 317673168 317934399
1709.9 317934399 318219433 318514156 318826351 319157314 319480991 319743977 319887619 319887924 319789410 319692516
$$ packed form
1644.3B80034237N58243M27322K50359K04086L43056N35698N94196M67415K96459K75230
1653.9B83986301M64135P38906R13353R00212P57389O03580N07737M60662M26999M03442
1663.6B90162716M17652M81300N59521N92632N52559M74892M33159M71954N63183O29253
1673.2B95338821O14796N37434M68902M65527N20973N83572O11058O03466N92670O16665
1682.9C00953884P04746Q64773J059628J201667J205407J074390R27181R00269J005554
1691.5C09897499J101284J029797P86876N33429M26158M54960M71459L72906K23484
1700.2C15297852J75457K85816M43439M86679L69778J95808R9068J20144J99127K61231
1709.9C17934399K85034K94723L12195L30963L23677K62986J43642L05r8514r6894
$$ plain form
1719.5 319692516 319685478 319774628 319886780 319946213 319943218 319919605 319894676 319830780 319682236 319460621 319226551
1730.1 319226551 319014835 318792267 318508320 318177547 317883835 317693844 317582207 317461185 317280197 317075424
1739.8 317075424 316915131 316810627 316702919 316536293 316328907 316156216 316066914 316023121 315925484 315695896
1749.4 315695896 315341148 314947491 314616604 314393692 314242897 314085541 313870125 313611870 313363056 313147449
1759 313147449 312932911 312678013 312399368 312173214 312055988 312011299 311934166 311754818 311505184 311270485
1768.7 311270485 311080990 310871124 310556889 310143356 309739857 309465332 309345627 309305019 309242935 309108906
1778.3 309108906 308912983 308691692 308481064 308308144 308179893 308066349 307911053 307680225 307407894 307175598
1788 307175598 307030716 306927528 306762218 306476784 306126499 305836792 305690117 305652370 305604420 305442581
$$ packed form
1719.5C19692516p038Q9150J12152N9433k995k3613k4929o3896j48544k21615k34070
1730.1C19226551k11716k22568k83947l30773k93712j89991j11637j21022j80988k04773
1739.8C17075424j60293j04504j07708j66626k07386j72691q9302m3793r7637k29588
1749.4C15695896l54748l93657l30887k22912j50795j57356k15416k58255k48814k15607
1759C13147449k14538k54898k78645k26154j17226m4689p7133j79348k49634k34699
1768.7C11270485j89495k09866l14235m13533m03499k74525j19705m0608o2084j34029
1778.3C09108906j95923k21291k10628j72920j28251j13544j55296k30828k72331k32296
1788C07175598j44882j03188j65310k85434l50285k89707j46675l7747m7950j61839
$$ plain form
1797.6 305442581 305152969 304805603 304490566 304258156 304101620 303979378 303849754 303694458 303520470 303343754
1807.3 303343754 303170147 302992516 302806129 302625694 302478580 302377777 302300014 302195263 302022686 301779652
1816.9 301779652 301498966 301220245 300963459 300725784 300497112 300278893 300087280 299940681 299839382 299755611
1826.5 299755611 299644756 299476280 299258366 299033661 298845425 298703346 298578491 298428688 298227768 297976036
1836.2 297976036 297693901 297414188 297175236 297005806 296901722 296816120 296684361 296470146 296192245 295905018
1845.8 295905018 295653477 295444622 295259190 295081787 294915161 294769745 294645023 294524803 294385300 294206104
1855.5 294206104 293976688 293700924 293397617 293092518 292804890 292541943 292308025 292115517 291977692 291884518
1865.1 291884518 291789455 291633034 291391602 291106262 290860004 290716858 290673084 290660152 290593128 290425129
$$ packed form
1797.6C05442581k89612l47366l15037k32410j56536j22242j29624j55296j73988j76716
1807.3C03343754j73607j77631j86387j80435j47114j00803p7763j04751j72577k43034
1816.9C01779652k80686k78721k56786k37675k28672k18219j91613j46599j01299q3771
1826.5B99755611j10855j68476k17914k24705j88236j42079j24855j49803k00920k51732
1836.2B97976036k82135k79713k38952j69430j04084q5602j31759k14215k77901k87227
1845.8B95905018k51541k08855j85432j77403j66626j45416j24722j20220j39503j79196
1855.5B94206104k29416k75764l03307l05099k87628k62947k33918j92508j37825r3174
1865.1B91884518r5063j56421k41432k85340k46258j43146m3774j2932o7024j67999
$$ plain form
1874.8 290425129 290170593 289887199 289635811 289444103 289294319 289139919 288937817 288676262 288379936 288091221
1884.4 288091221 287842579 287639675 287463875 287288761 287098904 286899719 286712513 286557331 286434441 286317558
1894.1 286317558 286168556 285965500 285721817 285478973 285275154 285115376 284968796 284796352 284584351 284355640
1903.7 284355640 284149876 283990059 283864021 283731213 283548012 283292599 282977753 282645912 282347775 282111645
1913.3 282111645 281920586 281719742 281458359 281138420 280827122 280612259 280532265 280541134 280539227 280444241 280240383
1923.9 280240383 279969063 279681664 279404049 279138527 278889141 278673058 278507175 278386860 278282719 278158360
1933.6 278158360 277992287 277785854 277554359 277312050 277062778 276802826 276531487 276260815 276015663 275819817
1943.2 275819817 275677719 275566730 275448570 275292721 275094395 274873886 274658585 274462242 274277229 274081211
$$ packed form
1874.8B90425129k54536k83394k51388j91708j49784j54400k02102k61555k96326k88715
1884.4B88091221k48642k02904j75800j75114j89857j99185j87206j55182j22890j16883
1894.1B86317558j49002k03056k43683k42844k03819j59778j46580j72444k12001k28711
1903.7B84355640k05764j59817j26038j32808j83201k55413l14846l31841k98137k36130
1913.3B82111645j91059k00844k61383l19939l11298k14863p9994Q869j907r4986k03858
1923.9B80240383k71320k87399k77615k65522k49386k16083j65883j20315j04141j24359
1933.6B78158360j66073k06433k31495k42309k49272k59952k71339k70672k45152j95846
1943.2B75819817j42098j10989j18160j55849j98326k20509k15301j96343j85013j96018
$$ plain form
1952.9 274081211 273853779 273590946 273309975 273040657 272809658 272626801 272482319 272355499 272227402 272088909
1962.5 272088909 271940117 271784458 271623039 271453171 271270905 271075249 270869522 270658417 270442295 270216656
1972.2 270216656 269978848 269737778 269514999 269329929 269180756 269039783 268872681 268666763 268442860 268237286
1981.8 268237286 268069592 267925243 267768326 267571812 267337322 267090740 266860466 266658859 266479282 266307182
1991.5 266307182 266132870 265957222 265786457 265621662 265452652 265262566 265042858 264805794 264579449 264387074
2001.1 264387074 264228001 264078159 263912296 263726025 263536549 263364086 263212433 263068123 262915211 262748070
2010.7 262748070 262569904 262383862 262188969 261985645 261781101 261586437 261408234 261243916 261086597 260932217
2020.4 260932217 260779743 260624294 260452862 260249882 260010376 259746895 259483051 259238148 259017868 258821239
$$ packed form
1952.9B74081211k27432k62833k80971k69318k30999j82857j44482j26820j28097j38493
1962.5B72088909j48792j55659j61419j69868j82266j95656k05727k11105k16122k25639
1972.2B70216656k37808k41070k22779j85070j49173j40973j67102k05918k23903k05574
1981.8B68237286j67694j44349j56917j96514k34490k46582k30274k01607j79577j72100
1991.5B66307182j74312j75648j70765j64795j69010j90086k19708k37064k26345j92375
2001.1B64387074j59073j49842j65863j86271j89476j72463j51653j44310j52912j67141
2010.7B62748070j78166j86042j94893k03324k04544j94664j78203j64318j57319j54380
2020.4B60932217j52474j55449j71432k02980k39506k63481k63844k44903k20280j96629
$$ plain form
2030 258821239 258654404 258533039 258463974 258422604 258354893 258211250 257987614 257732334 257506981 257335892
2039.7 257335892 257191257 257028484 256833630 256635494 256472683 256353149 256247826 256120167 255958290 255779171
2049.3 255779171 255609779 255467796 255357018 255269871 255187683 255083332 254934864 254745712 254549770 254389362
2059 254389362 254281445 254202461 254106560 253960648 253767223 253557529 253367672 253216457 253098526 252991199
2068.6 252991199 252869205 252718639 252545052 252370472 252219372 252103519 252016487 251938839 251849136 251732426
2078.2 251732426 251585655 251420650 251262074 251135387 251047783 250977669 250886631 250747299 250564938 250370770
2087.9 250370770 250194092 250040245 249895630 249750481 249612026 249493408 249390907 249279652 249134731 248958302
2097.5 248958302 248784771 248655853 248588715 248563099 248536663 248472118 248355675 248197479 248019238 247841206
$$ packed form
2030B58821239j66835j21365o9065m1370o7711j43643k23636k55280k25353j71089
2039.7B57335892j44635j62773j94854j98136j62811j19534j05323j27659j61877j79119
2049.3B55779171j69392j41983j10778q7147q2188j04351j48468j89152j95942j60408
2059B54389362j07917p8984r5901j45912j93425k09694j89857j51215j17931j07327
2068.6B52991199j21994j50566j73587j74580j51100j15853q7032p7648q9703j16710
2078.2B51732426j46771j65005j58576j26687q7604p0114r1038j39332j82361j94168
2087.9B50370770j76678j53847j44615j45149j38455j18618j02501j11255j44921j76429
2097.5B48958302j73531j28918o7138k5616k6436o4545j16443j58196j78241j78032
$$ plain form
2107.2 247841206 247674942 247523327 247383747 247251701 247124271 247004452 246904335 246841125 246821804 246824894
2116.8 246824894 246798229 246685543 246467934 246183414 245903244 245680599 245516319 245371838 245211143 245031319
2126.5 245031319 244856281 244710197 244598961 244511909 244431515 244338932 244219494 244073315 243920841 243789978
2136.1 243789978 243691177 243607521 243514576 243409882 243315582 243248425 243192272 243107357 242967625 242782955 242582874
2146.7 242582874 242384377 242184925 241983852 241799240 241653194 241543369 241437721 241302719 241132812 240949898
2156.4 240949898 240778484 240627403 240494385 240377560 240274200 240172462 240055542 239919109 239778862 239652100
2166 239652100 239532032 239388275 239199142 238983574 238795071 238679848 238638191 238622284 238570728 238447418
2175.6 238447418 238258991 238044071 237847862 237695847 237582207 237478142 237355804 237210102 237058811 236922626
$$ packed form
2107.2B47841206j66264j51615j39580j32046j27430j19819j00117o3210j9321L090
2116.8B46824894k6665j12686k17609k84520k80170k22645j64280j44481j60695j79824
2126.5B45031319j75038j46084j11236q7052q0394r2583j19438j46179j52474j30863
2136.1B43789978r8801q3656r2945j04694r4300o7157n6153q4915j39732j84670k00081
2146.7B42582874j98497j99452k01073j84612j46046j09825j05648j35002j69907j82914
2156.4B40949898j71414j51081j33018j16825j03360j01738j16920j36433j40247j26762
2166B39652100j20068j43757j89133k15568j88503j15223m1657j5907n1556j23310
2175.6B38447418j88427k14920j96209j52015j13640j04065j22338j45702j51291j36185
$$ plain form
2185.3 236922626 236803322 236682549 236539974 236372166 236194668 236027431 235880814 235752296 235632458 235510540
2194.9 235510540 235376778 235223446 235049763 234867802 234700356 234568214 234473000 234392624 234295845 234166527
2204.6 234166527 234014187 233859692 233709927 233551693 233372250 233184280 233021297 232903404 232810421 232697315
2214.2 232697315 232541351 232369785 232236214 232166386 232131271 232072430 231952343 231779137 231588459 231411228
2223.9 231411228 231259060 231131058 231020145 230910320 230776882 230603294 230401878 230213375 230076809 229994850
2233.5 229994850 229926891 229818516 229641800 229414806 229187946 229009876 228897648 228828850 228758831 228651447
2243.2 228651447 228500862 228330879 228172302 228038712 227921772 227805996 227685070 227563267 227442207 227311611
2252.8 227311611 227156086 226970387 226766033 226562672 226375713 226214046 226087379 226007023 225971622 225950642
$$ packed form
2185.3B36922626j19304j20773j42575j67808j77498j67237j46617j28518j19838j21918
2194.9B35510540j33762j53332j73683j81961j67446j32142r5214q0376r6779j29318
2204.6B34166527j52340j54495j49765j58234j79443j87970j62983j17893r2983j13106
2214.2B32697315j55964j71566j33571o9828l5115n8841j20087j73206j90678j77231
2223.9B31411228j52168j28002j10913j09825j33438j73588k01416j88503j36566q1959
2233.5B29994850o7959j08375j76716k26994k26860j78070j12228o8798p0019j07384
2243.2B28651447j50585j69983j58577j33590j16940j15776j20926j21803j21060j30596
2252.8B27311611j55525j85699k04354k03361j86959j61667j26667q0356l5401k0980
$$ plain form
2262.4 225950642 225890007 225745392 225519505 225266056 225051517 224905682 224804173 224698105 224560261 224403858
2272.1 224403858 224260769 224145470 224042301 223923836 223777046 223609486 223436680 223269367 223114452 222981491
2281.7 222981491 222877769 222794876 222705059 222579060 222412434 222231293 222068157 221930752 221795349 221634216
2291.4 221634216 221446743 221262627 221112957 221000767 220902214 220794525 220677414 220565453 220463867 220358543
2301 220358543 220232601 220085983 219931850 219773903 219595776 219380989 219141712 218917999 218742771 218608646
2310.7 218608646 218474922 218307362 218104420 217885303 217661457 217436218 217231789 217100620 217086258 217164326
2320.3 217164326 217233887 217186394 216992607 216721611 216469803 216273708 216092033 215865765 215581913 215274963
2329.9 215274963 214979019 214701405 214449539 214269142 214226875 214338455 214519806 214627876 214566860 214358425
$$ packed form
2262.4B25950642o0635j44615k25887k53449k14539j45835j01509j06068j37844j56403
2272.1B24403858j43089j15299j03169j18465j46790j67560j72806j67313j54915j32961
2281.7B22981491j03722q2893q9817j25999j66626j81141j63136j37405j35403j61133
2291.4B21634216j87473j84116j49670j12190r8553j07689j17111j11961j01586j05324
2301B20358543j25942j46618j54133j57947j78127k14787k39277k23713j75228j34125
2310.7B18608646j33724j67560k02942k19117k23846k25239k04429j31169j4362P8068
2320.3B17164326O9561m7493j93787k70996k51808j96095j81675k26268k83852l06950
2329.9B15274963k95944k77614k51866j80397m2267J11580J81351J08070o1016k08435
$$ plain form
2339.6 214358425 214108753 213904819 213746891 213576546 213361607 213143368 212998486 212962856 212996635 213018303
2349.2 213018303 212963734 212811356 212567749 212253132 211912289 211623135 211464672 211451263 211499443 211478043
2358.9 211478043 211310749 211036453 210767403 210584793 210475960 210370522 210227890 210077839 209974918 209926071
2368.5 209926071 209877739 209775810 209629059 209501686 209444103 209439316 209422436 209349022 209237804 209145412 209104519
2379.1 209104519 209092960 209059086 208971920 208843155 208706264 208580132 208455544 208312092 208143253 207965202
2388.8 207965202 207804661 207679901 207590809 207521763 207451000 207358875 207234421 207080154 206913548 206758442
2398.4 206758442 206628323 206512947 206383457 206217060 206021385 205835571 205701694 205630226 205590343 205529900
2408.1 205529900 205409603 205222015 204989891 204752903 204552841 204417248 204342785 204290771 204208202 204068050
$$ packed form
2339.6B14358425k49672k03934j57928j70345k14939k18239j44882l5630L3779K1668
2349.2B13018303n4569j52378k43607l14617l40843k89154j58463j3409M8180k1400
2358.9B11478043j67294k74296k69050j82610j08833j05438j42632j50051j02921m8847
2368.5B09926071m8332j01929j46751j27373n7583m787j6880p3414j11218r2392m0893
2379.1B09104519j1559l3874q7166j28765j36891j26132j24588j43452j68839j78051
2388.8B07965202j60541j24760q9092o9046p0763r2125j24454j54267j66606j55106
2398.4B06758442j30119j15376j29490j66397j95675j85814j33877p1468l9883o0443
2408.1B05529900j20297j87588k32124k36988k00062j35593p4463n2014q2569j40152
$$ plain form
2417.7 204068050 203894024 203743896 203660183 203631668 203600998 203509827 203338528 203107395 202849483 202587852
2427.3 202587852 202336330 202111607 201934242 201814194 201739292 201681709 201615677 201529293 201421986 201296177
2437 201296177 201155910 201010380 200872974 200750904 200635281 200504971 200342369 200148144 199942074 199748783
2446.6 199748783 199582863 199444046 199324226 199218178 199126701 199049549 198974533 198876610 198733692 198549805
2456.3 198549805 198363533 198224716 198153152 198112850 198031750 197857189 197601185 197336674 197144604 197057266
2465.9 197057266 197039928 197019901 196933117 196754475 196500988 196217346 195955524 195756245 195634327 195576763
2475.6 195576763 195554485 195539055 195510216 195452366 195350475 195196037 194997730 194781590 194576225 194396496
2485.2 194396496 194241314 194102859 193972454 193836460 193674316 193472004 193242798 193029881 192878952 192801552
$$ packed form
2417.7B04068050j74026j50128q3713k8515l0670r1171j71299k31133k57912k61631
2427.3B02587852k51522k24723j77365j20048p4902n7583o6032q6384j07307j25809
2437B01296177j40267j45530j37406j22070j15623j30310j62602j94225k06070j93291
2446.6A99748783j65920j38817j19820j06048r1477p7152p5016r7923j42918j83887
2456.3A98549805j86272j38817p1564m0302q1100j74561k56004k64511j92070q7338
2465.9A97057266j7338k0027q6784j78642k53487k83642k61822j99279j21918n7564
2475.6A95576763k2278j5430k8839n7850j01891j54438j98307k16140k05365j79729
2485.2A94396496j55182j38455j30405j35994j62144k02312k29206k12917j50929p7400
$$ plain form
2494.8 192801552 192763138 192707748 192597542 192433662 192247639 192077827 191948662 191860237 191788139 191695690
2504.5 191695690 191558456 191385403 191216316 191089764 191008568 190936623 190832634 190687466 190529938 190396595
2514.1 190396595 190299149 190218658 190127621 190011787 189872932 189716778 189544506 189356632 189160995 188973846
2523.8 188973846 188810406 188673077 188547401 188411064 188251553 188079243 187922707 187805252 187720966 187634640
2533.4 187634640 187508736 187335644 187143745 186970005 186826401 186692524 186540394 186364574 186188583 186042271
2543.1 186042271 185934162 185843964 185741119 185611248 185467224 185335293 185227489 185126610 184999924 184832439
2552.7 184832439 184647808 184492397 184390869 184316216 184208031 184024754 183782539 183543396 183365097 183260040
2562.4 183260040 183196316 183127155 183017769 182853127 182637386 182395916 182173271 182013321 181931553 181903343
$$ packed form
2494.8A92801552l8414n5390j10206j63880j86023j69812j29165q8425p2098r2449
2504.5A91695690j37234j73053j69087j26552q1196p1945j03989j45168j57528j33343
2514.1A90396595r7446q0491r1037j15834j38855j56154j72272j87874j95637j87149
2523.8A88973846j63440j37329j25676j36337j59511j72310j56536j17455q4286q6326
2533.4A87634640j25904j73092j91899j73740j43604j33877j52130j75820j75991j46312
2543.1A86042271j08109r0198j02845j29871j44024j31931j07804j00879j26686j67485
2552.7A84832439j84631j55411j01528p4653j08185j83277k42215k39143j78299j05057
2562.4A83260040o3724o9161j09386j64642k15741k41470k22645j59950q1768k8210
$$ plain form
2572 181903343 181883659 181838665 181759911 181653538 181523685 181371098 181202602 181032066 180869064 180710068
2581.6 180710068 180546474 180381222 180230961 180109711 180010872 179910316 179785557 179633102 179466591 179303627
2591.3 179303627 179155388 179023991 178902340 178775139 178624363 178441486 178236122 178030853 177844696 177681427
2600.9 177681427 177534122 177398682 177279530 177182732 177106037 177038670 176968193 176885319 176782265 176651039
2610.6 176651039 176488476 176303501 176115990 175944633 175793781 175653954 175512333 175365009 175216961 175074863
2620.2 175074863 174941368 174818382 174710388 174620209 174538822 174442177 174305401 174126244 173933392 173765392
2629.9 173765392 173634586 173511276 173350334 173139439 172921696 172763863 172695847 172677746 172628345 172490120
2639.5 172490120 172271080 172028294 171816559 171651421 171514339 171382999 171248665 171111469 170970020 170824070
$$ packed form
2572A81903343j9684m4994p8754j06373j29853j52587j68496j70536j63002j58996
2581.6A80710068j63594j65252j50261j21250r8839j00556j24759j52455j66511j62964
2591.3A79303627j48239j31397j21651j27201j50776j82877k05364k05269j86157j63269
2600.9A77681427j47305j35440j19152r6798p6695o7367p0477q2874j03054j31226
2610.6A76651039j62563j84975j87511j71357j50852j39827j41621j47324j48048j42098
2620.2A75074863j33495j22986j07994r0179q1387r6645j36776j79157j92852j68000
2629.9A73765392j30806j23310j60942k10895k17743j57833o8016j8101m9401j38225
2639.5A72490120k19040k42786k11735j65138j37082j31340j34334j37196j41449j45950
$$ plain form
2649.1 170824070 170685768 170577965 170512581 170469036 170399132 170261631 170057449 169833965 169650822 169536228
2658.8 169536228 169468269 169396324 169281445 169121914 168945160 168778419 168626823 168476963 168318653 168160400
2668.4 168160400 168023205 167918987 167836151 167746162 167624130 167465878 167287693 167112007 166953201 166812515
2678.1 166812515 166680317 166540184 166371937 166158752 165899086 165616684 165356407 165161667 165047131 164987736
2687.7 164987736 164935093 164849091 164718723 164558048 164386063 164211922 164039688 163880844 163756409 163680019
2697.4 163680019 163638840 163592567 163496666 163332386 163119774 162902985 162720928 162584743 162477131 162370510
2707 162370510 162247410 162107048 161953945 161782742 161574593 161313705 161008339 160697021 160430202 160241470
2716.6 160241470 160131130 160073242 160036011 159996271 159940720 159860001 159746876 159599771 159425364 159236536
$$ packed form
2649.1A70824070j38302j07803o5384m3545o9904j37501k04182k23484j83143j14594
2658.8A69536228o7959p1945j14879j59531j76754j66741j51596j49860j58310j58253
2668.4A68160400j37195j04218q2836q9989j22032j58252j78185j75686j58806j40686
2678.1A66812515j32198j40133j68247k13185k59666k82402k60277j94740j14536n9395
2687.7A64987736n2643q6002j30368j60675j71985j74141j72234j58844j24435p6390
2697.4A63680019m1179m6273r5901j64280k12612k16789j82057j36185j07612j06621
2707A62370510j23100j40362j53103j71203k08149k60888l05366l11318k66819j88732
2716.6A60241470j10340n7888l7231l9740n5551q0719j13125j47105j74407j88828
$$ plain form
2726.3 159236536 159046659 158864794 158692532 158524561 158352518 158172350 157987709 157805052 157624731 157440987
2735.9 157440987 157252884 157074184 156925154 156809292 156700659 156562099 156380072 156179991 156003227 155867004
2745.6 155867004 155747967 155604067 155410643 155175915 154928684 154697027 154495697 154322376 154157171 153969994
2755.2 153969994 153742790 153491974 153265438 153104391 153004141 152915096 152788448 152619534 152442808 152284336
2764.9 152284336 152127600 151931868 151682854 151417713 151194038 151035089 150908022 150756350 150553131 150323906
2774.5 150323906 150123320 149990444 149922190 149878283 149808207 149678984 149489679 149268990 149055986 148874407
2784.2 148874407 148716707 148553114 148361473 148152876 147967262 147837467 147754259 147666321 147521257 147311764
2793.8 147311764 147082090 146886482 146737919 146596003 146407700 146162510 145910206 145723906 145641308 145636616
$$ packed form
2726.3A59236536j89877j81865j72262j67971j72043j80168j84641j82657j80321j83744
2735.9A57440987j88103j78700j49030j15862j08633j38560j82027k00081j76764j36223
2745.6A55867004j19037j43900j93424k34728k47231k31657k01330j73321j65205j87177
2755.2A53969994k27204k50816k26536j61047j00250q9045j26648j68914j76726j58472
2764.9A52284336j56736j95732k49014k65141k23675j58949j27067j51672k03219k29225
2774.5A50323906k00586j32876o8254m3907p0076j29223j89305k20689k13004j81579
2784.2A48874407j57700j63593j91641k08597j85614j29795q3208q7938j45064k09493
2793.8A47311764k29674j95608j48563j41916j88303k45190k52304j86300q2598m692
$$ plain form
2803.4 145636616 145643272 145604410 145507355 145379114 145256071 145156088 145073214 144987392 144878092 144732494 144551630
2814 144551630 144354620 144174738 144040146 143949289 143864212 143735027 143539524 143304176 143083162 142915220
2823.7 142915220 142797918 142702951 142611799 142532492 142480249 142445488 142389164 142273874 142100000 141909781 141753759
2834.3 141753759 141649704 141571751 141475048 141331978 141149874 140960798 140797453 140674057 140582371 140499964
2843.9 140499964 140402117 140274515 140119448 139953117 139792910 139642401 139487724 139309998 139105225 138892412
2853.6 138892412 138701849 138553905 138447542 138365870 138287878 138194523 138070192 137910957 137736635 137589617
2863.2 137589617 137507105 137486429 137478771 137425985 137308559 137157831 137018890 136904726 136789761 136645346
2872.9 136645346 136476774 136320648 136210365 136148834 136112070 136070404 136001139 135888538 135726242 135528593
$$ packed form
2803.4A45636616O656l8862r7055j28241j23043r9983q2874q5822j09300j45598j80864
2814A44551630j97010j79882j34592r0857q5077j29185j95503k35348k21014j67942
2823.7A42915220j17302r4967r1152p9307n2243l4761n6324j15290j73874j90219j56022
2834.3A41753759j04055p7953r6703j43070j82104j89076j63345j23396r1686q2407
2843.9A40499964r7847j27602j55067j66331j60207j50509j54677j77726k04773k12813
2853.6A38892412j90563j47944j06363q1672p7992r3355j24331j59235j74322j47018
2863.2A37589617q2512k0676p658n2786j17426j50728j38941j14164j14965j44415
2872.9A36645346j68572j56126j10283o1531l6764m1666o9265j12601j62296j97649
$$ plain form
2882.5 135528593 135333042 135179090 135076733 134997721 134901104 134768639 134614906 134465361 134328966 134193001
2892.2 134193001 134036484 133845215 133615742 133356323 133090277 132854052 132680368 132576046 132515774 132459478
2901.8 132459478 132375736 132249508 132075691 131857510 131616898 131397266 131239996 131146011 131063843 130923023
2911.4 130923023 130687771 130379210 130046434 129717817 129382496 129017372 128629246 128268814 128002825 127867804
2921.1 127867804 127840099 127843971 127792816 127639408 127402086 127146931 126936827 126786098 126658173 126506205
2930.7 126506205 126316757 126115456 125933762 125775328 125617619 125443134 125262890 125107050 124993143 124906073
2940.4 124906073 124810534 124680262 124516411 124339180 124164715 123990536 123801003 123586578 123356285 123131552
2950 123131552 122925777 122729034 122513733 122259007 121971216 121683178 121432009 121237259 121095943 120993185
$$ packed form
2882.5A35528593j95551j53952j02357p9012r6617j32465j53733j49545j36395j35965
2892.2A34193001j56517j91269k29473k59419k66046k36225j73684j04322o0272n6296
2901.8A32459478q3742j26228j73817k18181k40612k19632j57270r3985q2168j40820
2911.4A30923023k35252l08561l32776l28617l35321l65124l88126l60432k65989j35021
2921.1A27867804k7705L872n1155j53408k37322k55155k10104j50729j27925j51968
2930.7A26506205j89448k01301j81694j58434j57709j74485j80244j55840j13907q7070
2940.4A24906073r5539j30272j63851j77231j74465j74179j89533k14425k30293k24733
2950A23131552k05775j96743k15301k54726k87791k88038k51169j94750j41316j02758
$$ plain form
2959.7 120993185 120911102 120828447 120719023 120561333 120354700 120123940 119900827 119696226 119490395 119252462
2969.3 119252462 118971310 118668585 118382435 118139648 117942533 117777262 117631216 117498932 117374468 117243261
2979 117243261 117086000 116892214 116670437 116445065 116240854 116065922 115905294 115727282 115500727 115214748
2988.6 115214748 114890947 114578590 114331970 114179840 114105530 114052782 113955641 113775187 113520947 113243399
2998.2 113243399 113002491 112831926 112720499 112621183 112482147 112278166 112022181 111749897 111493626 111266298
3007.9 111266298 111068516 110905237 110791082 110735626 110724754 110720835 110686674 110611172 110510359 110406141 110306463
3018.5 110306463 110208817 110117674 110048504 110008774 109978342 109918022 109804096 109652081 109503679 109390297 109313707
3029.1 109313707 109260435 109225636 109211235 109202948 109162798 109058609 108903065 108753719 108668003 108656511 108683338
$$ packed form
2959.7A20993185q2083q2655j09424j57690k06633k30760k23113k04601k05831k37933
2969.3A19252462k81152l02725k86150k42787j97115j65271j46046j32284j24464j31207
2979A17243261j57261j93786k21777k25372k04211j74932j60628j78012k26555k85979
2988.6A15214748l23801l12357k46620j52130p4310n2748r7141j80454k54240k77548
2998.2A13243399k40908j70565j11427r9316j39036k03981k55985k72284k56271k27328
3007.9A11266298j97782j63279j14155n5456j0872l919l4161p5502j00813j04218r9678
3018.5A10306463r7646r1143o9170l9730l0432o0320j13926j52015j48402j13382p6590
3029.1A09313707n3272l4799j4401q287m0150j04189j55544j49346q5716j1492K6827
$$ plain form
3039.7 108683338 108706274 108707981 108686190 108625803 108498621 108296661 108059530 107856150 107736292 107696886 107693882
3050.3 107693882 107677517 107615404 107492657 107308102 107078886 106840391 106628199 106451387 106288090 106111794
3060 106111794 105920219 105733433 105565042 105402002 105219917 105015287 104815311 104650354 104520121 104391842
3069.6 104391842 104231291 104032154 103812952 103590794 103366089 103133783 102901640 102688560 102500734 102316608
3079.2 102316608 102101774 101842184 101560259 101297083 101077967 100895596 100721331 100527411 100297880 100025873
3088.9 100025873 99712734 99373016 99034662 98724470 98448973 98194208 97947683 97719488 97533922 97397728
3098.5 97397728 97279053 97124453 96900015 96617441 96321249 96052628 95823908 95620918 95421162 95209770
3108.2 95209770 94988232 94777870 94613447 94521265 94489050 94458838 94359379 94160843 93901978 93661861
$$ packed form
3039.7A08683338K2936J707k1791o0387j27182k01960k37131k03380j19858l9406l004
3050.3A07693882j6365o2113j22747j84555k29216k38495k12192j76812j63297j76296
3060A06111794j91575j86786j68391j63040j82085k04630j99976j64957j30233j28279
3069.6A04391842j60551j99137k19202k22158k24705k32306k32143k13080j87826j84126
3079.2A02316608k14834k59590k81925k63176k19116j82371j74265j93920k29531k72007
3088.9A00025873l13139l39718l38354l10192k75497k54765k46525k28195j85566j36194
3098.5I7397728j18675j54600k24438k82574k96192k68621k28720k02990j99756k11392
3108.2I5209770k21538k10362j64423r2182l2215l0212r9459j98536k58865k40117
$$ plain form
3117.8 93661861 93500299 93419361 93377619 93333006 93268747 93185081 93078537 92941952 92784243 92641153 92554779
3128.4 92554779 92535849 92545328 92516108 92400265 92206411 91999054 91860914 91842375 91929617 92051954 92125816
3139 92125816 92106514 92011852 91901178 91827440 91803322 91805305 91803999 91787682 91758995 91717539 91654196 91565189
3150.6 91565189 91467171 91391964 91363230 91378384 91413641 91445475 91465921 91478691 91484108 91472158 91430511 91358948
3162.2 91358948 91274204 91199913 91150723 91123819 91105347 91086531 91073408 91079712 91107407 91134300 91125813 91065722
3173.8 91065722 90978851 90919905 90933418 91017962 91126652 91202545 91218920 91189394 91149540 91129303 91139765
3184.4 91139765 91176834 91229935 91287985 91343775 91395559 91444960 91490126 91523886 91542463 91556396 91587877 91648645
3195.9 91648645 91719236 91756344 91727810 91643686 91551590 91497908 91494055 91518106 91544638 91566248 91587954 91608143
$$ packed form
3117.8I3661861j61562q0938m1742m4613o4259q3666j06544j36585j57709j43090q6374
3128.4I2554779j8930R479k9220j15843j93854k07357j38140j8539Q7242J22337P3862
3139I2125816j9302r4662j10674p3738k4118J983j306j6317k8687m1456o3343q9007
3150.6I1565189r8018p5207k8734J5154L5257L1834K0446J2770N417j1950m1647p1563
3162.2I1358948q4744p4291m9190k6904j8472j8816j3123O304K7695K6893q487o0091
3173.8I1065722q6871n8946J3513Q4544J08690P5893J6375k9526l9854k0237J0462
3184.4I1139765L7069N3101N8050N5790N1784M9401M5166L3760J8577J3933L1481O0768
3195.9I1648645P0591L7108k8534q4124r2096n3682l853K4051K6532K1610K1706K0189
$$ plain form
3207.5 91608143 91617613 91620169 91645727 91732349 91885090 92057037 92176704 92205563 92171736 92148504 92195368
3218.1 92195368 92315359 92463465 92592020 92685318 92754154 92806377 92833061 92828350 92817717 92854347 92978077
3228.7 92978077 93175316 93381958 93530293 93596258 93605843 93603058 93618059 93662529 93742704 93861580 94006615
3239.3 94006615 94143572 94236965 94282360 94314966 94381847 94500647 94645834 94773359 94858017 94908257 94950628
3249.9 94950628 95004578 95072641 95150957 95244493 95369635 95541563 95757217 95988407 96193151 96339560
3259.6 96339560 96427860 96492443 96581163 96722717 96907520 97095375 97245483 97345819 97420120 97507572 97629814
3270.2 97629814 97770100 97880545 97915430 97868156 97785263 97744331 97807760 97982759 98215599 98424168 98545494
3280.8 98545494 98567104 98524761 98474770 98463354 98510008 98607426 98731308 98852654 98948336 99007072 99027224
$$ packed form
3207.5I1608143R470K556K5558Q6622J52741J71947J19667K8859l3827k3232M6864
3218.1I2195368J19991J48106J28555R3298O8836N2223K6684m711j0633L6630J23730
3228.7I2978077J97239K06642J48335O5965R585k785J5001M4470Q0175J18876J45035
3239.3I4006615J36957R3393M5395L2606O6881J18800J45187J27525Q4658N0240M2371
3249.9I4950628N3950O8063P8316R3536J25142J71928K15654K31190K04744J46409
3259.6I6339560Q8300O4583Q8720J41554J84803J87855J50108J00336P4301Q7452J22242
3270.2I7629814J40286J10445L4885m7274q2893m0932O3429J74999K32840K08569J21326
3280.8I8545494K1610m2343m9991j1416M6654R7418J23882J21346R5682N8736K0152
$$ plain form
3291.4 99027224 99009008 98950682 98855228 98744354 98659229 98641605 98705730 98826141 98953676 99043646 99072618
3302 99072618 99035482 98939199 98803682 98663883 98555698 98489170 98436041 98351583 98215160 98051205 97909651
3312.6 97909651 97826872 97802973 97809935 97812796 97782145 97697248 97551546 97360258 97156477 96971054 96814365
3323.2 96814365 96679583 96562967 96476068 96432772 96428614 96432905 96403275 96301975 96103888 95802937 95425510
3333.8 95425510 95036516 94714012 94498444 94360170 94223146 94029608 93782129 93523493 93279810 93034477
3343.5 93034477 92758932 92459135 92178335 91949997 91754446 91532164 91241465 90900192 90568609 90293512
3353.1 90293512 90069227 89848328 89584064 89265203 88916988 88577738 88270149 87987862 87702274 87386799
3362.8 87386799 87039452 86684828 86350775 86040792 85733690 85413704 85099983 84838076 84654207 84516726
$$ packed form
3291.4I9027224j8216n8326r5454j10874q5125j7624O4125J20411J27535Q9970K8972
3302I9072618l7136r6283j35517j39799j08185o6528n3129q4458j36423j63955j41554
3312.6I7909651q2779k3899O962K861l0651q4897j45702j91288k03781j85423j56689
3323.2I6814365j34782j16616q6899m3296m158M291k9630j01300j98087l00951l77427
3333.8I5425510l88994l22504k15568j38274j37024j93538k47479k58636k43683k45333
3343.5I3034477k75545k99797k80800k28338j95551k22282k90699l41273l31583k75097
3353.1I0293512k24285k20899k64264l18861l48215l39250l07589k82287k85588l15475
3362.8H7386799l47347l54624l34053l09983l07102l19986l13721k61907j83869j37481
$$ plain form
3372.4 84516726 84348583 84086113 83732595 83357973 83044376 82823973 82659063 82476711 82226486 81915731
3382.1 81915731 81598473 81330357 81128359 80966759 80808611 80640993 80480289 80346336 80236483 80126648
3391.7 80126648 79994149 79835882 79665055 79498215 79351234 79239573 79168410 79113936 79023380 78850870
3401.3 78850870 78602548 78342233 78144183 78037577 77999439 77997141 78025594 78091931 78169613 78186197 78075018
3412 78075018 77844181 77589717 77432146 77428422 77534571 77643561 77661600 77563376 77394753 77231770 77129951
3422.6 77129951 77096577 77100492 77105308 77094955 77070951 77030129 76955552 76835842 76690955 76570482 76517596
3433.2 76517596 76535454 76593609 76666999 76761551 76894226 77051129 77177186 77219181 77182827 77140775 77173910
3443.8 77173910 77297459 77443175 77520456 77502398 77456551 77488723 77646742 77872601 78047695 78094540 78042712
$$ packed form
3372.4H4516726j68143k62470l53518l74622l13597k20403j64910j82352k50225l10755
3382.1H1915731l17258k68116k01998j61600j58148j67618j60704j33953j09853j09835
3391.7H0126648j32499j58267j70827j66840j46981j11661p1163n4474r0556j72510
3401.3G8850870k48322k60315j98050j06606l8138k298K8453O6337P7682J6584j11179
3412G8075018k30837k54464j57571l724J06149J08990J8039r8224j68623j62983j01819
3422.6G7129951l3374L915M816j0353k4004m0822p4577j19710j44887j20473n2886
3433.2G6517596J7858N8155P3390R4552J32675J56903J26057M1995l6354m2052L3135
3443.8G7173910J23549J45716P7281j8058m5847L2172J58019K25859J75094M6845n1828
$$ plain form
3454.4 78042712 78001027 78060884 78220348 78395061 78499393 78518424 78507814 78533239 78615212 78728766 78846416
3465 78846416 78970747 79124975 79318137 79527040 79713573 79857469 79969640 80076828 80198298 80338116
3474.6 80338116 80497313 80686779 80923481 81210413 81520548 81800785 81997509 82086935 82091112 82069759
3484.3 82069759 82093620 82212057 82428923 82699175 82951355 83130140 83234520 83321648 83464184 83688803
3493.9 83688803 83947487 84153461 84257193 84295111 84364166 84543047 84830732 85155468 85438194 85647516
3503.6 85647516 85804033 85947037 86106319 86299820 86538668 86819506 87112017 87367020 87549629 87666531
3513.2 87666531 87758980 87867918 88005266 88155813 88300161 88431416 88554401 88677483 88808241 88953972
3522.9 88953972 89120502 89310904 89527206 89772387 90044622 90328369 90598097 90838203 91058817 91283493
$$ packed form
3454.4G8042712m1685N9857J59464J74713J04332J9031j0610K5425Q1973J13554J17650
3465G8846416J24331J54228J93162K08903J86533J43896J12171J07188J21470J39818
3474.6H0338116J59197J89466K36702K86932L10135K80237J96724Q9426M177k1353
3484.3H2069759K3861J18437K16866K70252K52180J78785J04380Q7128J42536K24619
3493.9H3688803K58684K05974J03732L7918O9055J78881K87685L24736K82726K09322
3503.6H5647516J56517J43004J59282J93501K38848K80838K92511K55003J82609J16902
3513.2H7666531R2449J08938J37348J50547J44348J31255J22985J23082J30758J45731
3522.9H8953972J66530J90402K16302K45181K72235K83747K69728K40106K20614K24676
$$ plain form
3532.5 91283493 91516161 91728258 91890182 92017946 92175846 92419510 92733984 93036852 93251524 93379135
3542.1 93379135 93494024 93671427 93924589 94212847 94501715 94802704 95149698 95542183 95921526 96206284
3551.8 96206284 96353960 96392813 96401052 96456776 96601038 96833010 97129316 97462711 97808361 98139706
3561.4 98139706 98428373 98655787 98828354 98982010 99166279 99416819 99736366 100098352 100469084 100830736
3571.1 100830736 101185923 101542091 101889954 102197971 102431545 102585554 102699757 102838802 103048429 103326998
3580.7 103326998 103640680 103967543 104322567 104731817 105181627 105604315 105928202 106151218 106357889 106650162
3590.4 106650162 107049084 107463732 107763824 107893562 107921181 107981558 108167648 108468485 108800516 109092169
3600 109092169 109341898 109606409 109939518 110338392 110737953 111055632 111252375 111365595 111483049 111673164
$$ packed form
3532.5I1283493K32668K12097J61924J27764J57900K43664L14474L02868K14672J27611
3542.1I3379135J14889J77403K53162K88258K88868L00989L46994L92485L79343K84758
3551.8I6206284J47676L8853Q239N5724J44262K31972K96306L33395L45650L31345
3561.4I8139706K88667K27414J72567J53656J84269K50540L19547L61986L70732L61652
3571.1A00830736L55187L56168L47863L08017K33574J54009J14203J39045K09627K78569
3580.7A03326998L13682L26863L55024M09250M49810M22688L23887K23016K06671K92273
3590.4A06650162L98922M14648L00092J29738K7619O0377J86090L00837L32031K91653
3600A09092169K49729K64511L33109L98874L99561L17679J96743J13220J17454J90115
$$ plain form
3609.6 111673164 111926394 112167692 112336988 112460871 112636747 112934980 113319006 113672991 113912811 114063253
3619.3 114063253 114219332 114441757 114704142 114943237 115136747 115310345 115475292 115591564 115616894 115581455
3628.9 115581455 115586023 115708532 115923615 116129370 116251669 116310530 116381779 116511364 116682301 116856718
3638.6 116856718 117022734 117185774 117326565 117395363 117362480 117266712 117198353 117223988 117326241 117418890 117422647
3649.2 117422647 117334909 117234373 117221394 117342701 117555742 117753897 117830667 117740850 117525072 117288465
3658.8 117288465 117143784 117145109 117251110 117353115 117363396 117296925 117260380 117338276 117482367 117533493 117379818
3669.4 117379818 117094793 116892881 116925154 117122526 117259693 117178736 116938152 116735296 116697464 116771259
3679.1 116771259 116809587 116736116 116604137 116512871 116505537 116558084 116636171 116720533 116774340 116724281 116513882
$$ packed form
3609.6A11673164K53230K41298J69296J23883J75876K98233L84026L53985K39820J50442
3619.3A14063253J56079K22425K62385K39095J93510J73598J64947J16272K5330l5439
3628.9A15581455M568J22509K15083K05755J22299N8861P1249J29585J70937J74417
3638.6A16856718J66016J63040J40791O8798l2883r5768o8359K5635J02253R2649L757
3649.2A17422647q7738j00536j2979J21307K13041J98155P6770q9817k15778k36607
3658.8A17288465j44681J325J06001J02005J0281o6471l6545P7896J44091N1126j53675
3669.4A17379818k85025k01912L2273J97372J37167q0957k40584k02856l7832P3795
3679.1A16771259L8328p3471j31979r1266p334N2547P8087Q4362N3807n0059k10399
$$ plain form
3689.7 116513882 116181364 115862532 115693722 115705957 115813761 115900717 115910921 115865278 115812893 115781851 115771589
3700.3 115771589 115768280 115754099 115707417 115614901 115494757 115399790 115381107 115436611 115498228 115478954 115342331
3710.9 115342331 115131922 114937601 114834347 114847832 114960604 115132504 115309515 115427361 115432110 115311947
3720.5 115311947 115106907 114877405 114658098 114442253 114210224 113966808 113748846 113600407 113544941 113573227
3730.2 113573227 113640938 113674412 113596754 113378973 113080626 112830229 112742863 112839842 113037624 113206034
3739.8 113206034 113233013 113052282 112652683 112104006 111575880 111286888 111374331 111781664 112276487 112603083
3749.5 112603083 112641964 112448177 112161980 111900206 111718493 111632223 111631746 111670666 111672211 111582527 111425982
3760.1 111425982 111295280 111271553 111352692 111460476 111514196 111491756 111424494 111348457 111270561 111176767 111057854
$$ packed form
3689.7A16513882l32518l18832j68810J2235J07804Q6956J0204m5643n2385l1042j0262
3700.3A15771589l309j4181m6682r2516j20144r4967j8683N5504O1617j9274j36623
3710.9A15342331k10409j94321j03254J3485J12772J71900J77011J17846M749j20163
3720.5A15311947k05040k29502k19307k15845k32029k43416k17962j48439n5466K8286
3730.2A13573227O7711L3474p7658k17781k98347k50397q7366R6979J97782J68410
3739.8A13206034K6979j80731l99599n48677n28126k88992Q7443M07333M94823L26596
3749.5A12603083L8881j93787k86197k61774j81713q6270m77L8920J545q9684j56545
3760.1A11425982j30702k3727Q1139J07784N3720k2440o7262p6037p7896r3794j18913
$$ plain form
3770.7 111057854 110924416 110804214 110734129 110743103 110824156 110913601 110912514 110755949 110477400 110200996 110052233
3781.3 110052233 110060129 110140667 110176630 110117588 110008116 109924269 109890575 109861488 109778738 109639435 109499941
3791.9 109499941 109414406 109381304 109359770 109333668 109337072 109394960 109441166 109329891 108966732 108439856 107996149
3802.5 107996149 107854004 108022051 108304386 108483849 108495102 108423882 108372583 108363533 108371277 108399172 108472939
3813.1 108472939 108563442 108571186 108432083 108225594 108127317 108224487 108396835 108413706 108157768 107735186 107361059
3823.7 107361059 107155609 107068729 106982708 106847172 106699629 106590214 106532516 106529226 106598043 106731949 106841516
3834.3 106841516 106788006 106510782 106120043 105835485 105811615 106017132 106280146 106439886 106453028 106371946
3844 106371946 106254406 106112318 105936966 105746708 105590801 105507555 105488262 105486279 105461454 105415964 105388870
$$ packed form
3770.7A11057854j33438j20202p0085Q974Q1053Q9445j087j56565k78549k76404j48763
3781.3A10052233P896Q0538L5963n9042j09472q3847l3694k9087q2750j39303j39494
3791.9A09499941q5535l3102k1534k6102L404N7888M6206j11275l63159n26876m43707
3802.5A07996149j42145J68047K82335J79463J1253p1220n1299r050P744K7895P3767
3813.1A08472939R0503P744j39103k06489r8277R7170J72348J6871k55938m22582l74127
3823.7A07361059k05450q6880q6021j35536j47543j09415n7698l290O8817J33906J09567
3834.3A06841516n3510k77224l90739k84558k3870K05517K63014J59740J3142q1082
3844A06371946j17540j42088j75352j90258j55907q3246j9293j983k4825m5490k7094
$$ plain form
3854.6 105388870 105414505 105480404 105522213 105466499 105290956 105049696 104838285 104725571 104710741 104737873 104741745
3865.2 104741745 104676199 104513960 104249821 103927059 103652878 103551130 103666191 103909597 104122086 104205828
3874.8 104205828 104193144 104176350 104177761 104113760 103901291 103584290 103324375 103248301 103315639 103358259 103257227
3885.4 103257227 103071356 102981119 103105631 103377399 103593388 103583479 103338852 102999773 102737484 102641010
3895.1 102641010 102688389 102796116 102889614 102939520 102950401 102925873 102848129 102690582 102452354 102179461 101947985
3905.7 101947985 101817513 101792612 101824713 101853037 101849613 101831131 101829796 101851168 101858006 101796770 101645517 101441698
3917.3 101441698 101263685 101176510 101182709 101218481 101200628 101092205 100936556 100829048 100844831 100976849 101133547
3927.9 101133547 101199503 101109171 100880308 100591240 100332336 100166674 100112648 100146294 100221272 100302067 100385323
$$ packed form
3854.6A05388870K5635O5899M1809n5714j75543k41260k11411j12714j4830K7132L872
3865.2A04741745o5546j62239k64139l22762k74181j01748J15061K43406K12489Q3742
3874.8A04205828j2684j6794J411o4001k12469l17001k59915p6074O7338M2620j01032
3885.4A03257227j85871r0237J24512K71768K15989r909k44627l39079k62289r6474
3895.1A02641010M7379J07727R3498M9906J0881k4528p7744j57547k38228k72893k31476
3905.7A01947985j30472k4901L2101K8324l424j8482j335K1372O838o1236j51253k03819
3917.3A01441698j78013q7175O199L5772j7853j08423j55649j07508J5783J32018J56698
3927.9A01133547O5956r0332k28863k89068k58904j65662n4026L3646P4978Q0795Q3256
$$ plain form
3938.5 100385323 100479984 100559721 100547466 100372543 100056887 99730244 99535952 99511175 99566593 99584455 99527540
3949.1 99527540 99445715 99393253 99364796 99316187 99227047 99123821 99050970 99037485 99088631 99184742 99272633
3959.7 99272633 99277220 99153023 98932791 98709612 98558664 98479404 98416300 98320198 98177071 97994652 97795572
3970.3 97795572 97628527 97550240 97564936 97597914 97568302 97493076 97479458 97587042 97727423 97743416 97581358
3980.9 97581358 97342386 97154694 97048225 96985855 96958628 96961651 96893148 96603689 96117897 95702181 95549603
3991.5 95549603 95421457 94836988 93767891 94159431 94570465 94943333 95220423 95344105 95256729
4000.2 95256729
$$ packed form
3938.5A00385323R4661P9737j2255j74923l15656l26643j94292k4777N5418J7862n6915
3949.1I9527540q1825n2462k8457m8609q9140j03226p2851j3485N1146R6111Q7891
3959.7I9272633M587j24197k20232k23179j50948p9260o3104r6102j43127j82419j99080
3970.3I7795572j67045p8287J4696L2978k9612p5226j3618J07584J40381J5993j62058
3980.9I7581358k38972j87692j06469o2370k7227L023o8503k89459m85792m15716j52578
3991.5I5549603j28146n84469j069097L91540M11034L72868K77090J23682q7376
4000.2I5256729
##END=$$ End of the data block
