##TITLE=Ctr 1P1 $$ Begin of the data block
##JCAMP-DX=5.00 $$ ACD/SpecManager v 10.08
##SPECTROMETER/DATA SYSTEM=Alpha
##DATE=09 Oct 2014 08:27:22
##DATA TYPE=INFRARED SPECTRUM
##DATA CLASS=XYDATA
##ORIGIN=
##OWNER=
##NPOINTS=1765
##FIRSTX=399.76428223
##LASTX=3997.64306641
##MAXX=3997.64306641
##MINX=399.76428223
##MAXY=0.83424383
##MINY=0.33363605
##XFACTOR=1.0000000000
##YFACTOR=1.000000000000000e-9
##FIRSTY=0.83159453
##DELTAX=2.03961372
##XUNITS=1/CM
##YUNITS=ARBITRARY UNITS
##XYDATA=(X++(Y..Y))
399.8 831594527 823415220 815293431 812850535 816782773 821628094 820942998 814642966 809915721 812170565
418.1 812170565 817812860 819215238 814689934 806698143 801734567 803968191 810065746 812607050
434.4 812607050 808257639 801240146 798327327 801682651 806776404 807093024 801269233 794427872 792773843
452.8 792773843 797396123 802979529 802231371 795294940 789226592 789409876 795041323 799906790 798793077
471.2 798793077 792297482 787109435 788490593 794325471 798007607 795293868 788694322 785004139
487.5 785004139 787675679 793299019 795223296 790889323 784450531 782156050 785829842 790734649
503.8 790734649 791089833 786176801 780383110 778903365 782519996 786760271 786232114 780541420 775075495
522.1 775075495 774808526 779036045 782333195 780880868 775723994 771489859 771992624 776012063 778769732
540.5 778769732 777000785 772093058 768539906 769375682 773122251 775383413 773405194 768848360 765974402
558.9 765974402 767212927 770805895 772691786 770465970 765876114 763151348 764423192 767653227
575.2 767653227 768854856 766285121 762191176 760412753 762407303 765802503 766993642 764566064
591.5 764566064 760775089 759410560 761579871 764637709 765174747 762601018 759480000 758837879 761247277
609.8 761247277 764248431 764878154 762660146 760180295 760490656 763799012 767487943 768701732 767152309
628.2 767152309 765383959 765969157 768894792 771707833 772064269 769983053 767762780 767753661 769949853
646.6 769949853 772057176 771855712 769425035 767119825 767124772 769165993 770887375 770362556 767758489
664.9 767758489 764480293 764150679 767009437 768744886 767813623 765079796 762863398 762789488 764340162
683.3 764340162 765411019 764353395 761696398 759574294 759405553 760559857 761157095 759971976 757639647
701.6 757639647 755985260 756218016 757619917 758149564 756522596 753396034 750513554 748864651 748270094
720 748270094 748435199 749437928 751607597 755419791 760969222 767216265 772322714 775246859 776812077
738.3 776812077 778925061 782684386 787369430 791173339 793058395 793838799 795187891 797783136 800685287
756.7 800685287 802382469 802283108 801381350 801382065 803048432 805425644 806876600 806837797 806344330 806946456
777.1 806946456 809155703 811923683 813728690 814086914 814034939 815073550 817537546 820304811 821947455
795.4 821947455 822137654 821894884 822449565 824037552 825691640 826331735 825948596 825579882 826314449
813.8 826314449 828239858 830253839 831173658 830954850 830576539 830887914 831775844 832350433 831858635
832.2 831858635 830477297 829224408 829047143 829890251 830820441 831071854 830825090 830857456 831620634 832816839
852.6 832816839 833719909 833921432 833638847 833440125 833695948 834166288 834243834 833591580 832531750 831757843
873 831757843 831618071 831821263 831834793 831381440 830726326 830384135 830440700 830532074 830338776 829848289 829307556
895.4 829307556 828977227 828822732 828568459 828056455 827414811 826924503 826736927 826758265 826785743 826703250
915.8 826703250 826551497 826442897 826404035 826305389 825927556 825205028 824342251 823535681 822760582 821837187
936.2 821837187 820663095 819326818 817963839 816614091 815197706 813569307 811642289 809527397
952.5 809527397 807345450 804986596 802270234 799158514 795810342 792555451 789682329 787193060
968.8 787193060 784848034 782449663 779984117 777494490 774969935 772335768 769539535 766653299
985.1 766653299 763828278 761186123 758698881 756166577 753415346 750474811 747486174 744560182
1001.4 744560182 741642058 738500953 734958112 731071830 727107763 723316789 719736934 716203511
1017.8 716203511 712584794 708985090 705636740 702654243 699965179 697453022 695107758 693029523
1034.1 693029523 691330910 689974368 688688993 687128663 685112894 682730377 680242836 677835405
1050.4 677835405 675451517 672974467 670467973 668173194 666308105 664868593 663658381 662460804
1066.7 662460804 661149919 659773052 658447266 657102585 655558586 653784692 652014792 650640070
1083 650640070 649876118 649556458 649322748 649059057 649116278 650045216 652184546 655481696 659530699 663782954
1103.4 663782954 667738795 670950174 672964454 673467040 672560930 670906544 669613481 669823050 672038615
1121.8 672038615 675656676 679177046 681042135 680403650 677187681 671818078 665082872 658033788
1138.1 658033788 651698411 646746099 643274844 640776575 638472497 635820210 632756352 629583955
1154.4 629583955 626758099 624700427 623667955 623783171 625131130 627780974 631749570 636956334
1170.7 636956334 643166244 650020659 657184005 664451778 671695113 678710580 685198843 690960824
1187.1 690960824 696043313 700654984 704961240 708925009 712305725 714838922 716473281 717374861
1203.4 717374861 717751801 717711747 717273235 716437280 715263009 713845253 712203681 710254729 707845867
1221.7 707845867 704899073 701562703 698216319 695190072 692518055 690060377 687787116 685948431
1238.1 685948431 684973657 685177624 686548233 688807964 691572964 694415987 696941018 698972583 700596511
1256.4 700596511 701961100 703127265 704174221 705330729 706808507 708553374 710156262 711162865
1272.7 711162865 711550832 711736321 712205350 713294566 715103090 717376471 719574571 721222460 722233772
1291.1 722233772 722813845 723100960 723045468 722698689 722376227 722358942 722599208 722797155 722765028 722634375
1311.5 722634375 722619593 722910523 723653316 724707961 725956798 727537334 729413927 731254041 732650638
1329.8 732650638 733294487 733150661 732478678 731381953 729707360 727875292 726567268 725699663 724943876
1348.2 724943876 724309921 723968446 723875880 723653853 723192096 722560525 721092701 718342483 715379477
1366.6 715379477 712895870 710740626 708200693 704006314 699254990 696931422 697460175 698972285
1382.9 698972285 700520694 701952100 702636421 702931881 703432798 703334808 702121496 700460136 699429929
1401.2 699429929 700133324 702128291 703767538 704306901 703608274 702234924 701775372 703118980 705132425
1419.6 705132425 706496477 707472205 707628489 706574500 704004407 699992418 696106374 692259133 687378764
1437.9 687378764 683102071 680197954 678033531 676167011 673574150 669474006 664500773 660179794
1454.3 660179794 657375932 655098617 653149664 652535915 653504908 658199966 670435250 691432297
1470.6 691432297 717006266 735314667 743977368 748310864 750317395 750347793 749131918 747288167
1486.9 747288167 743601441 736773551 729447663 723104119 715985894 707743824 700427592 695469439
1503.2 695469439 691797376 684738040 675108671 667256296 661418617 657397270 654397964 652158737
1519.5 652158737 649798036 646545768 643378317 640327394 637912989 636709750 635598958 634578943
1535.8 634578943 635531187 637906015 638243973 637232721 636897862 638044417 640621603 643990397 648182511
1554.2 648182511 653558910 660135627 663561225 664117694 666209638 669825912 673915505 677236915
1570.5 677236915 679438353 682296574 685247779 686273396 686672270 687221885 687586844 687643230 687401354
1588.9 687401354 686694622 685455382 683564842 681042194 678238332 675242126 671736956 667482615
1605.2 667482615 662410319 656201482 649246871 642634869 635573745 625779331 615787446 606632054
1621.5 606632054 595579565 583441854 571819842 561250389 553724647 549320817 545361280 540897131
1637.8 540897131 537640333 535969496 535806000 536596954 536829650 537156582 539325774 541150928 541048229
1656.2 541048229 542040467 545108914 549609184 554163098 558659434 564318359 570249319 575069249
1672.5 575069249 580456853 586335003 591724932 597564340 604811490 612417459 617680609 622659266
1688.8 622659266 628863454 635900974 645371437 656621039 667422593 677855849 685171247 690878093
1705.1 690878093 695821643 699375868 702972233 707286716 711940110 714962006 714505076 712371945
1721.5 712371945 709444284 704531729 696739554 685450137 669770956 643803596 610462487 580652654
1737.8 580652654 549853981 520564198 500634551 492419779 497994035 519143045 552286983 588616192
1754.1 588616192 627160251 665362716 697579980 724421024 743856370 757153034 767687678
1768.4 767687678 776057482 782434702 786384583 788988054 791573405 793920934 795683742 797390401
1784.7 797390401 799219847 801430821 803921044 805342495 805414498 805972695 807545304 808982611 809354007
1803 809354007 809232712 809628487 810651660 811716318 812269032 812556088 812768221 813017964 813760161 815179944
1823.4 815179944 816550314 817340553 817599058 817057610 816637516 817051411 817695439 818160415 818894506
1841.8 818894506 819718242 819768727 819472551 819381773 819312990 819123626 819029450 819239318 819703639 820183933
1862.2 820183933 820661008 821327448 821785152 821380675 820783436 820694923 820695043 820446253 820180655 820247114
1882.6 820247114 820651770 821222365 821600020 821310461 820827425 820802033 821004689 821129501 821091890 820818782
1903 820818782 820580125 820709050 821058869 821180582 821022451 820971131 821102619 821161211 821271718 821334004
1923.4 821334004 820930004 820322871 819911420 819823086 819983304 820119679 820074558 820030570 820100665 820018172
1943.8 820018172 819844007 819760978 819588542 819245398 818913579 818778634 818866074 818999529 818949044 818778157
1964.2 818778157 818642020 818489015 818379343 818375051 818246365 817890227 817518532 817364275 817439675 817555368
1984.6 817555368 817541480 817412257 817296386 817146242 816950262 816825390 816648245 816294670 815918624 815739274
2005 815739274 815759301 815767407 815586448 815277398 815050662 814963102 814886630 814739943 814499795 814169645 813856304
2027.4 813856304 813689113 813689947 813715100 813593149 813337862 813130736 813078225 813103437 813085377 812941909 812703133
2049.8 812703133 812482297 812380791 812400997 812434494 812372208 812231064 812121630 812068284 812055111 812037945 811937273
2072.3 811937273 811766028 811619818 811557889 811573505 811598361 811547637 811440229 811360300 811352134 811388195 811394274
2094.7 811394274 811299741 811145842 811036706 811028302 811084986 811097085 811026335 810910046 810818553 810820401 810895681
2117.1 810895681 810915411 810813904 810669959 810572982 810556233 810581863 810567200 810468078 810351312 810286880 810276151
2139.6 810276151 810276747 810226142 810107529 809973180 809897482 809899092 809908748 809847355 809742570 809671342 809660316 809681654
2164.1 809681654 809680283 809606373 809487283 809412658 809413075 809438884 809416890 809332371 809231222 809174180 809180796 809214056
2188.5 809214056 809218585 809149861 809023738 808921814 808898032 808919728 808917880 808838725 808711588 808613360 808577180
2211 808577180 808588445 808575332 808475792 808319092 808194816 808172405 808215559 808201313 808063388 807849824 807675958
2233.4 807675958 807616532 807630122 807601213 807445049 807217360 807055056 807018340 807025075 806935787 806706190 806432247
2255.8 806432247 806253672 806219161 806242824 806169927 805926800 805613399 805415809 805387557 805406392 805357873 805203080
2278.3 805203080 804979205 804805100 804755867 804737151 804558337 804146111 803645074 803262234 803054154 802900076
2298.7 802900076 802625477 802123249 801432133 800769925 800305426 799953520 799525142 798879743 797972739 796968579
2319.1 796968579 796167314 795667887 795214593 794495285 793585181 792898118 792631388 792511642 792238057 791795075
2339.5 791795075 791372776 791444302 792523026 793847084 793938577 792445958 790240288 788433909 787408292
2357.8 787408292 787032485 787038505 787270367 787796676 788765550 790146232 791654944 792958498 793940544
2376.2 793940544 794761360 795632482 796556234 797315419 797631204 797455132 797047734 796742260 796712041 796826601
2396.6 796826601 796765924 796379983 795849681 795488656 795464158 795619667 795597076 795226216 794694841 794334829
2417 794334829 794304967 794413686 794314623 793886602 793330014 792971730 792969108 793137550 793103218 792697370 792124867
2439.4 792124867 791737378 791691065 791799247 791714489 791257441 790618181 790191054 790161848 790306270 790243506
2459.8 790243506 789809048 789197206 788767397 788677514 788763285 788676381 788213074 787555277 787090182 787024319
2480.2 787024319 787162602 787083209 786599159 785948277 785502315 785405278 785467446 785352468 784868240 784179091
2500.6 784179091 783698857 783626378 783751249 783702910 783281446 782644093 782160163 782031119 782085478 781960666
2521 781960666 781475544 780831575 780405045 780353725 780483723 780434072 779999971 779378772 778963685 778903365
2541.4 778903365 778996348 778905034 778468728 777869225 777460098 777412236 777537167 777472973 777039230 776413441
2561.8 776413441 775960326 775873721 775970757 775867343 775376558 774714231 774271131 774192870 774274588 774178326
2582.2 774178326 773724139 773078084 772601783 772471488 772493780 772312045 771791816 771134675 770660818 770528615
2602.6 770528615 770566761 770432830 769955814 769283950 768752992 768552601 768505573 768276215 767717659 767009139
2623 767009139 766488314 766300619 766254604 766022563 765453935 764735997 764222682 764040887 763966441 763699889
2643.4 763699889 763158917 762503564 761984110 761739790 761641443 761387527 760803103 760035336 759411931 759084880
2663.7 759084880 758889616 758557081 757996917 757381618 756953895 756790280 756764591 756637335 756267607 755784512
2684.1 755784512 755451977 755382717 755443633 755385041 755060494 754596531 754269779 754175425 754141867 753948748
2704.5 753948748 753519297 752934754 752363682 751950443 751661062 751292348 750725627 750061154 749485850 749091029
2724.9 749091029 748768687 748326540 747759044 747234523 746869624 746648192 746463537 746187270 745759189 745272934
2745.3 745272934 744874954 744590700 744324684 743952394 743441463 742854953 742274821 741796434 741405845 740957618
2765.7 740957618 740386009 739734411 739087105 738504827 737921774 737226248 736390233 735457242 734517992 733677387
2786.1 733677387 732935607 732145429 731163442 730007529 728847444 727774143 726694226 725509763 724171340
2804.5 724171340 722671032 721069753 719378233 717543304 715533972 713285506 710697711 707749367
2820.8 707749367 704440773 700673938 696274340 691122532 685226500 678580344 670930564 661529481
2837.1 661529481 648978770 631599069 608248532 579044282 545955062 513042688 486014605
2851.4 486014605 470632911 469921201 482402086 503147244 526322365 547131121 562562227 571757317
2867.7 571757317 576447666 580146492 585393429 591873109 597614110 601054013 601734281 599933207
2884 599933207 596118331 590655804 583809614 575884402 567237794 558066666 548369527 538071632
2900.3 538071632 526930749 514550924 500631988 484928429 467044383 446570545 423529625
2914.6 423529625 398966283 375134140 354856610 340590656 333636045 333964586 340672731 352559477
2930.9 352559477 368619829 387925714 409168869 430755943 451203823 469189584 483525395
2945.2 483525395 493351370 498574585 500236094 500212848 500638604 503281713 509023011 517909765 529410660
2963.6 529410660 542641103 556615412 570452988 583557308 595540106 606119394 615315914
2977.8 615315914 623334646 630252302 636163056 641191781 645197093 647901535 649090588 648607194
2994.2 648607194 646536291 643111348 638666213 633897185 629722178 627120078 626953781 629474759
3010.5 629474759 634154081 640073657 646385193 652474642 657897472 662350714 665667355 667849243
3026.8 667849243 669215083 670181215 670923114 671364486 671414018 671194255 670868278 670496404 670099437 669637442
3047.2 669637442 669052184 668321848 667490304 666663349 665889323 665146887 664431810 663752377 663149893 662676334
3067.6 662676334 662348747 662148118 661994874 661861241 661788106 661723554 661620975 661496043 661302447 661048055
3088 661048055 660837889 660713375 660668790 660663545 660599351 660371244 659976602 659631133 659489512 659358621 658997536
3110.4 658997536 658494771 658086836 657765031 657372653 656805933 656004250 655057669 654158652 653379261 652649760
3130.8 652649760 651846588 650917232 649934530 648925960 647844672 646726370 645596802 644423008 643260419
3149.2 643260419 642148495 640951574 639590323 638179362 636769056 635321259 633867741 632450044
3165.5 632450044 631055355 629614234 628057361 626417398 624786437 623188496 621581614 619944692
3181.8 619944692 618293822 616629601 614984989 613389671 611797631 610194325 608587325 606940269
3198.1 606940269 605262458 603636563 602091849 600573242 599031210 597469687 595923960 594398260
3214.4 594398260 592868090 591311097 589707971 588080704 586475670 584893465 583323121 581788540
3230.7 581788540 580235302 578518093 576651752 574781477 572962940 571181774 569375277 567460418
3247.1 567460418 565427542 563369930 561368227 559365094 557278097 555144846 553031147 550975919
3263.4 550975919 549020767 547184825 545478523 543833971 542188883 540607870 539143801 537793338
3279.7 537793338 536541104 535377800 534340143 533468604 532738924 532067657 531375885 530663967 529971480
3298 529971480 529360890 528902590 528582692 528279483 527855039 527318776 526791036 526322901 525887191 525449753
3318.4 525449753 524989784 524545550 524149120 523701072 523122549 522482336 521849632 521249950 520665050 519996405
3338.8 519996405 519204140 518330753 517400980 516492665 515674233 514824927 513800621 512667775 511571586
3357.2 511571586 510556996 509559810 508543968 507558763 506568074 505438685 504162312 502926409 501859605
3375.5 501859605 500916302 500015318 499100536 498238802 497502923 496891379 496433824 495943964 495184958 494398415
3395.9 494398415 493931323 493656158 493158937 492381036 491721630 491351694 491092741 490813613 490490615 490203470
3416.3 490203470 490067452 490018576 489961833 489993840 490201712 490521044 490847558 491256297 491841018 492417097
3436.7 492417097 492831945 493272990 493928939 494774848 495673954 496454984 497181892 497990936 498857677 499830812
3457.1 499830812 500979245 502167165 503317416 504561305 505876124 507080197 508208334 509448051
3473.4 509448051 510807812 512251973 513793349 515333533 516822219 518374085 519975483 521502376
3489.8 521502376 523006380 524596751 526257157 527928352 529670656 531452179 533010244 534374416
3506.1 534374416 535905719 537608266 539252281 540787578 542320311 543997526 545907557 548055589
3522.4 548055589 550090730 551775038 553367913 555029452 556812584 558855712 560953796 562824190
3538.7 562824190 564837754 567352772 569992483 572077632 573705435 575530052 577529252 579421878
3555 579421878 581468105 583887458 586469471 589136899 592120826 595009029 596910536 598329306 600193858
3573.4 600193858 602535844 605037630 607660770 610465467 613531590 616928339 619982958 622016609
3589.7 622016609 623931944 626498461 629273772 631848216 634280086 636555552 638898730 641727865
3606 641727865 644892037 647749364 650285125 652664959 654933512 657356441 659387589 660641015 662115693
3624.4 662115693 664668202 667885363 669831514 670603514 671630144 672927499 674332500 675944149
3640.7 675944149 677767992 680107117 683305740 686323404 686995864 686287403 686402261 687295616 687883675
3659 687883675 688241124 688799620 689835548 691616774 693754137 695075989 695911586 696822941 696584284
3677.4 696584284 695661306 695252001 695554912 696762979 698891401 700436234 700042725 699101031 698768497
3695.8 698768497 698982716 699560046 700119078 700182676 700343192 701348126 702787161 703272223 702461123
3714.1 702461123 701691389 701653481 702074945 702497721 702662587 702499866 702366650 703044891 704752922 706260860
3734.5 706260860 706118345 704981625 704382718 704934478 705818594 705811739 705830276 706029654 705153704 704010546
3754.9 704010546 703644693 703561544 703064501 702644229 702787995 703095019 703161478 702684879 701918721 701692641
3775.3 701692641 702214003 702712417 702458680 701970041 701663077 701320648 701074898 701098800 701415122 702010691
3795.7 702010691 702580690 703151405 703535497 703112066 702521563 701927781 701084733 700752199 701405108 702427208
3816.1 702427208 703003943 703317940 702927351 701855600 701150060 700875223 700919688 701310396 701934934 702744782
3836.5 702744782 703138649 702536762 701456964 700427353 699753046 699892521 701083124 702551782 702196479
3854.8 702196479 700556517 699552894 699564099 700075150 700231671 700100183 700274885 700228453 699586987 698838890
3875.2 698838890 698426962 698684335 699009299 698946834 698784173 698333740 698029101 698005795 697523892 697040200
3895.6 697040200 697390735 698234975 698656142 698235989 697105169 695911944 695246220 695106030 695322216
3914 695322216 695711374 695808649 695509493 695281923 695194125 694921374 694666922 694743991 694745839 694299042 693743467
3936.4 693743467 693467915 693513215 693611801 693493187 693338513 693248808 692982018 692591608 692300737 692139208
3956.8 692139208 692087114 692079544 691923678 691638768 691458344 691400170 691340983 691250205 691113472 690914929 690755725
3979.3 690755725 690722466 690717518 690595031 690375626 690159559 689986825 689899087 689853847 689727008
3997.6 689727008
##END=$$ End of the data block
