##TITLE=Crisotila C $$ Begin of the data block
##JCAMP-DX=5.00 $$ ACD/SpecManager v 10.08
##SPECTROMETER/DATA SYSTEM=Alpha
##DATE=09 Jun 2015 08:49:18
##DATA TYPE=INFRARED SPECTRUM
##DATA CLASS=XYDATA
##ORIGIN=
##OWNER=
##NPOINTS=1765
##FIRSTX=399.76428223
##LASTX=3997.64306641
##MAXX=3997.64306641
##MINX=399.76428223
##MAXY=1.00438261
##MINY=0.70292652
##XFACTOR=1.0000000000
##YFACTOR=0.000000010000000
##FIRSTY=1.00000000
##DELTAX=2.03961372
##XUNITS=1/CM
##YUNITS=ARBITRARY UNITS
##XYDATA=(X++(Y..Y))
399.8A00000000r02778l54737M21983N52136K70611J2785m82929q02093m38494m99082
$$ 100000000 99097222 98742485 99164468 99716604 99987215 100000000 99517071 98714978 98276484 97777402
420.2I7777402r04125j312518k542054l972209m476338l728736j572895J220489K743899
$$ 97777402 96873277 95560759 93018705 89046496 84570158 80841422 79268527 80489016 83232915
438.5H3232915K796144K529323J903009J155246R94980Q80521N50020O34223P59006
$$ 83232915 86029059 88558382 90461391 91616637 92611617 93492138 94042158 94676381 95435387
456.9I5435387M86982M92519N20158J84190J60539K10184j01823j70534j35547l64739
$$ 95435387 95922369 96414888 96935046 97119236 97279775 97489959 97388136 97217602 97082055 96717316
477.3I6717316k48343K3830j36924j06591J53280K0420O0183L61645K17307J62846
$$ 96717316 96468973 96492803 96355879 96249288 96402568 96422988 96483171 96844816 97062123 97224969
497.7I7224969M15587K48373J11121L81600L13837K06142M85379M07511J85782L28213
$$ 97224969 97640556 97888929 98000050 98381650 98695487 98901629 99387008 99794519 99980301 100308514
518.1A00308514J29747k08938o6388j62935l73358k86436l22604o26331n07576m28748
$$ 100308514 100438261 100229323 100162935 100000000 99626642 99340206 99017602 98391271 97883695 97454947
538.5I7454947o81972n82540m42833o49405n23477k80458m14771l13491p0822k28441
$$ 97454947 96772975 96190435 95747602 95098197 94574720 94294262 93879491 93566000 93495178 93266737
558.9I3266737k34121l5530k19876l34793j75398l25770m37307k49773l78889n69815
$$ 93266737 93032616 92997086 92777210 92442417 92267019 91941249 91503942 91254169 90875280 90305465
579.3I0305465m28795m75514n91201l73483l23629m58217l06731k74009m69261l68184
$$ 90305465 89876670 89401156 88809955 88436472 88112843 87654626 87347895 87073886 86604625 86236441
599.6H6236441k45345l29434j12826J67388R8991J54638L17908J74182J65147L77858
$$ 86236441 85991096 85661662 85548836 85716224 85815215 85969853 86287761 86461943 86627090 87004948
620H7004948K82216K16406L88724K88743J64252L47835L16358J64407L20733L29709
$$ 87004948 87287164 87503570 87892294 88181037 88345289 88693124 89009482 89173889 89494622 89824331
640.4H9824331J58071K89148L29155J13464K01302K95955R9176J59568L15464J78027
$$ 89824331 89982402 90271550 90600705 90714169 90915471 91211426 91310602 91470170 91785634 91963661
660.8I1963661K46346M40663L24684L50970N29790L43263K81668M80342L82316K23768
$$ 91963661 92210007 92650670 92975354 93326324 93856114 94199377 94481045 94961387 95343703 95567471
681.2I5567471L81261L04568J06430K73925L18837J69861L28350L67034R8824J12641
$$ 95567471 95948732 96253300 96359730 96633655 96952492 97122353 97450703 97817737 97916561 98029202
701.6I8029202J46991j46931k39712k05827k51883J93429P34675N61040K83444L11429
$$ 98029202 98176193 98029262 97789550 97583723 97331840 97525269 98259944 98820984 99104428 99415857
722I9415857J12593m2403J36435Q8024m8208J31041J21677p1305O2954J06877r6106
$$ 99415857 99528450 99486047 99622482 99710506 99662298 99793339 99915016 99843711 99906665 100013542 99917436
744.5I9917436o235Q8799p2432j2630J26308m4065k6697J52981J0085m7064J19853
$$ 99917436 99911201 100000000 99927568 99914938 100041246 99997181 99970484 100123465 100133550 100086486 100206339
766.9A00206339j084j03307P4661J0776j25587M4799N2309r6285L2127N4764j32060
$$ 100206339 100205255 100101948 100176609 100187385 100061798 100106597 100158906 100062621 100094748 100149512 100017452
789.3A00017452m6175K8723p7438m2302P2384q4090p6717Q0341k6387m1437J36298
$$ 100017452 99971277 100000000 99922562 99880260 99952644 99868554 99791837 99872178 99845791 99804354 99940652
811.8I9940652M5347n0110Q6320J6105j06144M0865L9506r6643K3138O0964r3585k2996
$$ 99940652 99985999 99935889 100022209 100038314 99932170 99973035 100012541 99915898 99939036 100000000 99906415 99883419
836.2I9883419M7267j06704q3197o914j45030r9802M7201j12182k12258j06490k03806
$$ 99883419 99930686 99823982 99740785 99733871 99588841 99489039 99536240 99424058 99211800 99105310 98901504
858.7I8901504l09980k10189k92123m77403m57531n13930n98740l37172n0270R95J02824
$$ 98901504 98591524 98381335 98089212 97611809 97154278 96640348 96041608 95704436 95654166 95655161 95757985
881.1I5757985J73497N4777J6046q911k18273k91472k14190l18795l83425k91848l75163
$$ 95757985 95931482 95986259 96002305 95993394 95775121 95483649 95269459 94950664 94567239 94275391 93900228
903.5I3900228m88770m31222n05161o54012o16456o56241q16792q06093q14653r71752
$$ 93900228 93411458 92980236 92475075 91821063 91204607 90548366 89731574 88925481 88110828 87139076
923.9H7139076r98652j001227j155209j203984j171905j273024j303566j214564j236278
$$ 87139076 86140424 85139197 83983988 82780004 81608099 80335075 79031509 77816945 76580667
942.3G6580667j233768j089734j019639r64725p60358n79286m44275j96230K9069J45811
$$ 76580667 75346899 74257165 73237526 72272801 71512443 70933157 70488882 70292652 70321721 70467532
962.7G0467532L14426M59421M66138N08261N73706N05948M57454M80026L96419L23015
$$ 70467532 70781958 71241379 71707517 72215778 72789484 73295432 73752886 74232912 74629331 74952346
983.1G4952346L70157L45397K89637L48073L47924K73067L04288L06183J99395J77968
$$ 74952346 75322503 75667900 75957537 76305610 76653534 76926601 77230889 77537072 77736467 77914435
1003.5G7914435J57898J8853l7086l4255j42395j90955j33455j62548j75792q6647
$$ 77914435 78072333 78091186 78054100 78019845 77877450 77686495 77553040 77390492 77214700 77128053
1023.9G7128053p8398r1762N651M6915L5023J34916K06732J87958K47323K92367K22623
$$ 77128053 77049655 76957893 76963544 77010459 77045482 77180398 77387130 77575088 77822411 78114778 78337401
1046.3G8337401K17736K46000J64795J24419J43629O3974L487L4308j1694p1293k7281
$$ 78337401 78555137 78801137 78965932 79090351 79233980 79297954 79301441 79335749 79324055 79252762 79225481
1068.8G9225481k7752n9855J6361P9286R4605K15387L50124M10098N34713O64425O70045
$$ 79225481 79197729 79137874 79154235 79233521 79328126 79543513 79893637 80303735 80838448 81502873 82172918
1091.2H2172918O92451P47794P01720O75505P25401O92230O44147O63901N90211M66555
$$ 82172918 82865369 83613163 84314883 84990388 85715789 86408019 87052166 87716067 88306278 88772833
1111.6H8772833M45724L99482L03614L04586K94816K09415K07872K32130J88714K09230
$$ 88772833 89218557 89618039 89921653 90226239 90521055 90730470 90938342 91170472 91359186 91568416
1132I1568416K47622J81806J54746J90460J39392R7996J40983J16843O7901J03587
$$ 91568416 91816038 91997844 92152590 92343050 92482442 92580438 92721421 92838264 92906165 93009752
1152.4I3009752R5481M4065P7910R1123L9667O4784J03569P0900R2006J37120R5386
$$ 93009752 93105233 93149298 93227208 93318331 93357998 93422782 93526351 93597251 93689257 93826377 93921763
1174.8I3921763Q1962J18530Q6832O6316J04135P7784L7486O9034O0493J6099M0048
$$ 93921763 94003725 94122255 94209087 94275403 94379538 94457322 94494808 94563842 94624335 94640434 94680482
1197.3I4680482M6110O885L1769N5438K2239M2897P8476M2599L5977O3378L0178J5277
$$ 94680482 94726592 94733477 94765246 94820684 94842923 94885820 94964296 95006895 95042872 95106250 95136428 95151705
1221.7I5151705M9668K8837L105L2836K1923q506K1744K7627o002J1945K2226j3411
$$ 95151705 95201373 95230210 95233315 95266151 95288074 95279568 95301312 95328939 95322937 95334882 95357108 95343697
1246.2I5343697k527J9419j1671j5062Q327j4222k4032J192j5026k9552K712K038j4621
$$ 95343697 95341170 95360589 95348918 95333856 95342183 95327961 95303929 95305121 95290095 95260543 95263255 95265293 95250672
1272.7I5250672J5819K4504Q64J6928K5057l123P200K1661r877j3983L856k1213k8711
$$ 95250672 95266491 95290995 95291859 95308787 95333844 95330721 95337921 95359582 95349705 95335722 95339578 95318365 95289654
1299.2I5289654J674p194k0480L177J8j5551M315R436q995q070j3882l1942j2988L493
$$ 95289654 95291328 95284134 95263654 95266831 95266849 95251298 95255613 95265049 95256054 95247984 95234102 95202160 95189172 95192665
1327.8I5192665k6524l1686n418o187r233j9586o2793o2585k1273k8521n3197l2979
$$ 95192665 95166141 95134455 95129037 95122850 95113617 95094031 95031238 94968653 94947380 94918859 94865662 94832683
1352.3I4832683l1436n9521l2061j2n8586j21766j08606r9462p9429m6194j07383j73170
$$ 94832683 94801247 94741726 94709665 94709653 94651067 94529301 94420695 94321233 94241804 94195610 94088227 93915057
1376.7I3915057j70886k20239k25789m4000J04409M2141n013J8794k1434o7306r8491
$$ 93915057 93744171 93523932 93298143 93254143 93358552 93400693 93395680 93414474 93393040 93325734 93227243
1399.2I3227243j27911q5712q2993j43117j27005q2946o4069J4943R3841q654j07056
$$ 93227243 93099332 93013620 92930627 92787510 92660505 92577559 92513490 92528433 92622274 92613620 92506564
1421.6I2506564m9061j5312J9836P0405O5112R9981J45179K7114n8555J7035Q8924
$$ 92506564 92457503 92442191 92462027 92532432 92597544 92697525 92842704 92869818 92811263 92828298 92917222
1444.1I2917222J02114P6998M0942O5702J84071K47223j0276j62977Q82R8014M4536
$$ 92917222 93019336 93096334 93137276 93202978 93387049 93634272 93623996 93461019 93461901 93559915 93604451
1466.5I3604451R7508K42954K42061O8795l6156k1267N5593J05703J38957K16859K01142
$$ 93604451 93701959 93944913 94186974 94255769 94219613 94198346 94253939 94359642 94498599 94715458 94916600
1488.9I4916600J6433k1422J23537J43492J5497J7655J71292L60578K40606j42807
$$ 94916600 94933033 94911611 95035148 95178640 95194137 95211792 95383084 95743662 95984268 95841461
1509.3I5841461j49625L4702J65462J66017J41209Q3524n5921p1454m5216j5199Q9699
$$ 95841461 95691836 95726538 95892000 96058017 96199226 96282750 96226829 96155375 96110159 96094960 96184659
1531.8I6184659R7626M9037J97125K85649l9548k35641j67697n7799J3977O7461J44011
$$ 96184659 96282285 96331322 96528447 96814096 96774548 96538907 96371210 96313411 96327388 96394849 96538860
1554.2I6538860K53963K41554k22844l52508j23787K1136L5578n8871o6746J8353o2198
$$ 96538860 96792823 97034377 96811533 96459025 96335238 96356374 96391952 96333081 96266335 96284688 96222490
1576.6I6222490k04033j86508j38093j12026j29170j65748j73706j85883k27988k47556
$$ 96222490 96018457 95831949 95693856 95581830 95452660 95286912 95113206 94927323 94699335 94451779
1597I4451779k45386k63655k75112k71403k89137l20255l25418k77859k52938l42655
$$ 94451779 94206393 93942738 93667626 93396223 93107086 92786831 92461413 92183554 91930616 91587961
1617.4I1587961l20924j72776j36709j85829j92172j48904O08K18910K79045P9727
$$ 91587961 91267037 91094261 90957552 90771723 90579551 90430647 90431255 90650165 90929210 91008937
1637.8I1008937M1509K09796M13675N44047M41813L62122N37748M28539P0959J40226
$$ 91008937 91050446 91260242 91673917 92217964 92659777 93021899 93559647 93988186 94059145 94199371
1658.2I4199371L24488L97408L07077K72376L65144L08799J65898J64199J32197J06025
$$ 94199371 94523859 94921267 95228344 95500720 95865864 96174663 96340561 96504760 96636957 96742982
1678.6I6742982K29543L53110J72180r9516m8691L7306J19657K38782K30348J34260
$$ 96742982 96972525 97325635 97497815 97398299 97349608 97386914 97506571 97745353 97975701 98109961
1699I8109961Q648p0911l9041m0997l6692M0507J60504K36231R4825j43981j32507
$$ 98109961 98118609 98047698 98008657 97967660 97930968 97971475 98131979 98368210 98463035 98319054 98186547
1721.5I8186547l3820K2185R4449J56939J87964J45894l3254m9376M8536M4751J8031
$$ 98186547 98152727 98174912 98269361 98426300 98614264 98760158 98726904 98677528 98726064 98770815 98788846
1743.9I8788846P5173J30391N3299o8009m7905J3996L0267N5462K2328k6041N1164
$$ 98788846 98864019 98994410 99047709 98979700 98931795 98945791 98976058 99031520 99053848 99027807 99078971
1766.3I9078971J29384J27572M8607p9912q7529Q190M6509K921j1093m226K152J329
$$ 99078971 99208355 99335927 99384534 99304622 99217093 99225283 99271792 99274713 99263620 99259394 99261546 99262875
1790.8I9262875r2858j80298j10584M214L2758J9527N7936Q9889P7922N3048J5258
$$ 99262875 99170017 98989719 98879135 98883349 98916107 98935634 98993570 99083459 99161381 99214429 99229687
1813.2I9229687q40K6155M0620L8588P1854Q4298N1922K2739l4135o3360k1601K3008
$$ 99229687 99228847 99255002 99295622 99334210 99406064 99490362 99542284 99565023 99530888 99467528 99445927 99468935
1837.7I9468935L7932P6371R1726j4257q3763l7622j413q565R930K7961J400N722N8008
$$ 99468935 99506867 99583238 99674964 99660707 99576944 99539322 99537909 99529344 99539274 99567235 99568635 99574357 99632365
1864.2I9632365Q5765N4824k6751p8201m4793J3560J6994j949J8560K6822K0391L9816
$$ 99632365 99718130 99772954 99746203 99668002 99623209 99636769 99653763 99651814 99670374 99697196 99717587 99757403
1888.7I9757403J5104k5427k146R954j7071m506K4944J1695J0729K7662l618j8394
$$ 99757403 99772507 99747080 99744934 99754888 99737817 99733311 99758255 99769950 99780679 99808341 99804723 99786329
1913.2I9786329L6055M6706o926To729m4948k4313N418j1527m816J0341p754J0395
$$ 99786329 99822384 99869090 99862164 99855238 99848509 99803561 99779248 99784666 99773139 99768323 99778664 99770910 99781305
1939.7I9781305M1771o682m3512j6176j4162j9688N734P69k2179n668P09q964R971
$$ 99781305 99823076 99816394 99772882 99756706 99742544 99722856 99728590 99729359 99707180 99701512 99702221 99693257 99703228
1966.2I9703228M834k9659j7071N621j4692j7637M929l839q541J4901J1033l046k44
$$ 99703228 99708062 99678403 99661332 99666953 99652261 99634624 99639553 99635714 99627173 99642074 99653107 99650061 99649817
1992.7I9649817j6529k6995k640N60k1446o288J2630n036m280J2797j824j7190k2840
$$ 99649817 99633288 99606293 99603653 99604213 99582767 99576479 99589109 99584073 99579793 99592590 99590766 99573576 99550736
2019.2I9550736n3603q5598n8287K2972P0548O0194K7174p03P838J6296l076k15J2607
$$ 99550736 99497133 99411535 99353248 99376220 99446768 99506962 99534136 99533433 99541271 99557567 99554491 99554276 99566883
2045.8I9566883m000k390J7554L069n638J4859R388l403J3870Q088j5158M42J3017
$$ 99566883 99562883 99560493 99578047 99581116 99575478 99590337 99599725 99596322 99610192 99618280 99603122 99603564 99616581
2072.3I9616581k688K211J0425n567J371K1523Q697K503J6171K873o050J5622J4991
$$ 99616581 99613893 99616104 99626529 99620962 99622333 99643856 99652553 99655056 99671227 99674100 99668050 99683672 99698663
2098.8I9698663J949J5503J5008k884J0806K2721O205P826J5336k271j508J5969J585
$$ 99698663 99700612 99716115 99731123 99728239 99739045 99761766 99767971 99775797 99791133 99788862 99787354 99803323 99804908
2125.3I9804908p510J1664O074n793R983O175q165J0007J6308j812P504J7876O55N097
$$ 99804908 99797398 99809062 99815136 99809343 99819326 99825501 99817336 99827343 99843651 99841839 99849343 99867219 99867874 99872971
2153.9I9872971J9139J758k104J7148Q184o896m24j901J562K3418J7637m440N835R889
$$ 99872971 99892110 99893868 99891764 99908912 99917096 99910200 99909776 99907875 99909437 99932855 99950492 99946052 99951887 99961776
2182.4I9961776p517M560J7697j830l284R620m244m810J4949L081q577Q250J782j2225
$$ 99961776 99954259 99958819 99976516 99974686 99971402 99981022 99976778 99971968 99986917 99989998 99981421 99989671 99991453 99979228
2211I9979228O819Q589j0854Q52R811p183n18J1623m953l839J0425m637r853J2273
$$ 99979228 99986047 99994636 99983782 99984634 99994445 99987262 99986744 99998367 99993414 99989575 100000000 99995363 99985510 99997783
2239.5I9997783O842n769N138k337j4466M488P761q917L362J0383r078k337J0890n007
$$ 99997783 100004625 99998856 100003994 100001657 99987191 99991679 99999440 99990523 99993885 100004268 99995190 99992853 100003743 99998736
2268.1I9998736l373J0621o109j1289Q702L177n949N484k909j8739k063K003j4895
$$ 99998736 99995363 100005984 99999875 99988586 99997288 100000465 99994516 100000000 99997091 99978352 99976289 99978292 99963397
2294.6I9963397p028k813k0677j4281l105k2197k8867j9747k9796k8706j3327k7937
$$ 99963397 99956369 99953556 99932879 99918598 99915493 99893296 99864429 99844682 99814886 99786180 99772853 99744916
2319.1I9744916m4239k7114k2393l6550k6148r591j1879j7375l0803m4638k0165K5982
$$ 99744916 99700677 99673563 99651170 99614620 99588472 99578881 99567002 99549627 99518824 99474186 99454021 99480003
2343.5I9480003O2633P4684K8104n1731q8584o3235m4912l1340O819K9873L7384O0821
$$ 99480003 99542636 99617320 99645424 99593693 99505109 99441874 99396962 99365622 99372441 99402314 99439698 99500519
2368I9500519P0620O1679O4146O4057N5087N7620N5998L5173K0599J5229p27o813K921
$$ 99500519 99571139 99632818 99696964 99761021 99816108 99873728 99929726 99964899 99985498 100000727 100000000 99993187 99996108
2394.5I9996108K324m410J853M125j591K9L541m8L827O246n173o450L160N24j359N388
$$ 99996108 99998432 99994022 99995875 100000000 99998409 99998438 100001979 100001931 100005758 100012004 100006831 100000381 100003541 100004065 100002706 100008094
2427.2A00008094R18m792M172N710l111j120j44q964n394M077q17k062K455o675r322
$$ 100008094 100009012 100004220 100008392 100014102 100010991 100009871 100009727 100000763 99995369 99999446 99998629 99996567 99999022 99992347 99983025
2457.8I9983025J716k771r799r00n365j8775j2166j0162k4086k2799j7417k6458k3902
$$ 99983025 99984741 99981970 99972171 99971271 99965906 99947131 99934965 99924803 99900717 99877918 99860501 99834043 99810141
2484.3I9810141j5849k9128m0859m3935n9414o5487n6035o2006o9726n9402n4455m8077
$$ 99810141 99794292 99765164 99724305 99680370 99620956 99555469 99499434 99437428 99367702 99308300 99253845 99205768
2508.7I9205768j6749L779K50J1158K4856K0861K6870M2570M6742N3566O1047M9776
$$ 99205768 99189019 99192798 99193048 99204206 99229062 99249923 99276793 99319363 99366105 99419671 99480718 99530494
2533.2I9530494M4191N4866M4871K0831J5009J0103K283J1634J6988O193J979J67n150
$$ 99530494 99574685 99629551 99674422 99695253 99710262 99720365 99722648 99734282 99751270 99757463 99759442 99759609 99754459
2559.7I9754459L749J1456J514K020P683m226l886J1087N287l553L916J151o682L832
$$ 99754459 99758208 99769664 99771178 99773198 99780881 99776655 99772769 99783856 99789143 99785590 99789506 99790657 99783975 99787807
2588.3I9787807J0026K432L528L434m518J508J0192O312J0592J8507J1009Q476J7184
$$ 99787807 99797833 99800265 99803793 99807227 99802709 99804217 99814409 99820721 99831313 99849820 99860829 99869305 99886489
2614.8I9886489J3304O950J1348Q911N728J5682J7786O896N675O538K63M452R978K408
$$ 99886489 99899793 99906743 99918091 99927002 99932730 99948412 99966198 99973094 99978769 99985307 99985570 99990022 100000000 100002408
2643.4A00002408k348p99p355o336L046k93l427K831r59o193L183N215k491J573L678
$$ 100002408 100000060 99999261 99991906 99985570 99988616 99988323 99984896 99987727 99986768 99980575 99983758 99988973 99986482 99988055 99991733
2673.9I9991733j699L851O115m172n257q71n907m059M328K92m137N61m298j0067J615
$$ 99991733 99990034 99993885 100000000 99995828 99990571 99989700 99983793 99979734 99984062 99984354 99980217 99980778 99976480 99966413 99968028
2704.5I9968028O723j847j961l165r322o32J0371N954J926K390n686j0044j985j847
$$ 99968028 99974751 99972904 99970943 99967778 99958456 99957824 99968195 99974149 99976075 99978465 99972779 99962735 99960750 99958903
2733.1I9958903m304K974j168j0139j758P176M393K92o640j3291p403m77k682j037
$$ 99958903 99954599 99957573 99956405 99946266 99944508 99951684 99956077 99956369 99949729 99936438 99929035 99928558 99925876 99924839
2761.6I9924839L606k581p934j555M649N942l45j3644j7071o908j251k98N716j264
$$ 99924839 99928445 99925864 99917930 99916375 99921024 99926966 99926621 99912977 99895906 99888998 99887747 99887449 99893165 99891901
2790.2I9891901k0844j8590j359k355j2320j4412j7566j6212m334m524j5235j5854
$$ 99891901 99871057 99852467 99851108 99848753 99836433 99822021 99804455 99788243 99783909 99779385 99764150 99748296
2814.7I9748296j4765j4740q702q959j7607k0981k3341k9218k9343k6298k9355m4269
$$ 99748296 99733531 99718791 99710089 99701130 99683523 99662542 99639201 99609983 99580640 99554342 99524987 99480718
2839.1I9480718o7603q1665p6025o5726p0250p0876m6069k3251j3018m29j192j6463
$$ 99480718 99413115 99331450 99255425 99189699 99119449 99048573 99002504 98979253 98966235 98965806 98964614 98948151
2863.6I8948151k2626k3365j7810L201N889j3793n853K3395L1978K6542K2560J1349
$$ 98948151 98925525 98902160 98884350 98887551 98893440 98879647 98873794 98897189 98929167 98955709 98978269 98989618
2888.1I8989618k712o980p754j5086k2316k3479k3901k3288k2930k2864j4633j2576
$$ 98989618 98986906 98979926 98972172 98957086 98934770 98911291 98887390 98864102 98841172 98818308 98803675 98791099
2912.6I8791099l7939o6519p0905o4802m8387j7614J0831L0458L2871K0814J9849L5089
$$ 98791099 98753160 98686641 98615736 98550934 98502547 98484933 98495764 98526222 98559093 98579907 98599756 98634845
2937I8634845M6682M9711N0610L6591L165j6504j0628j5110k8169k1749p397O544K2346
$$ 98634845 98681527 98731238 98781848 98818439 98821604 98805100 98794472 98779362 98751193 98729444 98722047 98728591 98750937
2963.6I8750937K7257K4998K8527L4058L3432K6632K3025K1631J1831M488J4872L8409
$$ 98750937 98778194 98803192 98831719 98865777 98899209 98925841 98948866 98970497 98982328 98986816 99001688 99040097
2988I9040097O2615O2972L7670K4760J6147m500m489N192Q64J1438L3331K3473o611
$$ 99040097 99102712 99165684 99203354 99228114 99244261 99239761 99235272 99240464 99241328 99252766 99286097 99309570 99302959
3014.5I9302959k6571l7396l3921j7703j1945j6170r048P80K689r001l2222k4998M953
$$ 99302959 99276388 99238992 99205071 99187368 99175423 99159253 99150205 99150985 99153674 99144673 99112451 99087453 99092406
3041.1I9092406Q82k8437l5715k1798k1141k5207j6618k3109l6222k5922j2773o628
$$ 99092406 99093288 99064851 99029136 99007338 98986197 98960990 98944372 98921263 98885041 98859119 98846346 98839718
3065.5I8839718j0353l7790n2797k6912M077J0312m709k7442m3172m7213m1484l6341
$$ 98839718 98829365 98791575 98738778 98711866 98715943 98726255 98721546 98694104 98650932 98603719 98562235 98525894
3090I8525894l7539l7825l2759j8114j2654l6365m7874k3556j7071l8874l1006k444
$$ 98525894 98488355 98450530 98417771 98399657 98387003 98350638 98302764 98279208 98262137 98223263 98192257 98189813
3114.5I8189813n823k6113n2190q5217q3148n4705m2075m0692m2940m7362l6478l1310
$$ 98189813 98183990 98157877 98105687 98020470 97937322 97882617 97840542 97799850 97756910 97709548 97673070 97641760
3139I7641760o4200q5843o6083n0301m1222k9326n3119r1851q8996p2914p7433p9441
$$ 97641760 97577560 97491717 97425634 97375333 97334111 97304785 97251666 97159815 97070819 96997905 96920472 96841031
3163.4I6841031p5942p8982p5752p0142p8190q4477q4228r3984r8634q9234r1040r9701
$$ 96841031 96765089 96686107 96610355 96540213 96462023 96377546 96293318 96199334 96100700 96011466 95920426 95820725
3187.9I5820725r9075j03927j11681j06662j06967j17689j15335j08808j10001j03241
$$ 95820725 95721650 95617723 95506042 95399380 95292413 95174724 95059389 94950581 94840580 94737339
3208.3I4737339r6738j04189j10418j11276j18935j25992j20688j17033j18083j11669
$$ 94737339 94640601 94536412 94425994 94314718 94195783 94069791 93949103 93832070 93713987 93602318
3228.7I3602318j03122j00291j15496j38366j37943j20014j07932j02342j01476j11479
$$ 93602318 93499196 93398905 93283409 93145043 93007100 92887086 92779154 92676812 92575336 92463857
3249.1I2463857j13958r3740q3328j00803j06973r1928q6683q4179o3283m8238p1233
$$ 92463857 92349899 92256159 92172831 92072028 91965055 91873127 91786444 91702265 91638982 91590744 91519511
3271.5I1519511j02932j14947j18178j09291j01143j08934j10656j02413r7382r9098
$$ 91519511 91416579 91301632 91183454 91074163 90973020 90864086 90753430 90651017 90553635 90454537
3291.9I0454537j17159j48005j69885j64777j40285j24306j38545j84571k28787k35277
$$ 90454537 90337378 90189373 90019488 89854711 89714426 89590120 89451575 89267004 89038217 88802940
3312.3H8802940k20609k17801k20478k25067k28679k23548k42501k79284k85714k73323
$$ 88802940 88582331 88364530 88144052 87918985 87690306 87466758 87224257 86944973 86659259 86385936
3332.7H6385936k67148k60950k75272l14748l36778l37082l26920l09777l22539l65525
$$ 86385936 86118788 85857838 85582566 85267818 84931040 84593958 84267038 83957261 83634722 83269197
3353.1H3269197l84689l69411l57390l65841l63660l36725l26150l54338l96985m03398
$$ 83269197 82884508 82515097 82157707 81791866 81428206 81091481 80765331 80410993 80014008 79610610
3373.5G9610610l59213l17437l05927l03399k91854k72680k38889j90753j90615k45196
$$ 79610610 79251397 78933960 78628033 78324634 78032780 77760100 77521211 77330458 77139843 76894647
3393.9G6894647k51615j93572j63996k04850k47717k26456j81007j63001j68407j74129
$$ 76894647 76643032 76449460 76285464 76080614 75832897 75606441 75425434 75262433 75094026 74919897
3414.3G4919897j59222j29354j16539j21420j11222p5365l5947k4772k4664r334j3811
$$ 74919897 74760675 74631321 74514782 74393362 74282140 74206775 74170828 74146056 74121392 74112058 74098247
3436.7G4098247l8719k6351K3812O5446P6032O4259O2371Q1503J05923J28597J43594
$$ 74098247 74059528 74033177 74056989 74122435 74198467 74262726 74325097 74406600 74512523 74641120 74784714
3459.2G4784714J35338J28901J60063J86348J52033R9653J01710J37877J71751J86002
$$ 74784714 74920052 75048953 75209016 75395364 75547397 75647050 75748760 75886637 76058388 76244390
3479.6G6244390J54310J26690J46401J57702J49936J62839J85556J91146J80214J83142
$$ 76244390 76398700 76525390 76671791 76829493 76979429 77142268 77327824 77518970 77699184 77882326
3500G7882326J94251J66094J39303J65772J94561J97214J83440J67065J77092K10792
$$ 77882326 78076577 78242671 78381974 78547746 78742307 78939521 79122961 79290026 79467118 79677910
3520.4G9677910K36702K16639J72281J59734J70023J86711K13576K13325J87969K05523
$$ 79677910 79914612 80131251 80303532 80463266 80633289 80820000 81033576 81246901 81434870 81640393
3540.8H1640393K50101K48092J90836J57535J82677J97011J83785J99830K45321K73717
$$ 81640393 81890494 82138586 82329422 82486957 82669634 82866645 83050430 83250260 83495581 83769298
3561.1H3769298K81089K93321K74348K04825J83386K29424K68859K82371K97910L21847
$$ 83769298 84050387 84343708 84618056 84822881 85006267 85235691 85504550 85786921 86084831 86406678
3581.5H6406678L61925L84540L26764K45869K49261K93189L08484L07000L00962K82555
$$ 86406678 86768603 87153143 87479907 87725776 87975037 88268226 88576710 88883710 89184672 89467227
3601.9H9467227K79809L03745L15058K90519K54273K22362J94573J61654Q3166J2881
$$ 89467227 89747036 90050781 90365839 90656358 90910631 91132993 91327566 91489220 91572386 91585267
3622.3I1585267K3430L2711p4255k60562l34114l31527l10385k67577j96684p8296
$$ 91585267 91608697 91641408 91567153 91306591 90972477 90640950 90330565 90062988 89866304 89788008
3642.7H9788008P4428K16246K61080J56474O9064J06138J39105O5005m3762j30468
$$ 89788008 89862436 90078682 90339762 90496236 90565300 90671438 90810543 90875548 90831786 90701318
3663.1I0701318j86217k67828m88215p29841q59875j156455j307565j064610q04580
$$ 90701318 90515101 90247273 89759058 89029217 88169342 87012887 85705322 84640712 83836132
3681.5H3836132n25671k43002n1665K0301J33979M52364Q43602J053721J120257J327837
$$ 83836132 83310461 83067459 83015794 83036095 83170074 83622438 84466040 85519761 86640018 87967855
3701.9H7967855J605725J673931J565128J340002R88019O06054M09514L79508L69084
$$ 87967855 89573580 91247511 92812639 94152641 95140660 95746714 96156228 96535736 96904820
3720.2I6904820L16614K41190J79351J66320K18535K81221K29716P9286Q762M7439
$$ 96904820 97221434 97462624 97641975 97808295 98026830 98308051 98537767 98617053 98625815 98673254
3740.6I8673254J21016J47110Q8423O3002M7112m0192n8019L946K3109j4395o348N4247
$$ 98673254 98794270 98941380 99029803 99092805 99139917 99099725 99041706 99045652 99068761 99054366 99048018 99102265
3765.1I9102265P1287L6245j7398m1646Q017P9071P6938Q965j6553o878l731J2308
$$ 99102265 99173552 99209797 99192399 99150753 99158770 99237841 99314779 99323744 99307191 99300313 99296582 99308890
3789.6I9308890L7336O3032R2394R1785O7121L2144k5236m6534n4848n4443P320Q6933
$$ 99308890 99346226 99409258 99501652 99593437 99660558 99692702 99667466 99620932 99566084 99511641 99518961 99605894
3814.1I9605894J19168R2953M1729m7654r8663n3001j96L5655P3832R1035P1299P629
$$ 99605894 99725062 99818015 99859744 99812090 99713427 99660426 99660230 99695885 99769717 99860752 99932051 99939680
3838.5I9939680n7346p8684p0721l0905N1034J32978J13964m7684j27178o2794K8038
$$ 99939680 99882334 99803650 99732929 99702024 99753058 99886036 100000000 99952316 99825138 99762344 99790382
3861I9790382O2967K9343O610J6219m709m4525n1504j8555M0734N4013J9390p004l9988
$$ 99790382 99853349 99882692 99889302 99905521 99900812 99856287 99804783 99786228 99826962 99880975 99900365 99893361 99853373
3887.5I9853373k9070l194k5356o062O9565R8955M1789l8528r6608q9162l2377J6796
$$ 99853373 99824303 99821109 99795753 99789691 99859256 99958211 100000000 99961472 99864864 99775702 99743325 99760121
3912I9760121M1157N1540L7706Q518n96P182L874O998K2673J0622j5509j3590P629
$$ 99760121 99801278 99852818 99890524 99899042 99898446 99905628 99909502 99916500 99939173 99949795 99934286 99920696 99928325
3938.5I9928325K5416K8801J7458J1396J1099l326j5581q243P301J6821J7083R334
$$ 99928325 99953741 99982542 100000000 100011396 100022495 100019169 100003588 99995345 100002646 100019467 100036550 100045884
3962.9A00045884R89P367J8549J5402J0252J5271J1396k634K265J7082J4770J1945
$$ 100045884 100046873 100054240 100072789 100088191 100098443 100113714 100125110 100122476 100124741 100141823 100156593 100168538
3987.4A00168538J4138M363M06J2588J8656
$$ 100168538 100182676 100187039 100187445 100200033 100218689
3997.6A00218689
$$ 100218689
##END=$$ End of the data block
