##TITLE=$$ Begin of the data block
##JCAMP-DX=5.00 $$ ACD/SpecManager v 10.08
##SPECTROMETER/DATA SYSTEM=Varian
##DATE=02 Apr 2013 15:14:52
##DATA TYPE=INFRARED SPECTRUM
##DATA CLASS=XYDATA
##ORIGIN=
##OWNER=
##NPOINTS=3735
##FIRSTX=399.26403809
##LASTX=4000.35498047
##MAXX=4000.35498047
##MINX=399.26403809
##MAXY=81.70333099
##MINY=14.21823406
##XFACTOR=1.0000000000
##YFACTOR=0.000000100000000
##FIRSTY=38.06489563
##DELTAX=0.96440572
##XUNITS=1/CM
##YUNITS=TRANSMITTANCE
##XYDATA=(X++(Y..Y))
$$ plain form
399.3 380648956 332098694 335932732 374702034 368705215 303054180 283458138 361167946 382433739
407 382433739 315854549 303419209 335389366 362269096 392149658 405293236 431325798 393911629
414.7 393911629 356765251 369632797 321807022 251170692 186003704 227428970 295343857
421.4 295343857 290172272 293014526 348804932 376972961 333748550 312725239 315853882 297933083
429.2 297933083 257624950 210582561 185863018 177285480 188521290 169272804 142182341 184379749
436.9 184379749 224221802 244023266 263866520 282400703 288487663 303747997 303001804 274993744
444.6 274993744 279967003 291638107 307303238 336254158 358316154 339476662 319280148 333772774
452.3 333772774 352823105 379493370 379355202 361184235 368322334 399764252 421780777 440638084
$$ packed form
399.3C80648956m8550262L834038L8769302n996819o5651035j9596042P7709808K1265793
407C82433739o6579190j2435340L1970157K6879730K9880562J3143578K6032562l7414169
414.7C93911629l7146378J2867546m7825775p0636330o5166988M1425266O7914887
421.4B95343857n171585K842254N5790406K8168029m3224411k1023311L128643j7920799
429.2B97933083m0308133m7042389k4719543q577538J1235810j9248486k7090463M2197408
436.9A84379749L9842053J9801464J9843254J8534183O086960J5260334p46193k8008060
444.6B74993744M973259J1671104J5665131K8950920K2061996j8839492k0196514J4492626
452.3C33772774J9050331K6670265j38168j8170967P138099L1441918K2016525J8857307
$$ plain form
460 440638084 434141464 393491631 383897209 397741051 407913208 392981491 384470863 380755844
467.7 380755844 349249535 368873482 423616219 476344261 497963295 475434113 439234581
474.5 439234581 409029541 418170395 402257500 412448311 461362801 456508713 432335968 427318459
482.2 427318459 417811241 390493050 422423935 467117615 490646629 512644081 505233994 504731712
489.9 504731712 473999977 443859749 474954720 467298164 446149788 453289909 462960587 490223732
497.6 490223732 514109001 494460068 472997627 470569954 489131050 515236664 513539085 518433075
505.3 518433075 540136795 531369781 509229584 502597733 501433296 505322838 511571693 528643913
513.1 528643913 542498932 535354309 541817818 545229836 547261505 572937012 580303574 582732849
$$ packed form
460D40638084o496620m0649833r594422J3843842J0172157j4931717q510628l715019
467.7C80755844l1506309J9623947N4742737N2728042K1619034k2529182l6199532
474.5D39234581l0205040R140854j5912895J0190811M8914490m854088k4172745n017509
482.2D27318459r507218k7318191L1930885M4693680K3529014K1997452p410087n02282
489.9E04731712l0731735l0140228L1094971p656556k1148376P140121R670678K7263145
497.6D90223732K3885269j9648933k1462441k427673J8561096K6105614j697579M893990
505.3E18433075K1703720q767014k2140197o631851j164437L889542O248855J7072220
513.1E28643913J3855019p144623O463509L412018K031669K5675507P366562K429275
$$ plain form
520.8 582732849 581046753 560132561 563251915 574615746 552358284 547608795 562285767 559503479
528.5 559503479 562236061 560429687 557539406 555236511 542761040 552040100 558578033 550498428
536.2 550498428 545054817 535748711 534930038 526770172 512924347 514489212 509281769 496725960
543.9 496725960 496398354 493594322 484194374 481109848 479541855 488006439 492427979 482969055 476752510
552.6 476752510 475739746 481619644 485227318 483835487 486918297 488974571 477157745 471580925
560.3 471580925 477013626 466474648 467348328 483470001 482072144 480983200 490680733 484015694
568 484015694 463939400 460791321 466499519 460052109 450663757 453776894 460238914 460411949 462709427
576.7 462709427 464383087 466797867 462679482 452351952 452582207 454547005 454302101 456214256 455232620
$$ packed form
520.8E82732849j686096k0914192L119354J1363831k2257462m749489J4676972k782288
528.5E59503479K732582j806374k890281k302895j2475471R279060O537933q079605
536.2E50498428n443611r306106q18673q159866j3845825J564865n207443j2555809
543.9D96725960l27606k804032r399948l084526j567993Q464584M421540r458924o216545
552.6D76752510j012764N879898L607674j391831L082810K056274j1816826n576820
560.3D71580925N432701j0538978Q73680J6121673j397857j088944R697533o665039
568D84015694k0076294l148079N708198o447410r388352L113137O462020J73035K297478
576.7D62709427J673660K414780m118385j0327530K30255J964798k44904J912155r81636
$$ plain form
585.4 455232620 445511055 436823654 440229607 442844543 433927002 423896751 421672096 425569649
593.1 425569649 428338699 422566681 420821457 421936874 416614189 417650795 417878036 415021744 407414818
601.8 407414818 395717926 391542053 390979958 393892136 390039902 385923347 392037735 389780273
609.5 389780273 382599716 388543129 401471519 407115593 407976799 403596039 399577980 400382957 399793739
618.2 399793739 400361214 397495728 396486168 404156761 411190948 416588516 425628471 431958809 426570396
626.9 426570396 420304909 426013718 432696838 437036819 445690193 447465172 451277351 462790031
634.6 462790031 464555740 460959740 464057350 466373978 459140625 455195122 455747719 457654305 467514954
643.3 467514954 477211075 482127037 481907616 481102676 482359276 490806160 501656075 497592621 488993034
$$ packed form
585.4D55232620r721565q687401L405953K614936q917541j0030251k224655L897553
593.1D25569649K769050n772018j745224J115417n322685J036606K27241k856292p606926
601.8D07414818j1696892m175873n62095K912178l852234m116555O114388k257462
609.5C89780273p180557N943413J2928390N644074Q61206m380760m018059Q04977n89218
618.2C99793739N67475k865486j009560P670593P034187N397568R039955O330338n388413
626.9D26570396o265487N708809O683120M339981Q653374J774979L812179J1512680
634.6D62790031J765709l596000L097610K316628p233353l945503N52597J906586R860649
643.3D67514954R696121M915962k19421q04940J256600Q446884J0849915m063454q599587
$$ plain form
651.9 488993034 489324265 495127182 495542984 496301384 501119690 506886482 515789795 519070663 522240829
660.6 522240829 521033821 518023643 521791840 521895943 524115105 528786583 526072807 522184334 542881393
669.3 542881393 551033173 555758057 559102898 553921890 555963173 566239471 571180801 571240578 574026527
678 574026527 578990021 582232590 585929604 586347008 593931847 604821625 611454315 619191818 618900909
686.7 618900909 613531761 612542877 616037560 616217575 615220070 621656494 631546936 639573479 646210098
695.3 646210098 648154068 646944962 654849625 658678055 654116440 653031998 660454636 672738190
703.1 672738190 666990509 658900986 663372421 669999161 674541550 669229965 665816345 668272324
710.8 668272324 670690155 671039734 673945618 681523743 680065765 677871704 681966476 687154999 692571945
$$ packed form
651.9D88993034L31231N802917M15802P58400M818306N766792Q903313L280868L170166
660.6E22240829j207008l010178L768197J04103K219162M671478k713776l888473K0697059
669.3E42881393Q151780M724884L344841n181008K041283J0276298M941330N9777K785949
678E74026527M963494L242569L697014M17404P584839J0889778O632690P737503k90909
686.7F18900909n369148r88884L494683J80015r97505O436424R890442Q026543O636619
695.3F46210098J943970j209106P904663L828430m561615j084442P422638J2283554
703.1F72738190n747681q089523M471435O626740M542389n311585l413620K455979
710.8F68272324K417831L49579K905884P578125j457978k194061M094772N188523N416946
$$ plain form
719.5 692571945 688856354 679375000 682509460 691667709 696152954 701949158 702189865 704978027 709750443
728.1 709750443 701348724 698651962 705110321 712292480 718646698 717471542 711595993 705918350
735.8 705918350 704919205 707984848 709424744 711575165 717001190 720646057 726311417 733428879 730292206
744.5 730292206 721511459 716272736 717355804 719883423 720649109 722878876 721613388 722594986 730651321
753.2 730651321 735348129 736905670 738016663 736809616 735384903 736385422 740449219 740671844 740090485
761.9 740090485 745732422 748991089 751389160 752852554 749503555 749429398 749587479 748579712 752593155
770.6 752593155 752049255 743696442 745224457 755182495 758254395 755552292 753738480 757332458 759391861
779.2 759391861 758449936 758407135 755854568 757548447 764212570 768841858 763138275 754662094 759946442
$$ packed form
719.5F92571945l715591r481354L134460R158249M485245N796204K40707K788162M772416
728.1G09750443q401719k696762O458359P182159O354218j175156n875549n677643
735.8G05918350r99145L065643J439896K150421N426025L644867N665360P117462l136673
744.5G30292206q780747n238723J083068K527619P65686K229767j265488R81598Q056335
753.2G30651321M696808J557541J110993j207047j424713J000519M063797K22625n81359
761.9G40090485N641937L258667K398071J463394l348999p4157J58081j007767M013443
770.6G52593155n43900q352813J528015R958038L071900k702103j813812L593978K059403
779.2G59391861r41925m2801k552567J693879O664123M629288n703583q476181N284348
$$ plain form
787.9 759946442 765402298 766493454 771271667 773461990 772169342 768350449 769041672 775499344 778386841
796.6 778386841 776727066 772642746 772813950 775801544 775878677 778495102 782196808 781258316 777514954
805.3 777514954 776706467 780013580 781896362 780167236 779168396 778715897 774247284 775985336 787072525
814 787072525 785590897 776893234 779104309 776485977 774188995 784403000 788346634 788721313 789136963
822.6 789136963 787406235 790531082 792804184 792209167 786269150 782115936 784518204 786679459 786226807
831.3 786226807 781292191 782415085 784848862 783380814 785844040 785365067 783311005 785535812 789058075
840 789058075 790319138 790284805 786595688 784824524 788967285 786654739 784340286 788515625 792149200
848.7 792149200 788313904 780876083 781880264 786172485 786608734 782199554 780301285 782745667 781750259
$$ packed form
787.9G59946442N455856J091156M778213K190323j292648l818893O91223O457672K887497
796.6G78386841j659775m084320J71204K987594P7133K616425L701706r38492l743362
805.3G77514954q08487L307113J882782j729126r98840m52499m468613J738052J1087189
814G87072525j481628q697663K211075k618332k296982J0214005L943634L74679M15650
822.6G89136963j730728L124847K273102n95017n940017m153214K402268K161255m52652
831.3G86226807m934616J122894K433777j468048K463226m78973k054062K224807L522263
840G89058075J261063l4333l689117j771164M142761k312546k314453M175339L633575
848.7G92149200l835296p437821J004181M292221M36249m409180j898269K444382r95408
$$ plain form
857.4 781750259 779800415 777218552 776089096 777980804 776696548 771357651 768695908 770058975
865.1 770058975 771657715 771870422 770482101 768791656 765879517 764950104 763128281 758980789 757515793
873.8 757515793 756515121 757550583 754283829 749858170 749866714 745605164 746089554 750125885 747872391
882.4 747872391 745047989 740455627 734224777 731494446 729780121 729522934 731154251 730211563 728872604
891.1 728872604 727445145 724173279 719919434 714949493 710987244 707546310 704578934 701036072
898.8 701036072 696906052 694448853 692215576 689690781 687466202 681086349 673718033 674582291 672130508
907.5 672130508 660633698 651568375 645270615 640034943 634608841 631619835 630012589 625507927
915.2 625507927 621562767 611258202 599086800 594225578 589593697 581100502 567675171 556200027
$$ packed form
857.4G81750259j949844k581863j129456J891708j284256n338897k661743J363067
865.1G70058975J598740K12707j388321j690445k912139r29413j821823m147492j464996
873.8G57515793j000672J035462l266754m425659Q544m261550M84390M036331k253494
882.4G47872391k824402m592362o230850k730331j714325k57187J631317r42688j338959
891.1G28872604j427459l271866m253845m969941l962249l440934k967376l542862
898.8G01036072m130020k457199k233277k524795k224579o379853p368316Q64258k451783
907.5F72130508j1496810r065323o297760n235672n426102k989006j607246m504662
915.2F25507927l945160j0304565j2171402m861222m631881q493195j3425331j1475144
$$ plain form
922.9 556200027 548067436 540007439 532738914 524483871 517253075 506057930 494599991 484958115
930.7 484958115 472369194 460623512 448165894 436226654 422603416 411035461 403320007 393456497
938.4 393456497 381976128 369379654 359724121 348295860 337099228 327898064 317951069 309507751
946.1 309507751 302287598 297032356 288687458 282641945 275805683 268370953 266683350 263539524
953.8 263539524 258386040 253859348 255154781 254736805 255962505 259964924 259145508 260505657 263045044
962.5 263045044 268400421 269784260 271332417 278293304 283306141 287427139 290838928 297911186
970.2 297911186 302085896 304395237 308721027 313135300 318330193 320905609 326529236 333563042
977.9 333563042 338366051 339887962 340476990 342656898 345484238 350273285 353748627 358307953 363022881
$$ packed form
922.9E56200027q132591q059997p268525q255043p230796j1195145j1457939r641876
930.7D84958115j2588921j1745682j2457618j1939240j3623238j1567955p715454r863510
938.4C93456497j1480369j2596474r655533j1428261j1196632r201164r946995q443318
946.1C09507751p220153n255242q344898o045513o836262p434730j687603l143826
953.8B63539524n153484m526692J295433m17976J225700M002419q19416J360149K539387
962.5B63045044N355377J383839J548157O960887N012837M120998L411789P072258
970.2B97911186M174710K309341M325790M414273N194893K575416N623627P033806
977.9C33563042M803009J521911N89028K179908K827340M789047L475342M559326M714928
$$ plain form
986.6 363022881 367882805 370916405 371172295 373100052 374643288 378219032 382280693 387089424 390780869
995.3 390780869 392889748 396207275 398324471 401657562 404194870 406630478 408744736 411109810
1003 411109810 413014221 411914864 411361580 411034050 411112633 407899475 406662407 407125435 402230797
1011.7 402230797 396563187 391716042 389521523 385427475 380292320 373851089 368222771 366677704
1019.4 366677704 362315979 359806366 356179123 353544044 353154831 352898598 354829865 353814049 351679459
1028.1 351679459 350163116 355316429 361050873 363923836 368618546 375164452 383843346 387555580
1035.8 387555580 392717781 401230316 410212631 417084656 421439247 428259087 435981903 443957138
1043.5 443957138 447894974 450897675 452525940 456264038 462755508 462077179 461668396 461845589 460880203
$$ packed form
986.6C63022881M859924L033600K55890J927757J543236L575744M061661M808731L691445
995.3C90780869K108879L317527K117196L333091K537308K435608K114258K365074
1003D11109810J904411j099357n53284l27530P8583l213158j237068M63028m894638
1011.7D02230797n667610m847145k194519m094048n135155o441231n628318j545067
1019.4C66677704m361725k509613l627243k635079l89213k56233J931267j015816k134590
1028.1C51679459j516343N153313N734444K872963M694710O545906Q678894L712234
1035.8C87555580N162201Q512535Q982315O872025M354591O819840P722816P975235
1043.5D43957138L937836L002701J628265L738098O491470o78329m08783J77193r65386
$$ plain form
1052.2 460880203 458971786 458076401 459138412 457479515 455853386 452571373 451454811 448850784
1059.9 448850784 443009605 439161110 432525330 425961494 423348465 422458878 420198402 418615532
1067.6 418615532 412881508 407698441 403477936 396264153 395228310 391669693 389487419 388572960
1075.3 388572960 389070625 392955284 390834465 391335716 393697472 396481590 395730324 397805061 403649864
1084 403649864 405996895 411938133 416124840 423046379 429352570 434580727 443290901 452045822 460022469
1092.7 460022469 462891464 470168839 481454086 493124428 501223412 504837685 510462151 515530472
1100.4 515530472 523346443 530354233 534915543 540965996 549104614 557856674 563902168 571019402
1108.1 571019402 578473358 583957596 588906555 595124359 601662674 605930519 609465256 614522171
$$ packed form
1052.2D60880203j908417q95385J062011j658897j626129l282013j116562k604027
1059.9D48850784n841179l848495o635780o563836k613029q89587k260476j582870
1067.6D18615532n734024n183067m220505p213783j035843l558617k182274r14459
1075.3C88572960M97665L884659k120819N01251K361756K784118p51266K074737N844803
1084D03649864K347031N941238M186707O921539O306191N228157Q710174Q754921P976647
1092.7D60022469K868995P277375J1285247J1670342Q098984L614273N624466N068321
1100.4E15530472P815971P007790M561310O050453Q138618Q752060O045494P117234
1108.1E71019402P453956N484238M948959O217804O538315M267845L534737N056915
$$ plain form
1115.8 614522171 619250183 620922394 624208794 629144859 630430260 631980515 635348396 636787605
1123.5 636787605 640184937 645583191 646869583 646274567 647596207 651277847 653507156 653810730 655581360
1132.2 655581360 657418060 659549866 661498032 662795868 662952576 662669525 665490417 670403519 672959900
1140.9 672959900 672790146 675664139 678608780 677908478 677570953 678706741 681032486 682268448 681755829
1149.6 681755829 681179733 681949768 683510132 685931625 688175812 686218338 684949570 687931290 690210724
1158.3 690210724 689785233 690577698 692657776 694227753 695764923 693730545 692744827 694513245 695624695
1166.9 695624695 699328308 701140671 699702225 700595398 702388916 701204758 700307922 702407761 703706207
1175.6 703706207 703926086 704060745 704562149 706477203 708308105 708790283 710615768 713369293 713419724
$$ packed form
1115.8F14522171M728012J672211L286400M936065J285401J550255L367881J439209
1123.5F36787605L397332N398254J286392n95016J321640L681640K229309L03574J770630
1132.2F55581360J836700K131806J948166J297836J56708k83051K820892M913102K556381
1140.9F72959900j69754K873993K944641p00302l37525J135788K325745J235962n12619
1149.6F81755829n76096P70035J560364K421493K244187j957474j268768K981720K279434
1158.3F90210724m25491P92465K080078J569977J537170k034378r85718J768418J111450
1166.9F95624695L703613J812363j438446Q93173J793518j184158q96836K099839J298446
1175.6G03706207K19879J34659N01404J915054J830902M82178J825485K753525N0431
$$ plain form
1184.3 713419724 712228088 712112350 713195877 712253036 711473923 713315659 714134903 716497345 719177322
1193 719177322 719172974 718600464 718449173 718717346 717258224 714587021 714627228 717366714 718845749 718437500
1202.6 718437500 717574844 719062271 721558456 720167999 719640350 720357132 721225204 723877792 724546127
1211.3 724546127 725370331 727251587 728369370 727715073 725830307 726980820 728438263 727743149 728036423
1220 728036423 729011383 729908981 730646210 730360565 730193481 730129471 730185471 731495819 732698059 733387222
1229.6 733387222 734631577 735820389 735477829 734302597 732871628 733607788 736800156 736705856 735501328
1238.3 735501328 736085663 736506882 736573181 736672974 738295822 739384766 740008087 741206665 740355606
1247 740355606 738561478 738813324 739473267 739007416 740196533 740305252 740105286 743025513 743651199
$$ packed form
1184.3G13419724j191636j15738J083527r42841p79113J841736Q19244K362442K679977
1193G19177322m348n72510j51291K68173j459122k671203M0207K739486J479035m08249
1202.6G18437500q62656J487427K496185j390457n27649P16782Q68072K652588O68335
1211.3G24546127Q24204J881256J117783o54297j884766J150513J457443o95114K93274
1220G28036423R74960Q97598P37229k85645j67084o4010N6000J310348J202240O89163
1229.6G33387222J244355J188812l42560j175232j430969P36160L192368r4300j204528
1238.3G35501328N84335M21219O6299R9793J622848J088944O23321J198578q51059
1247G40355606j794128K51846O59943m65851J189117J08719j99966K920227O25686
$$ plain form
1255.7 743651199 742318192 741939926 741936340 741983566 742792969 745156708 745270309 742947388 742365189 743794937
1265.3 743794937 745217133 744721909 742828064 743801346 745328979 744200592 745353317 746991501 747452316
1274 747452316 748691940 748298492 747661133 748723831 749274521 748193665 746994781 746775208 748670731
1282.7 748670731 751122742 751700211 751495895 749919891 748775482 749778671 751215591 752203522 752563248
1291.3 752563248 753481216 753787384 753420563 753089294 752366791 752436600 753161240 753739243 754314880 755016403
1301 755016403 753737564 752093582 752810440 753245392 753959274 755899658 757309113 757388153 756542511
1309.7 756542511 755701294 755010681 754549942 754260406 754781952 755914230 755593185 753887482 753955917
1318.3 753955917 755672302 756305847 756849213 757377319 757350311 756914978 756172485 756266022 756266937 756223526
$$ packed form
1255.7G43651199j333007l78266l586M7226Q09403K363739J13601k322921n82199J429748
1265.3G43794937J422196m95224j893845R73282J527633j128387J152725J638184M60815
1274G47452316J239624l93448o37359J062698N50690j080856j198884k19573J895523
1282.7G48670731K452011N77469k04316j576004j144409J003189J436920R87931L59726
1291.3G52563248R17968L06168l66821l31269p22503O9809P24640N78003N75637P01523
1301G55016403j278839j643982P16858M34952P13882J940384J409455P9040q45642
1309.7G56542511q41217o90613m60739k89536N21546J132278l21045j705703O8435
1318.3G53955917J716385O33545N43366N28106k7008m35333p42493R3537R15m3411
$$ plain form
1328 756223526 757413406 758075027 758066559 758914871 758898468 758134460 757340698 756251297 757058029 758172302
1337.6 758172302 758064499 758106232 757574158 757084656 757595978 759323044 759972458 758423691 757147598
1346.3 757147598 758428574 759362335 757801743 758400040 759424896 759627457 760766525 761072998 761203995
1355 761203995 761052094 761103745 760475006 759980698 761280289 760624771 760343399 760778503 758759995 759730377
1364.6 759730377 760997009 761056061 761424408 760634537 759655380 759931183 760087509 760584183 760799789 761183624
1374.3 761183624 760968246 759660721 761135178 762738419 762047501 761725845 761247864 760840530 760905609
1382.9 760905609 760749054 760134659 760273132 761350632 761024933 760949631 762455139 763247299 763328323 764965439
1392.6 764965439 765855255 763488770 761841507 763625870 765948029 766814957 764332047 762566376 763604736
$$ packed form
1328G56223526J189880O61621q468Q48312j6403p64008p93762j089401Q06732J114273
1337.6G58172302j07803M1733n32074m89502N11322J727066O49414j548767j276093
1346.3G57147598J280976R33761j560592N98297J024856K02561J139068L06473J30997
1355G61203995j51901N1651o28739m94308J299591o55518k81372M35104k018508R70382
1364.6G59730377J266632N9052L68347p89871r79157K75803J56326M96674K15606L83835
1374.3G61183624k15378j307525J474457J603241o90918l21656m77981m07334O5079
1382.9G60905609j56555o14395J38473J077500l25699p5302J505508P92160Q1024J637116
1392.6G64965439Q89816k366485j647263J784363K322159Q66928k482910j765671J038360
$$ plain form
1401.3 763604736 764935303 765859528 764460068 761197891 763450546 764997787 765018539 765642700 765566025
1409.9 765566025 766536255 766433792 765722427 766331100 766979828 767760544 766455231 763987122 761939774
1418.6 761939774 757931366 759773865 763735046 767838745 769979019 767395630 764764786 765231705
1426.3 765231705 766365433 767059097 766663132 765081406 766736450 768481522 767303696 765842514 766899872
1435 766899872 766247940 759107666 762814407 766745148 766457596 765294266 766544495 768490601 769529266
1443.7 769529266 769642181 769055710 769266891 767508774 764387207 766238327 767956161 768359756 768550873
1452.4 768550873 768580780 768507690 768093643 769094315 764225693 759242859 764071655 766977158 769348068
1461.1 769348068 770599823 770660400 770713120 766068878 768088684 771181488 769833374 769554901 770732956
$$ packed form
1401.3G63604736J330567R24225j399460l262177K252655J547241K0752O24161p6675
1409.9G65566025R70230j02463p11365O08673O48728P80716j305313k468109k047348
1418.6G61939774m008408J842499L961181M103699K140274k583389k630844M66919
1426.3G65231705J133728O93664l95965j581726J655044J745072j177826j461182J057358
1435G66899872o51932p140274L706741L930741k87552j163330J250229J946106J038665
1443.7G69529266J12915n86471K11181j758117l121567J851120J717834M03595J91117
1452.4G68550873K9907p3090m14047J000672m868622m982834M828796K905503K370910
1461.1G69348068J251755O0577N2720m644242K019806L092804j348114k78473J178055
$$ plain form
1469.7 770732956 772216721 771328125 765386505 767666855 773904953 776229019 771987152 771550903 773169479
1478.4 773169479 773742142 775451736 775000229 773814087 773547516 773131332 774495010 776157837 774999237
1487.1 774999237 774011230 775413895 774026184 771640015 773390045 776387253 778718567 779810562
1494.8 779810562 778267441 773147354 777299042 779338684 776692657 777967148 778341064 778834915 781081543
1503.5 781081543 783171463 783596725 778075104 770861282 769606857 773206482 775988388 778792267
1511.2 778792267 780812759 780172958 780090637 778867264 777387238 774511337 775550613 779740753 780661240
1519.9 780661240 775412369 770107651 772599869 777535248 781516418 779287033 777703705 780645142
1527.6 780645142 779915390 780931778 783422318 782215881 781896057 781229553 776141586 777550812 779166336
$$ packed form
1469.7G70732956J483765q88596n941620K280350O238098K324066m241867m36249J618576
1478.4G73169479N72663J709594m51507j186142k66571m16184J363678J662827j158600
1487.1G74999237r88007J402665j387711k386169J750030K997208K331314J091995
1494.8G79810562j543121n120087M151688K039642k646027J274491L73916M93851K246628
1503.5G81081543K089920M25262n521621p213822j254425L599625K781906K803879
1511.2G78792267K020492o39801q2321j223373j480026k875901J039276M190140R20487
1519.9G80661240n248871n304718K492218M935379L981170k229385j583328K941437
1527.6G80645142p29752J016388K490540j206437l19824o66504n087967J409226J615524
$$ plain form
1536.3 779166336 781805496 785091629 779146271 766291962 774602051 781521378 779291992 777520828
1544 777520828 774756470 773907623 777068329 778404770 779377899 777399292 775689545 778367996 779962006
1552.7 779962006 781676178 777771759 774791718 778180618 783252487 778267593 759233627 770248795
1560.4 770248795 777450638 779069138 778165894 777973709 775819092 775870667 778100433 778328629 776838837
1569.1 776838837 771456528 774195175 775266495 773835678 775411835 779617691 783555603 773150330
1576.8 773150330 773374939 775130844 774424591 775010452 775082932 774522629 772948914 772042313 771437302
1585.5 771437302 771352768 771422653 770453644 770227356 769018860 769231110 768801575 767287827 767137451 766844940
1595.1 766844940 766036072 763750229 763498764 763792267 763460159 762035980 759043884 757296143 755780487
$$ packed form
1536.3G79166336K639160L286133n945358j2854309Q310089O919327k229386j771164
1544G77520828k764358q48847L160706J336441R73129j978607j709747K678451J594010
1552.7G79962006J714172l904419k980041L388900N071869m984894j9033966J1015168
1560.4G70248795P201843J618500r03244j92185k154617N1575K229766K28196j489792
1569.1G76838837n382309K738647J071320j430817J576157M205856L937912j0405273
1576.8G73150330K24609J755905p06253N85861P2480n60303j573715r06601o05011
1585.5G71437302q4534O9885r69009k26288j208496K12250m29535j513748j50376k92511
1595.1G66844940q08868k285843k51465K93503l32108j424179k992096j747741j515656
$$ plain form
1603.8 755780487 755219269 753744965 752119751 751279755 751093140 749809113 747375107 746258163 743125229
1612.5 743125229 741384430 741499100 743056335 741860580 733446350 735854874 736008759 735707550 734709167
1621.1 734709167 734603043 732762527 728718567 731313324 731823120 731316986 727126694 726533508 729776993
1629.8 729776993 731114655 731723557 731031036 730866852 731019211 727061234 725671082 728028793 731723404
1638.5 731723404 734054565 734476776 734603806 736537857 737165985 738800888 740056534 736353760 736621704
1647.2 736621704 740692062 746325989 749709625 752010651 753516693 749933014 738371964 745811310
1654.9 745811310 754056931 757752075 758733749 759964676 762149963 763537292 762612610 761263885 763285599
1663.6 763285599 766057816 768021088 769721146 772105560 773546829 768454590 769376144 773223343
$$ packed form
1603.8G55780487n61218j474304j625214q39996j86615j284027k434006j116944l132934
1612.5G43125229j740799J14670J557235j195755q414230K408524J53885l01209r98383
1621.1G34709167j06124j840516m043960K594757N09796n06134m190292n93186L243485
1629.8G29776993J337662O08902o92521j64184J52359l957977j390152K357711L694611
1638.5G31723404K331161M22211J27030J934051O28128J634903J255646l702774K67944
1647.2G36621704M070358N633927L383636K301026J506042l583679j1561050P439346
1654.9G45811310Q245621L695144R81674J230927K185287J387329r24682j348725K021714
1663.6G63285599K772217J963272J700058K384414J441269n092239R21554L847199
$$ plain form
1671.3 773223343 773319855 775185089 778445892 777129822 773782883 776375961 778169022 778653870 779244156
1680 779244156 781179123 784015121 786374893 783360825 773628006 776395569 779610977 783835144 786979523
1688.6 786979523 786582794 785190353 785580597 786569824 786751633 789672775 792205811 782313080 785569763
1697.3 785569763 790515289 794769135 789494553 779388657 786328659 789557037 791508636 792247009
1705 792247009 791171799 789763641 791329117 793215637 793660736 794047546 794353333 796081467 798668365
1713.7 798668365 797088776 794850311 798494263 802185669 792650604 794166183 797253418 798693619
1721.4 798693619 800703354 799651413 797367859 797248077 797988892 799395447 799835510 800299530 798299408
1730.1 798299408 798420105 802040405 802146683 794553833 789623871 796089706 799994049 800676727 802387009
$$ packed form
1671.3G73223343R6512J865234L260803j316070l346939K593078J793061M84848N90286
1680G79244156J934967K835998K359772l014068r732819K767563L215408M224167L144379
1688.6G86979523l96729j392441L90244R89227J81809K921142K533036r892731L256683
1697.3G85569763M945526M253846n274582j0105896O940002L228378J951599P38373
1705G92247009j075210j408158J565476J886520M45099L86810L05787J728134K586898
1713.7G98668365j579589k238465L643952L691406r535065J515579L087235J440201
1721.4G98693619K009735j051941k283554j19782P40815J406555M40063M64020k000122
1730.1G98299408J20697L620300J06278p592850m929962O465835L904343O82678J710282
$$ plain form
1738.8 802387009 800455017 798030014 800990143 801810379 800014648 799921570 800974274 800768661 801463089
1747.5 801463089 801713181 801450500 803692703 800462799 798600388 801226349 802744064 804562225 803507538
1756.2 803507538 799655457 801176071 803055115 804761200 806706467 803983383 802622681 804766998
1763.9 804766998 805075378 805153198 806513138 805788803 802970276 805052643 808036346 808654327 803386536
1772.5 803386536 801082306 805232925 805870667 803769531 805210571 805500259 805620956 805719223 804827194
1781.2 804827194 806147308 807359543 807652969 806163330 805341721 806032639 805677261 806223679 806973190
1789.9 806973190 806109161 806707382 807376938 807193298 808178482 807708588 806380615 807159576 808337479
1798.6 808337479 807771454 806332550 806738434 807410965 807681580 808130417 808811417 810151901 810327530
$$ packed form
1738.8H02387009j931992k425003K960129Q20236j795731r3078J052704k05613O94428
1747.5H01463089K50092k62681K242203l229904j862411K625961J517715J818161j054687
1756.2H03507538l852081J520614J879044J706085J945267k723084j360702K144317
1763.9H04766998L08380P7820J359940p24335k818527K082367K983703O17981n267791
1772.5H03386536k304230M150619O37742k101136J441040K89688J20697R8267q92029
1781.2H04827194J320114J212235K93426j489639q21609O90918l55378N46418P49511
1789.9H06973190q64029N98221O69556j83640R85184m69894j327973P78961J177903
1798.6H08337479n66025j438904M05884O72531K70615M48837O81000J340484J75629
$$ plain form
1807.3 810327530 808246155 807419891 807565384 807414093 809033356 809734650 808633575 808843460 809674759
1815.9 809674759 809398346 808861160 809097977 809267883 809386292 809884415 809309235 809310760 810065613 808340530
1825.6 808340530 808458786 810234070 811669693 810706100 805217819 806622009 809286728 809359970 810158157
1834.3 810158157 811385651 811382294 809839401 808751450 809126358 809714966 811190643 811413193 811292343
1842.9 811292343 809384613 804264984 808549652 812486343 811405411 810151520 810987091 811453247 811482468
1851.6 811482468 811779251 811451187 810163879 809244308 809843292 810351715 810255356 810277786 810397797 810978928
1861.3 810978928 810450211 809367981 809356232 810313339 810826263 811196060 813279495 812077026 808834534
1869.9 808834534 809571762 810656891 810724411 810751114 810646744 810607910 812263565 812931137 812512360 812366028
$$ packed form
1807.3H10327530k081375q26264J45493j51291J619263P01294j101075K09885Q31299
1815.9H09674759k76413n37186K36817J69906J18409M98123n75180J525P54853j725083
1825.6H08340530J18256J775284J435623r63593n488281J404190K664719P3242P98187
1834.3H10158157J227494l357j542893j087951L74908N88608J475677K22550j20850
1842.9H11292343j907730n119629M284668L936691j080932j253891Q35571M66156K9221
1851.6H11482468K96783l28064j287308r19571N98984N08423r6359K2430J20011N81131
1861.3H10978928n28717j082230j1749R57107N12924L69797K083435j202469l242492
1869.9H08834534P37228J085129O7520K6703j04370l8834J655655O67572m18777j46332
$$ plain form
1879.6 812366028 811039047 810677948 811584930 812880859 812721100 811736679 812026825 811792450 812241821
1888.3 812241821 812166595 810526199 810516052 811025467 811611710 812226181 812877502 812943344 812261505 811135788
1897.9 811135788 811980972 813709793 813289871 812824402 812318726 812223206 812852402 813738480 814404984 813119736
1907.6 813119736 812671356 812796326 812151642 812978897 813259201 812524033 812878189 813192749 814093399 816716919
1917.2 816716919 815074768 811727066 812643890 813588486 813205872 811406021 811062241 812033920 812691040
1925.9 812691040 813571167 813355942 812717056 813051682 813293915 812663803 812360764 813193665 813732300 812861786
1935.5 812861786 812620926 813185349 812283325 811869812 812585449 813535004 813081894 811389465 812334671
1944.2 812334671 812506180 812380371 813352585 813959579 814123383 813298340 812588120 811630173 811724777 812632828
$$ packed form
1879.6H12366028j326981l61099R06982J295929j59759r84421K90146k34375M49371
1888.3H12241821p5226j640396j0147N09415N86243O14471O51321O5842o81839j125717
1897.9H11135788Q45184J728821m19922m65469n05676r5520O29196Q86078O66504j285248
1907.6H13119736m48380J24970o44684Q27255K80304p35168L54156L14560R00650K623520
1917.2H16716919j642151l347702R16824R44596l82614j799851l43780R71679O57120
1925.9H12691040Q80127k15225o38886L34626K42233o30112l03039Q32901N38635q70514
1935.5H12861786k40860N64423r02024m13513P15637R49555m53110j692429R45206
1944.2H12334671J71509j25809R72214O06994J63804q25043p10220r57947R4604R08051
$$ plain form
1953.8 812632828 812508850 812526398 812008438 811788483 811977692 812384949 812723618 812429657 812673645 811890182
1963.5 811890182 810837631 811155472 811390076 810662842 810582733 811286545 810969772 810590668 810917511 811575317
1973.1 811575317 812237778 812288742 811166763 809822998 810254745 811371155 811540985 810951538 811162949
1981.8 811162949 811597672 811403809 812155457 812465363 811299210 810015335 809650345 810116730 811342316
1990.5 811342316 811667557 809003143 808118515 809319305 810113297 810206375 810450516 810930862 810497360
1999.2 810497360 810694504 810742416 810282669 809763489 809286270 809925919 809762726 810127716 810980072 810179596
2008.8 810179596 809374695 809714127 810648727 810416641 809786224 809630966 809921494 809921875 809503479 810436096
2018.5 810436096 810569153 810394974 810889664 810486984 810346527 810913773 811515274 811299438 810494843 810010376
$$ packed form
1953.8H12632828j23978J7548n17960k19955J89209M07257L38669k93961K43988p83463
1963.5H11890182j052551L17841K34604p27234q0109P03812l16773l79104L26843O57806
1973.1H11575317O62461N0964j121979j343765M31747J116410J69830n89447K11411
1981.8H11162949M34723j93863P51648L09906j166153j283875l64990M66385J225586
1990.5H11342316L25241k664414q84628J200790P93992R3078K44141M80346m33502
1999.2H10497360J97144M7912m59747n19180m77219O39649j63193L64990Q52356q00476
2008.8H10179596q04901L39432R34600k32086o30417j55258K90528L81m18396R32617
2018.5H10436096J33057j74179M94690m02680j40457N67246O01501k15836q04595m84467
$$ plain form
2028.1 810010376 810156250 810423203 810009613 810222244 810901260 810945129 810909729 810884171 810742569 810061569
2037.7 810061569 809035339 808920212 809124451 809272766 809773331 809779892 809729691 809333954 809108734 809699554
2047.4 809699554 809579239 809688568 810137787 810470428 810717316 810631027 810822678 810959015 811348801 811072693
2057 811072693 810512772 811171265 811885757 812375870 811889572 810766068 810581512 810893478 811098633 811094818
2066.7 811094818 810883713 810759354 810683975 810257797 809861984 809670563 810254059 810810547 810203857 809973221
2076.3 809973221 809976196 810096283 810281754 809809647 809490814 809602814 810189362 810991440 811395569 810652542
2086 810652542 810065613 810895615 811312332 811161499 811548386 811805115 810670776 809763031 810146408 810659103
2095.6 810659103 811148682 810854187 811133728 812034683 812213821 812519073 812262039 811791611 811479721 811502457
$$ packed form
2028.1H10010376J45874K66953m13590K12631O79016M3869l5400k5558j41602o81000
2037.7H10061569j026230j15127K04239J48315N00565O561n0201l95737k25220N90820
2047.4H09699554j20315J09329M49219L32641K46888q6289J91651J36337L89786k76108
2057H11072693n59921O58493P14492M90113m86298j123504j84556L11966K05155l815
2066.7H11094818k11105j24359p5379m26178l95813j91421N83496N56488o06690k30636
2076.3H09973221K975J20087J85471m72107l18833J12000N86548Q02078M04129p43027
2086H10652542n86929Q30002M16717j50833L86887K56729j134339r07745L83377N12695
2095.6H10659103M89579k94495K79541R00955J79138L05252k57034m70428l11890K2736
$$ plain form
2105.2 811502457 811500473 811082764 811993637 812502975 812439804 812956238 812162094 811845093 812532501 812378769
2114.9 812378769 812483978 812441940 811419678 811005173 811294937 811217422 812235184 813816833 813696823
2123.6 813696823 813479996 812671814 811624451 812345276 812727203 813199692 813315964 812794876 813040390
2132.3 813040390 812407532 812508163 813000412 812421265 812872391 813300171 812700500 812360687 812510376 812801971
2141.9 812801971 813663406 814013214 813306732 812879486 812867813 813347168 813367462 812674789 812555695 813374557
2151.5 813374557 813878174 813427505 813317719 812870026 812123795 811764145 811999359 813021927 813565826
2160.2 813565826 814201279 814674988 814481049 814168777 813564148 812711716 811977081 812874451 813929138
2168.9 813929138 814200516 814811859 814580612 814259338 814400940 814354782 814289551 814056396 813657150 813012161
$$ packed form
2105.2H11502457j984m17709R10873N09338o3171N16434p94144l17001O87408j53732
2114.9H12378769J05209m2038j022262m14505K89764p7515J017762J581649j20010
2123.6H13696823k16827q08182j047363P20825L81927M72489J16272n21088K45514
2132.3H13040390o32858J00631M92249n79147M51126M27780n99671l39813J49689K91595
2141.9H12801971Q61435L49808p06482m27246j1673M79355K0294o92673j19094Q18862
2151.5H13374557N03617m50669j09786m47693p46231l59650K35214J022568N43899
2160.2H13565826O35453M73709j93939l12272o04629q52432p34635Q97370J054687
2168.9H13929138K71378O11343k31247l21274J41602m6158o5231k33155l99246o44989
$$ plain form
2178.5 813012161 813000565 814012756 814773712 814978333 814413986 813426361 813633041 813905106 813639297 813837585
2188.2 813837585 813539047 813223724 813444901 813548584 813348999 813291321 813842392 814188538 814326782 814201736
2197.8 814201736 814067383 814839630 815285721 814567642 814380035 814894257 814238739 813742447 814088440 814163666
2207.5 814163666 814787369 814777069 813564301 813422852 814246063 813909149 813047791 813339081 813951492 814404144
2217.1 814404144 815587006 816236115 814750900 813822784 814298782 814653473 815024948 814695282 814823914
2225.8 814823914 815000916 814441681 814803619 814869690 814350281 814508820 815382156 815362701 814961014 815654907
2235.4 815654907 815374985 814500732 814036179 814258194 814960709 815117416 815595779 815355682 814993973 815042191
2245.1 815042191 814234924 813904343 813797150 814065781 814514160 813971176 813822174 814212265 814457550 814696808
$$ packed form
2178.5H13012161j1596J012191P60956K04621n64347r87625K06680K72065k65809J98288
2188.2H13837585k98538l15323K21177J03683j99585n7678N51071L46146J38244j25046
2197.8H14201736j34353P72247M46091p18079j87607N14222o55518m96292L45993P5226
2207.5H14163666O23703j0300j212768j41449Q23211l36914q61358K91290O12411M52652
2217.1H14404144J182862O49109j485215r28116M75998L54691L71475l29666J28632
2225.8H14823914J77002n59235L61938O6071n19409J58539Q73336j9455m01687O93893
2235.4H15654907k79922q74253m64553K22015P02515J56707M78363k40097l61709M8218
2245.1H15042191q07267l30581j07193K68631M48379n42984j49002L90091K45285K39258
$$ plain form
2254.7 814696808 814917908 815139618 815413055 814767990 813535385 814389420 815975723 815664368 814922256
2263.4 814922256 814627762 814166870 814010239 814463882 815275726 815855865 815128098 814723434 815510406 815598450
2273 815598450 815119553 814174042 814204865 815463409 815283051 814818497 814748840 814225769 813758163 814036331
2282.7 814036331 815145264 815665283 815321732 814744263 814237747 813890381 814197388 814974747 815057220 814942322
2292.3 814942322 815061951 816077118 816445923 814969559 814318314 814361496 814487305 814179382 813942413
2301 813942413 814722214 814585800 814527130 815292206 815195999 814538040 814507828 813622513 812007065 812755356
2310.7 812755356 813277664 812587280 812711563 812586212 811994476 812088165 813811417 815041504 815004272 815480728
2320.3 815480728 816423645 816159973 814247513 813218765 813207397 814794540 816011429 814205170 813095856
$$ packed form
2254.7H14696808K21100K21710K73437o45065j232605Q54035J586303l11355p42112
2263.4H14922256k94494m60892j56631M53643Q11844N80139p27767m04664P86972Q8044
2273H15598450m78897r45511L0823J258544j80358m64554o9657n23071m67606K78168
2282.7H14036331J108933N20019l43551n77469n06516l47366L07007P77359Q2473j14898
2292.3H14942322J19629J015167L68805j476364o51245M3182J25809l07923k36969
2301H13942413P79801j36414n8670P65076r6207o57959l0212q85315j615448P48291
2310.7H12755356N22308o90384J24283j25351n91736R3689J723252J230087l7232M76456
2320.3H15480728R42917k63672j912460j028748j1368J587143J216889j806259j109314
$$ plain form
2329 813095856 813551712 814101257 813551407 812801437 813865128 815383301 815279617 814460373 813377457
2337.7 813377457 810931320 811308746 812602234 812189636 812077637 810813217 810919037 810291977 808779602
2346.3 808779602 809318085 811282730 813305740 813530045 813415146 812683716 811188431 811552887 811558685
2355 811558685 814671707 816652679 813425980 810584412 808241806 811647186 817033310 813997116 806979294
2363.7 806979294 805621033 810268478 811850891 810759201 812366562 813194427 813666000 814258957 812701797
2372.4 812701797 811838074 811241760 810943909 812861710 814405670 813494034 812104568 813126373 814443817
2381.1 814443817 813702698 812555618 812306671 812759476 812631149 812452087 813058929 813959579 814474258
2389.7 814474258 814163818 813904572 813253326 813101883 814129410 814020004 813157806 812895889 813408890
$$ packed form
2329H13095856M55856N49545n49850p49970J063691J518173j03684q19244j082916
2337.7H13377457k446137L77426J293488m12598j11999j264420J05820o27060j512375
2346.3H08779602N38483J964645K023010K24305j14899p31430j495285L64456N798
2355H11558685L113022J980972l226699k841568k342606L405380N386124l036194p017822
2363.7H06979294j358261M647445J582413j091690J607361Q27865M71573N92957j557160
2372.4H12701797q63723n96314k97851J917801J543960r11636j389466J021805J317444
2381.1H14443817p41119j147080k48947M52805j28327j79062O06842R00650N14679
2389.7H14474258l10440k59246o51246j51443J027527j09406q62198k61917N13001
$$ plain form
2398.4 813408890 813982468 813662949 813080521 813358536 814078522 813925781 813655548 813507080 813305664 813771515
2408.1 813771515 813761520 813109436 812991409 813380127 813857574 813956299 813725128 813487930 813065643 812791748
2417.7 812791748 812764587 813011246 813695602 813556137 812527618 811732178 811887970 812730331 813303757 813406754
2427.3 813406754 812497635 811939316 812583771 813202820 813292999 812852478 813002167 812912903 812515259 812578049
2437 812578049 812067566 811610336 811718063 812580643 812956772 812542419 812821960 812910690 812386246 812013779
2446.6 812013779 812187119 811638565 811177597 811953278 812213364 812137451 811633453 811523361 811667175 810813293
2456.3 810813293 810960464 811471252 811524353 811957474 812056961 811774597 811505890 810974350 810489426 811030197
2465.9 811030197 811985779 812261276 812061234 811955032 811744003 811513138 811279297 811278687 812499771 813017807
$$ packed form
2398.4H13408890N73578l19519n82428K78015P19986j52741k70233j48468k01416M65851
2408.1H13771515r995o52084j18027L88718M77447R8725k31171k37198m22287k73895
2417.7H12791748k7161K46659O84356j39465j028519p95440J55792Q42361N73426J02997
2427.3H13406754r09119n58319O44455O19049R0179m40521J49689q9264l97644O2790
2437H12578049n10483m57230J07727Q62580L76129m14353K79541Q8730n24444l72467
2446.6H12013779J73340n48554m60968P75681K60086p5913n03998j10092J43814q53882
2456.3H10813293J47171N10788N3101M33121R9487k82364k68707n31540m84924N40771
2465.9H11030197R55582K75497k00042j06202k11029k30865k33841o10J221084N18036
$$ plain form
2475.6 813017807 812731552 812504578 811798706 812510300 812865143 812229080 812353210 811930313 811293259 810388184
2485.2 810388184 810134125 810883179 810551910 810397491 810694351 810425415 810657196 811492844 811378555 810089569
2494.8 810089569 809775772 810410233 810394058 809747467 809266281 809546509 809718857 810262909 811408234 811250916
2504.5 811250916 810662994 810923309 811578217 811737442 810889435 810138245 810337219 810835419 810392303 809657898
2514.1 809657898 809574814 810120087 810879364 810486298 810166168 810647430 810564728 810236511 809941788 810129700
2523.8 810129700 810300827 809807739 809673920 809752579 810046616 810530548 810462112 809824982 808734818 808778610
2533.4 808778610 809606705 809206924 809226379 809849930 809935074 809757233 809201736 809487152 810310745 809950485
2543.1 809950485 809155807 809409866 809763489 809301224 809342880 809557037 809655533 810143433 810639114 810768661
$$ packed form
2475.6H13017807k86255k26974p05872P11594L54843o36063J24130m22897o37054r05075
2485.2H10388184k54059P49054l31269j54419K96860k68936K31781Q35648j14289j288986
2494.8H10089569l13797O34461j6175o46591m81186K80228J72348N44052J145325j57318
2504.5H11250916n87922K60315O54908J59225q48007p51190J98974M98200m43116p34405
2514.1H09657898q3084N45273P59277l93066l20130M81262q2702l28217k94723J87912
2523.8H10129700J71127m93088j33819P8659K94037M83932o8436o37130j090164M3792
2533.4H08778610Q28095l99781J9455O23551Q5144j77841n55497K85416Q23593l60260
2543.1H09950485p94678K54059L53623m62265M1656K14157R8496M87900M95681J29547
$$ plain form
2552.7 810768661 810079651 809675064 809891891 809610977 808778610 808097839 807989731 808387604 809267807 809385910
2562.4 809385910 808618622 808373032 808291855 808432541 809293823 809648132 809036179 808204346 807651367 808198471
2572 808198471 809164429 809454269 809327164 809084015 809042358 809045944 809009476 808643036 808617630 809051361 808542557
2582.6 808542557 807971115 807286148 806416626 807028046 808262711 808572769 808453369 808214111 807668686
2591.3 807668686 807925186 808478775 808300629 808018036 807982559 808251419 808449554 808245926 807333679 806843796
2600.9 806843796 807434692 807736893 806955338 805888214 806405869 807466354 808377228 809092178 808406448
2609.6 808406448 807797699 807548676 807204361 806837616 806654282 807096024 807084427 806357651 805957260 806571503
2619.3 806571503 806911392 806876068 806836014 806436920 807053070 807595520 807360611 807088852 806779327 806645889
$$ packed form
2552.7H10768661o89010m04587K16827k80914q32367o80771j08108L97873Q80203J18103
2562.4H09385910p67288k45590q1177J40686Q61282L54309o11953q31833n52979N47104
2572H08198471R65958K89840j27105k43149m1657L586l6468l66440k5406M33731n08804
2582.6H08542557n71442o84967q69522O11420J234665L10058j19400k39258n45425
2591.3H07668686K56500N53589j78146k82593l5477K68860J98135k03628r12247m89883
2600.9H06843796N90896L02201p81555j067124N17655J060485R10874P14950o85730
2609.6H08406448o08749k49023l44315l66745j83334M41742j1597p26776m00391O14243
2619.3H06571503L39889l5324m0054l99094O16150N42450k34909k71759l09525j33438
$$ plain form
2628.9 806645889 806359024 806281509 805754013 805466766 806164627 806053467 805620346 805317993 805256424 806138382
2638.5 806138382 806579056 805636368 804844437 804825363 804509048 804547806 805142365 805878067 807002945 806744614
2648.2 806744614 805491791 805362244 805946503 806527634 806063843 805156479 805076904 804908600 804835052 805056458
2657.8 805056458 805271606 805469818 805173187 804983063 805194855 805747757 806254730 805302734 804118347
2666.5 804118347 804334869 804575119 804522476 804835281 805062332 805103531 805154343 804479141 803440781 804180679
2676.1 804180679 804995728 804398727 804836197 805548630 804736710 803945160 804794617 804936371 804043961 804260941
2685.8 804260941 803849335 803789978 804558792 804165649 803268890 802985992 804148102 804339828 803014297
2694.5 803014297 802249908 801698685 801919174 803072433 803528748 802874832 803008347 803524780 803115005
$$ packed form
2628.9H06645889k86865p7515n27496k87247O97861j11160m33121l02353o1569Q81958
2638.5H06138382M40674r42688p91931j9074l16315L8758N94559P35702J124878k58331
2648.2H06744614j252823j29547N84259N81131m63791r07364p9575j68304p3548K21406
2657.8H05056458K15148J98212k96631j90124K11792N52902N06973r51996j184387
2666.5H04118347K16522K40250n2643L12805K27051M1199N0812o75202j038360P39898
2676.1H04180679Q15049n97001M37470P12433q11920p91550Q49457J41754q92410K16980
2685.8H04260941m11606n9357P68814l93143q96759k82898J162110J91726j325531
2694.5H03014297p64389n51223K20489J153259M56315o53916J33515N16433m09775
$$ plain form
2703.1 803115005 803004990 803156815 802976990 802858582 803318024 803160553 802013397 801975632 802861404 803014450
2712.8 803014450 802936935 803053436 802378387 802382278 802808762 801979370 801716003 802057953 802416687 803104935
2722.4 803104935 803726196 803861542 803598251 803250809 802065125 801285248 802092209 802838974 802618027
2731.1 802618027 801902542 801147232 801132126 802011108 802414322 801980362 801404266 801502609 802079010 802239685
2740.8 802239685 802211533 802105789 801728363 801613159 801900406 801101913 800498886 800860901 800428391 800085297
2750.4 800085297 799519119 799394302 799749451 799408035 799586945 799113617 799193268 800941315 801383972 800540161
2760 800540161 799986343 799584045 799292145 799344254 799717102 800480728 800336761 799332657 798632507 799086533
2769.7 799086533 800648880 800890121 800434647 799931488 799290314 799410400 799499817 799773102 799666748 799246826
$$ packed form
2703.1H03115005j10015J51825j79825j18408M59442j57471j147156l7765Q85772J53046
2712.8H03014450p7515J16501o75049L891M26484q29392k63367L41950L58734O88248
2722.4H03104935O21261J35346k63291l47442j185684p79877Q06961P46765k20947
2731.1H02618027p15485p55310j5106Q78982M03214m33960n76096R8343N76401J60675
2740.8H02239685k8152j05744l77426j15204K87247p98493o03027L62015m32510l43094
2750.4H00085297n66178j24817L55149l41416J78910m73328P9651J748047M42657q43811
2760H00540161n53818m02298k91900N2109L72848P63626j43967j004104p00150M54026
2769.7G99086533J562347K41241m55474n03159o41174J20086Q9417K73285j06354m19922
$$ plain form
2779.3 799246826 799527283 799902039 799475555 798769226 798748627 798785706 799118423 799408569 799556808 799457092
2789 799457092 798759689 798744431 798663483 798034744 797720261 798626556 799275665 798896484 799348831 798778610
2798.6 798778610 797462463 796992874 797210846 798040314 797814484 797334290 797397842 797324371 797582397 798207321
2808.3 798207321 797945175 797209778 797681580 797891159 797662888 797640381 796975403 796411362 796320038 796846695
2817.9 796846695 797097397 796752014 797194672 796775284 795285492 795015411 795332565 795868912 796616211
2826.6 796616211 796138840 795386429 795923767 795871124 794792404 794610825 794651489 794706726 794434052 793611526
2836.2 793611526 793867722 794517822 794793854 794028931 793060379 793349075 793314362 792471619 791617126 791784286
2845.9 791784286 792002335 791573486 790748978 789589920 789948120 790242920 790462799 790897675 790163651
$$ packed form
2779.3G99246826K80457L74756m26484p06329k0599L7079L32717K90146J48239r9716
2789G99457092o97403j5258q0948o28739l14483R06295O49109l79181M52347n70221
2798.6G98778610j316147m69589K17972Q29468k25830m80194O3552p3471K58026O24924
2808.3G98207321k62146p35397M71802K09579k28271k2507o64978n64041r1324N26657
2817.9G96846695K50702l45383M42658m19388j489792k70081L17154N36347P47299
2826.6G96616211m77371p52411N37338n2643j078720j81579M0664N5237k72674q22526
2836.2G93611526K56196O50100K76032p64923r68552K88696l4713q42743q54493J67160
2845.9G91784286K18049m28849q24508j159058L58200K94800K19879M34876p34024
$$ plain form
2854.6 790163651 790367279 790561218 789954681 789697495 789992752 789698792 788464127 788516541 788702850 788477478
2864.2 788477478 789094162 789631195 789463348 789264374 789032593 788162003 788055191 788279190 787843933 787872925
2873.8 787872925 788721466 789081955 788067398 788577042 789961624 789400101 788345032 787159348 786547394
2882.5 786547394 787270813 787717056 787681885 788141403 788128357 787481995 787448959 787033844 786765442 787128601
2892.2 787128601 786564865 786080856 786493378 786851654 786608276 785511475 784259109 785093155 786537170
2900.8 786537170 786029205 785813446 785283356 784197159 784741516 785137787 784403000 783708801 783950653
2909.5 783950653 784619064 785391235 785765457 785438309 785643768 785335388 784714813 784373856 783535919 781983566
2919.2 781983566 781126556 782206879 782278900 782454376 783400574 783407669 783225174 782187424 782129135 783219910
$$ packed form
2854.6G90163651K03628J93939o06537k57186K95257k93960j234665N2414J86309k25372
2864.2G88477478O16684N37033j67847j98974k31781q70590j06812K23999m35257K8992
2873.8G87872925Q48541L60489j014557N09644J384582n61523j055069j185684o11954
2882.5G86547394P23419M46243l5171M59518j3046o46362l3036m15115k68402L63159
2892.2G87128601n63736m84009M12522L58276k43378j096801j252366Q34046J444015
2900.8G86537170n07965k15759n30090j086197N44357L96271p34787o94199K41852
2909.5G83950653O68411P72171L74222l27148K05459l08380o20575l40957q37937j552353
2919.2G81983566q57010J080323P2021J75476R46198P095j82495j037750n8289J090775
$$ plain form
2928.8 783219910 784397125 784014435 782619553 783188705 782671204 781637192 781843109 782328491 782918777
2937.5 782918777 783312683 783921738 783198853 781950073 781672897 782880783 784618301 784953842 784742279
2946.2 784742279 784086227 783536911 782818756 783316422 784965820 784552689 784359818 784346924 783242187
2954.8 783242187 782623825 782849197 784111786 785057373 784548111 783726883 783783112 784236908 783998337 783070145
2964.5 783070145 782835846 782973633 783385315 784262314 783415375 782460175 783003616 783382568 783180313 783777008
2974.1 783777008 784962616 784754562 784474487 784162521 783574295 783690414 783960419 784640579 784528809
2982.8 784528809 783737869 784216080 785154495 784472122 783289185 783459396 784093781 784195404 784383774
2991.5 784383774 785974121 785792389 783682022 783921814 784819717 784357986 783444443 783209000 783300400
$$ packed form
2928.8G83219910J177215l82690j394882N69152n17501j034012K05917M85382N90286
2937.5G82918777L93906O09055p22885j248780k77176J207886J737518L35541k11563
2946.2G84742279o56052n49316p18155M97666J649398m13131j92871j2894j104737
2954.8G83242187o18362K25372J262589R45587n09262q21228N6229M53796k38571r28192
2964.5G83070145k34299J37787M11682Q76999q46939r55200N43441L78952k02255N96695
2974.1G83777008J185608k08054k80075l11966n88226J16119K70005O80160j11770
2982.8G84528809p90940M78211R38415o82373j182937J70211O34385J01623J88370
2991.5G84383774J590347j81732k110367K39792Q97903m61731r13543k35443R1400
$$ plain form
3000.2 783300400 783621521 783639145 783196869 784073868 784167252 783232346 782897873 782515869 782095490 781935349
3009.8 781935349 782396240 782534180 782610168 783265610 783675385 783264847 782643433 782411804 782147598 782196121
3019.5 782196121 782082977 782170334 782472992 781923599 781100235 780860825 780817413 780230103 780196228 780628204
3029.1 780628204 781829071 782067795 780105515 780151291 781094666 781090012 780025940 778817062 779515152
3037.8 779515152 779963303 779195938 778168335 778658600 780385361 780119476 778395462 777844009 778292694
3046.5 778292694 778534470 778586578 777922211 777474213 777639999 777396622 776943436 777311325 778211899 777232361
3056.1 777232361 776039581 775783691 775585480 775267334 773791580 773603287 774727859 775030060 775561066
3064.8 775561066 776667252 776400986 775443878 775576477 774935150 774431839 774497910 774463425 774496231 773252563
$$ packed form
3000.2G83300400L21121J7624m42276Q76999R3384r34906l34473l82004m20379j60141
3009.8G81935349M60891J37940P5988O55442M09775m10538o21414k31629k64206M8523
3019.5G82196121j13144Q7357L02658n49393q23364k39410m3412n87310l3875M31976
3029.1G80628204J200867K38724j962280M5776R43375m654j064072j208878O98090
3037.8G79515152M48151p67365j027603M90265J726761k65885j724014n51453M48685
3046.5G78292694K41776N2108o64367m47998J65786k43377m53186L67889R00574r79538
3056.1G77232361j192780k55890j98211l18146j475754j88293J124572L02201N31006
3064.8G75561066J106186k66266r57108J32599o41327n03311O6071l4485L2806j243668
$$ plain form
3074.4 773252563 772321777 773015060 774620972 774821091 773545837 773478546 773553391 772980652 772928848 773457031
3084.1 773457031 773480759 772804337 772326736 772307129 771227798 769927521 770694809 770980453 770608902 770663300
3093.7 770663300 770119553 769726944 769553299 770248947 771187515 770415955 768589172 767662354 767862396
3102.4 767862396 767952042 767597122 767511520 768017960 768183441 768254929 768344955 767832565 766929779 766517715
3112 766517715 766901474 767009964 767206573 766693573 766061478 766519318 766255035 765606155 764900284 764454193
3121.7 764454193 764227905 763811493 763280411 763073196 764493637 764517136 763365555 763433762 762401352
3130.4 762401352 761556244 761839218 761273956 760872498 760660324 760243759 760589523 760841370 761281128 761237488
3140 761237488 759878769 758674622 757201385 756656570 757171631 757212219 757613068 758026581 757776260 757503357
$$ packed form
3074.4G73252563r30786O93283J605912K00119j275254o7291P4845n72739n1804N28183
3084.1G73457031K3728o76422m77601j9607j079331j300277P67288K85644l71551N4398
3093.7G70663300n43747l92609j73645O95648R38568p71560j826783r26818K00042
3102.4G67862396Q9646l54920q5602N06440J65481P1488R0026n12390r02786m12064
3112G66517715L83759J08490J96609n13000o32095M57840k64283o48880p05871m46091
3121.7G64454193k26288m16412n31082k07215J420441K3499j151581O8207j032410
3130.4G62401352q45108K82974n65262m01458k12174m16565L45764K51847M39758m3640
3140G61237488j358719j204147j473237n44815N15061M0588M00849M13513k50321k72903
$$ plain form
3149.6 757503357 757248459 756346359 755777283 755290146 754784393 754738388 753516693 752669373 753057861 753319931
3159.3 753319931 753396606 753428040 753343124 752752686 751865311 750570450 749802780 749924011 749829407 749272079
3168.9 749272079 748631363 748284073 748368301 748759995 748282013 747764359 747528305 746988449 746018143 744394836
3178.6 744394836 744414368 744948807 744664993 744403687 744359055 743388290 741385193 741307220 741381226 741088333
3188.2 741088333 740532303 740124207 741045532 739446716 737996063 738184433 737510223 736841736 736334534
3196.9 736334534 735891342 735065460 735213623 734684143 733302460 732944565 732955627 733172607 731690445
3205.6 731690445 730971985 731160965 730992889 731873474 730760422 729465714 729379807 729139786 728895950
3214.3 728895950 727614288 726397934 725822144 726025925 725804596 724332275 723711090 723470688 722751465
$$ packed form
3149.6G57503357k54898r02100n69076m87137n05753m6005j221695q47320L88488K62070
3159.3G53319931P6675L1434q4916n90438q87375j294861p67670J21231r4604n57328
3168.9G49272079o40716l47290Q4228L91694m77982n17654k36054n39856r70306j623307
3178.6G44394836J9532N34439k83814k61306m4632r70765k003097p7973P4006k92893
3188.2G41088333n56030m08096R21325j598816j450653J88370o74210o68487n07202
3196.9G36334534m43192q25882J48163n29480j381683l57895J1062K16980j482162
3205.6G31690445p18460J88980j68076Q80585j113052j294708q5907k40021k43836
3214.3G28895950j281662j216354n75790K03781k21329j472321o21185k40402p19223
$$ plain form
3222.9 722751465 722318878 721932831 721315308 721532288 722048798 721367340 720337296 719789505 719553070
3231.6 719553070 718813705 717553101 716800308 716639175 716490707 715732880 715375214 715126724 714385529
3240.3 714385529 714884872 714839554 713498001 713055725 712477493 711272049 710765152 710740204 710445786 710069962
3249.9 710069962 709186096 708270035 708079300 707385941 707222672 707637253 706779099 705980301 706466370 706604080
3259.6 706604080 705539093 704595032 704334030 704189758 702985077 701762695 701319733 700573044 700702896
3268.3 700702896 700456543 699572906 699781418 699798584 699688492 699475327 698851242 698615952 698692017 697825623
3277.9 697825623 696298599 695937119 696105881 696127090 695510712 693488312 692375488 692817154 692486801
3286.6 692486801 691931534 692507935 693013763 692276993 690408936 688685760 688368607 688311157 687053833
$$ packed form
3222.9G22751465m32587l86047o17523K16980N16510o81458j030044n47791k36435
3231.6G19553070p39365j260604p52793j61133j48468p57827l57666k48490p41195
3240.3G14385529M99343m5318j341553m42276n78232j205444n06897k4948k94418l75824
3249.9G10069962q83866r16061j90735o93359j63269M14581q58154p98798M86069J37710
3259.6G06604080j064987r44061k61002j44272j204681j222382m42962p46689J29852
3268.3G00702896k46353q83637K08512J7166j10092k13165o24085k35290P6065q66394
3277.9F97825623j527024l61480J68762K1209o16378k022400j112824M41666l30353
3286.6F92486801n55267N76401N05828p36770j868057j723176l17153n7450j257324
$$ plain form
3295.3 687053833 686490021 686825104 686429367 685707855 684225388 683716888 683881760 682684479 682075958
3303.9 682075958 681766663 681123123 680402985 679451370 678492661 677966537 677763519 676815491 676290131 675841370
3313.6 675841370 674687881 673447113 671509628 670225296 670146332 669045334 667714691 668112717 667633514
3322.3 667633514 665923996 665222015 664960175 664545593 663533096 661907730 659900360 658739319 658161926
3330.9 658161926 656832886 655769958 655508041 655528870 654218292 652551193 651221313 649388199 648812637
3339.6 648812637 649495239 649274063 647008591 644237289 642293472 641678085 640970154 639290390 638246460
3348.3 638246460 636543617 635358047 634886436 633543968 632311363 631119766 630209427 628806419 627326088
3357 627326088 625593948 623937874 623381157 622291718 621244202 620232697 619437523 618792152 617524033
$$ packed form
3295.3F87053833n63812L35083l95737p21512j482467n08500J64872j197281o08521
3303.9F82075958l09295o43540p20138r51615r58709n26124k03018r48028n25360m48761
3313.6F75841370j153489j240768j937485j284332p8964j100998j330643L98026m79203
3322.3F67633514j709518p01981k61840m14582j012497j625366k007370j161041n77393
3330.9F58161926j329040j062928k61917K0829j310578j667099j329880j833114n75562
3339.6F48812637O82602k21176k265472k771302j943817o15387p07931j679764j043930
3348.3F38246460j702843j185570m71611j342468j232605j191597r10339j403008j480331
3357F27326088j732140j656074n56717j089439j047516j011505p95174o45371j268119
$$ plain form
3365.7 617524033 616487694 614935722 612971153 611674271 609918327 607907104 607265129 605626945
3373.4 605626945 604229660 604554749 603593178 602250481 600454559 598993530 598129044 597031136 596483040
3382.1 596483040 595442772 594267273 592867508 592258415 592062225 590815048 589108047 587722702 587498093
3390.7 587498093 586837044 585992928 585004005 584107513 583208237 581848030 581569099 580594673 579517899
3399.4 579517899 578629341 577884178 577510414 576562881 576146278 575363960 574851456 574152145 573358078 573227119
3409.1 573227119 572777214 572134361 570788383 570415649 569434662 568171310 568478127 567981186 567061615
3417.7 567061615 566547241 566990967 566419716 565100403 564870491 564417343 564053802 563250732 563240891 563784142
3427.4 563784142 562574081 561049271 560908508 561645279 562035484 561166458 560036850 560242462 560062408
$$ packed form
3365.7F17524033j036339j551972j964569j296882j755944k011223o41975j638184
3373.4F05626945j397285L25089r61571j342697j795922j461029q64486j097908n48096
3382.1E96483040j040268j175499j399765o09093j96190j247177j707001j385345k24609
3390.7E87498093o61049q44116r88923q96492q99276j360207k78931r74426j076774
3399.4E79517899q88558p45163l73764r47533m16603p82318n12504o99311p94067j30959
3409.1E73227119m49905o42853j345978l72734r80987j263352L06817m96941r19571
3417.7E67061615n14374M43726n71251j319313k29912m53148l63541q03070r841N43251
3427.4E63784142j210061j524810j40763P36771L90205q69026j129608K05612j80054
$$ plain form
3436.1 560062408 560019112 561127739 561747475 561371231 560715599 560648880 560076828 559915733 560060539 560555954
3445.7 560555954 560744209 559128571 560616608 563114510 563520012 563085365 563014221 562851677 561518669
3454.4 561518669 561560059 562486458 562820168 562729530 563463249 564612274 564334564 564649696 564702797 564750023
3464 564750023 565426674 566159706 566643257 566227798 567342339 567685127 567070732 567907791 568064957 567674713
3473.7 567674713 567786636 568384895 568778610 569545288 570620384 570699310 570490570 570879669 571799660 572289734
3483.3 572289734 572816010 573520393 573906403 575262794 576199722 575340080 575392380 575549088 575292130 576367455
3493 576367455 577424660 578063507 578605614 578980255 579124680 579305763 580074768 580943146 581952095 582126961
3502.6 582126961 582651749 583603210 582897186 583041534 585181923 586485405 585583000 586101303 587225342
$$ packed form
3436.1E60062408m3296J108627O19736l76244o55632o6719n72052j61095J44806M95415
3445.7E60555954J88255j615638J488037K497902M05502m34647p1144j62544j333008
3454.4E61518669M1390R26399L33710r0638P33719J149025k77710L15132N3101M7226
3464E64750023O76651P33032M83551m15459J114541L42788o14395Q37059J57166l90244
3473.7E67674713J11923N98259L93715P66678J075096P8926k08740L89099R19991M90074
3483.3E72289734N26276P04383L86010J356391R36928q59642N2300J56708k56958J075325
3493E76367455J057205O38847N42107L74641J44425J81083P69005Q68378J008949J74866
3502.6E82126961N24788R51461p06024J44348K140389J303482r02405N18303J124039
$$ plain form
3511.3 587225342 587439842 588241806 588834877 589385185 588884201 588509140 589699097 591172867 591617088
3520 591617088 591406517 593010368 593889008 593450279 593563423 593597908 594145241 594331245 595396004 596906319
3529.6 596906319 598116341 598573227 598558655 599597397 599463539 599247665 599570656 598550224 598777695
3538.3 598777695 600029259 600662994 602092590 602649841 601495247 602292290 602890396 603562965 605302505
3547 605302505 604108162 603773193 605233955 606936264 607914009 607625504 608455391 608237877 607937393
3555.6 607937393 609312553 609998245 610564728 611368294 611227264 611023445 612146797 613050041 613758278
3564.3 613758278 616088982 616041794 614778900 614867935 614936867 617545090 619104614 620057907 621044617
3573 621044617 621184196 621982651 622661476 623132019 622374840 622736397 624266663 625406456 626462479
$$ packed form
3511.3E87225342K14500Q01964N93071N50308n00984l75061J189957J473770M44221
3520E91617088k10571J603851Q78640m38729J13144L4485N47333J86004J064759J510315
3529.6E96906319J210022M56886j4572J038742j33858k15874L22991j020432K27471
3538.3E98777695J251564O33735J429596N57251j154594P97043N98106O72569J739540
3547F05302505j194343l34969J460762J702309R77745k88505Q29887k17514l00484
3555.6F07937393J375160O85692N66483Q03566j41030k03819J123352R03244P08237
3564.3F13758278K330704m7188j262894Q9035O8932K608223J559524R53293R86710
3573F21044617J39579P98455O78825M70543p57179L61557J530266J139793J056023
$$ plain form
3581.7 626462479 627095604 627429085 627304459 630639725 631610985 628047218 630469360 630524216 632057419
3590.4 632057419 633850555 635491409 636817665 636967735 638373528 636303787 638092537 639650612
3598.1 639650612 638622856 641077881 641080933 640151825 641121750 642454681 643183975 644566650 644510269
3606.8 644510269 642430038 645185471 644059906 642660980 646906586 648072815 644035492 643673477
3614.5 643673477 643001938 645431595 648472290 645702286 643170700 639777870 640043182 640635452 640117187
3623.1 640117187 639764214 637826271 637164688 634538231 634043846 626311569 612739410 613460045 610807266
3631.8 610807266 610298080 604881783 596518250 592489395 589662857 586228981 581014061 577837296
3639.5 577837296 574367027 573356133 571418457 569237747 570208168 572298355 574770126 572306480
$$ packed form
3581.7F26462479O33125L33481j24626L335266R71260l563767K422142N4856J533203
3590.4F32057419J793136J640854J326256J50070J405793k069741J788750J558075
3598.1F39650612j027756K455025L052r29108R69925J332931P29294J382675n6381
3606.8F44510269k080231K755433j125565j398926M245606J166229m037323l62015
3614.5F43673477o71539K429657L040695k770004k531586l392830K65312N92270n18265
3623.1F40117187l52973j937943o61583k626457m94385p732277j3572159P20635k652779
3631.8F10807266n09186n416297q363533m028855k826538l433876n214920l176765
3639.5E77837296l470269j010894j937676k180710R70421K090187K471771k463646
$$ plain form
3647.3 572306480 572123604 573289261 575605965 576475220 579516754 584299088 586753502 590360069 591763115
3655.9 591763115 588676376 590652847 593251114 592090225 590217972 590065575 589437675 587711182 583168793
3664.6 583168793 580680695 578538628 576264915 572081261 562179794 555545921 537877274 532240753
3672.3 532240753 529545479 524293823 510378532 475201530 472164116 465491714 457277184 444319801
3680 444319801 437040901 434151459 427317848 424214096 420319252 418306351 416850128 417619324 415619164
3688.7 415619164 409699478 413608246 409675598 414356918 422189522 432972908 447527695 464362068
3696.4 464362068 483518753 498750076 512318840 521111412 527238464 534456711 547768784 568257370
3704.1 568257370 589064636 610106544 629389420 642904968 656078644 663058701 673221970
$$ packed form
3647.3E72306480j82876J165657K316704Q69255L041534M782334K454414L606567J403046
3655.9E91763115l086739J976471K598267j160889j872253j52397o27900j726493m542389
3664.6E83168793k488098k142067k273713m183654r901467o633873j7668647n636521
3672.3E32240753k695274n251656j3915291l5177002l037414o672402q214530j2957383
3680D44319801p278900k889442o833611l103752l894844k012901j456223P69196k000160
3688.7D15619164n919686L908768l932648M681320P832604J0783386J4554787J6834373
3696.4D64362068J9156685J5231323J3568764Q792572O127052P218247J3312073K0488586
3704.1E68257370K0807266K1041908J9282876J3515548J3173676O980057J0163269
$$ plain form
3710.9 673221970 682058258 680268097 688558426 694867172 698426971 699207840 703678207 708651886
3718.6 708651886 708864365 711655350 715193558 714850388 713918533 719702759 720669632 720815811 722284164
3727.3 722284164 723026810 727027893 728224869 733731232 732397003 728267288 735218964 731681366
3735 731681366 727389984 728477173 732629700 733827972 736495972 740311356 736377029 739402847 749994049
3743.7 749994049 744486465 729960175 738920898 741506958 743772888 742788773 732140274 740696640
3751.4 740696640 739481659 737591934 742370071 746425018 749652328 744763641 747358017 750709229
3759.1 750709229 742239914 741578979 746165619 747352753 747125320 749797287 748096619 745278702 746910858
3767.8 746910858 750976028 751400452 745323563 747751694 750300293 751394043 750775223 750009460 750340500
$$ packed form
3710.9F73221970Q836288j790161Q290329O308746L559799P80869M470367M973679
3718.6G08651886K12479K790985L538208l43170r31855N784226R66873J46179J468353
3727.3G22284164P42646M001083J196976N506363j334229m129715O951676l537598
3735G31681366m291382J087189M152527J198272K668000L815384l934327L025818J0591202
3743.7G49994049n507584j4526290Q960723K586060K265930r84115j0648499Q556366
3751.4G40696640j214981j889725M778137M054947L227310m888687K594376L351212
3759.1G50709229q469315o60935M586640J187134k27433K671967j700668k817917J632156
3767.8G46910858M065170M24424o076889K428131K548599J093750o18820p65763L31040
$$ plain form
3776.5 750340500 750729599 754372101 752701492 745890427 748732529 751306000 751519165 752397919 750715637
3785.2 750715637 751192780 753173141 752998734 753818207 753629913 753582687 753638916 753820267 754124298 755351562
3794.8 755351562 759027405 755067749 751357727 752309418 755285950 761537857 753200073 745786133
3802.5 745786133 750318680 753707199 756719208 758294220 752608109 750897903 753961945 753795319
3810.2 753795319 754724808 756910706 757275620 757550201 759504623 755894623 744852142 750292206 755791168
3818.9 755791168 759976578 759642868 741537704 746132355 753044739 755664291 757071991 756693954
3826.6 756693954 753835297 755326614 757418594 758993073 758942490 751295547 754529190 759925232 754934082
3835.3 754934082 753162155 756119080 750522308 750988541 761057053 756004639 753156509 758156052
$$ packed form
3776.5G50340500L89099L642502j670609o811065K842102K573471K13165Q78754j682282
3785.2G50715637M77143J980361j74407Q19473j88294m7226N6229J81351L04031J227264
3794.8G55351562L675843l959656l710022R51691K976532O251907q337784p413940
3802.5G45786133M532547L388519L012009J575012n686111j710206L064042j66626
3810.2G53795319R29489K185898L64914K74581J954422l610000j1042481N440064N498962
3818.9G55791168M185410l33710j8105164M594651O912384K619552J407700l78037
3826.6G56693954k858657J491317K091980J574479n0583p646943L233643N396042m991150
3835.3G54934082j771927K956925n596772M66233J0068512n052414k848130M999543
$$ plain form
3843 758156052 755411453 753341599 755247879 756423111 756664810 758214417 757645950 758287888 760235367
3851.7 760235367 749744568 752144470 744592590 747674255 756105270 754625854 753332596 754782486
3859.4 754782486 756987228 759064713 755101089 754377747 759508209 756898880 752327805 756377869
3867.1 756377869 760504761 764194489 755999222 748206940 752105103 757174225 759619370 750755768
3874.8 750755768 752276840 756371384 756829300 758481750 761220627 755381775 748977585 755358582
3882.6 755358582 757068558 757560272 758469849 746713791 750640335 755121307 756374283 759776382
3890.3 759776382 759146957 752379990 753456268 756838150 755907669 756527710 757386398 760068588 760223694
3898.9 760223694 750671616 755606537 757108917 753192368 757506256 754424591 752294769 753523712
$$ packed form
3843G58156052k744599k069854J906280J175232K41699J549607n68467O41938J947479
3851.7G60235367j0490799K399902p551880L081665Q431015j479416j293258J449890
3859.4G54782486K204742K077485l963624p23342N130462k609329m571075M050064
3867.1G56377869M126892L689728q195267p792282L898163N069122K445145q863602
3874.8G50755768J521072M094544M57916J652450K738877n838852o404190O380997
3882.6G55358582J709976M91714R09577j1756058L926544M480972J252976L402099
3890.3G59776382o29425o766967J076278L381882r30481O20041Q58688K682190J55106
3898.9G60223694r552078M934921J502380l916549M313888l081665k129822J228943
$$ plain form
3906.7 753523712 755342407 756236343 754867325 756046448 756064758 754519882 754112396 753667755 755606155
3915.3 755606155 757855759 754487610 752018433 755315781 755784378 753168716 755413742 757589569
3923.1 757589569 758032455 755593796 753340683 755482254 756761246 757446594 756075211 754911499 756631012
3931.7 756631012 755059891 753820114 754376755 754794464 755928574 756976166 756933517 756539993 756662598
3940.4 756662598 757077713 756591415 754034042 755526810 757120972 756830444 757312775 755212173 755840454
3949.1 755840454 756310120 754126434 755364990 755433960 754591064 754879303 755799561 756783676 756347580
3957.8 756347580 756228638 756115265 755728989 754910889 753739243 754050293 754028473 754245377 755468063
3966.5 755468063 755175323 755470352 756007843 755486832 755364151 754554062 754308929 753938065 754019394 754620514
$$ packed form
3906.7G53523712J818695Q93936j369018J179123J8310j544876m07486m44641J938400
3915.3G55606155K249604l368149k469177L297348M68597k615662K245026K175827
3923.1G57589569M42886k438659k253113K141571J278992O85348j371383j163712J719513
3931.7G56631012j571121j239777N56641M17709J134110J047592m2649l93524J22605
3940.4G56662598M15115m86298k557373J492768J594162k90528M82331k100602O28281
3949.1G55840454M69666k183686J238556O8970q42896K88239R20258R84115m36096
3957.8G56347580j18942j13373l86276q18100j171646L11050k1820K16904J222686
3966.5G55468063k92740K95029N37491n21011j22681q10089k45133l70864Q1329O01120
$$ plain form
3976.1 754620514 754409790 754600143 753641129 754004364 754878845 754879150 755669785 755336914 755948029 756614761
3985.7 756614761 755726089 754866638 754472351 754482956 754531631 755214920 755280533 754572067 754353485 755071945
3995.4 755071945 755519562 755063324 754762421 754853516 755547867
4000.2 755547867
$$ packed form
3976.1G54620514k10724J90353r59014L63235Q74481L05P90635l32871O11115O66732
3985.7G56614761q88672q59451l94287J0605M8675O83289O5613p08466k18582P18460
3995.4G55071945M47617m56238l00903R1095O94351
4000.2G55547867
##END=$$ End of the data block
