##TITLE=Cris_Sarita_Vick 04 $$ Begin of the data block
##JCAMP-DX=5.00 $$ ACD/SpecManager v 10.08
##SPECTROMETER/DATA SYSTEM=Alpha
##DATE=24 Sep 2014 08:19:16
##DATA TYPE=INFRARED SPECTRUM
##DATA CLASS=XYDATA
##ORIGIN=
##OWNER=
##NPOINTS=1765
##FIRSTX=399.76428223
##LASTX=3997.64306641
##MAXX=3997.64306641
##MINX=399.76428223
##MAXY=0.87945086
##MINY=0.28295055
##XFACTOR=1.0000000000
##YFACTOR=1.000000000000000e-9
##FIRSTY=0.78641081
##DELTAX=2.03961372
##XUNITS=1/CM
##YUNITS=ARBITRARY UNITS
##XYDATA=(X++(Y..Y))
399.8G86410809R69946N023658L385127j012743j634597J751363K563894r27866l696024
418.1G92833567j256645J975655M9770l735125l504455K20120J441717j716852l858149
436.5G82449603j310229J672745O25848k653241k984047K22624J773178j106679l947497
454.8G74742305k209604J394451Q30591k771378l862261j057744J215338q80301m245937
473.2G63155460l365159N7519N49733k605080m771948k984464p36654k400219o185890
491.5G40713298p474065o556868q391082j4806569j9741595j2389600O099164J7551423
507.9F95004106J1305630P20560N91517N743205N537272J335859n2273J667440K176344
526.2G24029660l03685k453983j348257R51826M49717k256632k981066o80268J028597
$$ y = [786410809, 787380755, 792404413, 795789540, 794776797, 793142200, 794893563, 797457457, 796529591, 792833567, 791576922, 793552577, 793602347, 789867222, 786362767, 786582887, 788024604, 786307752, 782449603, 781139374, 782812119, 783437967, 780784726, 777800679, 778023303, 779796481, 778689802, 774742305, 772532701, 773927152, 774757743, 771986365, 768124104, 767066360, 768281698, 767401397, 763155460, 759790301, 759847820, 760397553, 757792473, 753020525, 750036061, 749299407, 746899188, 740713298, 733239233, 726682365, 718291283, 703484714, 683743119, 671353519, 677452683, 695004106, 706309736, 707030296, 707621813, 713365018, 718902290, 720238149, 720185876, 721853316, 724029660, 723725975, 721271992, 719923735, 720875561, 721325278, 719068646, 716087580, 715407312, 716435909]
544.6G16435909m05431k653718k071380N00738R92358j261592k655506r83894J240373
562.9G09137857P08163j643181j924396M40896J730740j2875k060890j244902J113176
581.3G06244588J470625n92053j763939k85864J519262P85351j468122j910388j11819
599.6G03887641Q21710j138389l655255l799081k666950l626585o053805m226923P634103
618F87176466K5045037L1661272K0901859O373644M54247n59807k839565o003738r161055
636.4G53048360j0060250r25184J1543751J1609078N632519L771127K522885R1434
652.7G77233720m29452J711190L114045J492142p54892q33512R03607K550840R41515
671G85929203o45637K68459K117574J747012o44445j625240q4341P45774j779259o026864
$$ y = [716435909, 716030478, 713376760, 711305380, 711806118, 712798476, 711536884, 708881378, 707897484, 709137857, 709846020, 708202839, 706278443, 706719339, 708450079, 708437204, 706376314, 705131412, 706244588, 707715213, 707123160, 705359221, 705073357, 706592619, 707377970, 705909848, 703999460, 703887641, 704709351, 703570962, 699915707, 696116626, 693449676, 689823091, 683769286, 679542363, 687176466, 712221503, 743882775, 764784634, 771158278, 771612525, 771052718, 768213153, 762209415, 753048360, 742988110, 742062926, 753606677, 765215755, 770848274, 774619401, 777142286, 777233720, 776804268, 778515458, 781629503, 783121645, 782366753, 781533241, 782436848, 784987688, 785929203, 785283566, 785552025, 787669599, 789416611, 788772166, 787146926, 787062585, 787808359, 786029100, 780002236]
691.4G80002236r727418j5480340k6202678k9332817p063091K6693583L9744496K8333128
707.7G86967099J2475967M421651L399790M057586K515972j62781m64141J613379K553939
726.1H17378461P53701j244783n50211J575232J693547n17488j820743l95715J303851
744.5H18175852L75569j994550k464652q93891o31571l524363p251918q518100r498596
762.8G83773780j7861605l7341296o0320676o5667748l2440007K6928484O7800641
777.1F64871573O6697240M3925286K4465143J2583852N497098K884090L327072L194213
793.4H27445567J098573n74947R0003J547873J159013q66533j865863q44300K6584
811.8H27215970n16057p47860N45800J752317R92775j426697l468931l909945l592491
$$ y = [780002236, 770274818, 754794478, 728591800, 699258983, 692195892, 718889475, 758633971, 786967099, 799443066, 803864717, 807264507, 811322093, 813838065, 813675284, 813211143, 814824522, 817378461, 818132162, 816887379, 816337168, 817912400, 819605947, 819088459, 817267716, 816872001, 818175852, 818551421, 816556871, 814092219, 813198328, 812566757, 809042394, 801790476, 793272376, 783773780, 765912175, 728570879, 668250203, 602582455, 570142448, 597070932, 664871573, 731568813, 775494099, 799959242, 812543094, 818040192, 820924282, 824251354, 827445567, 828544140, 827969193, 828059196, 829607069, 830766082, 829899549, 828033686, 827189386, 827215970, 826699913, 825952053, 826497853, 828250170, 829242945, 827816248, 824347317, 820437372, 816844881]
830.1H16844881l612459m875481q383870j5468181k8169393m2221725m1964710k1093666
846.4F51055396J0140597L9484263M9036741L4555912J7055512R153902O649196M398465
862.8H21529984J643539R6440j29461q42690k601564m012466m321992l893853k345383
881.1H05122554R60589M938245P371306O564438L229201K48730m41134M25220P23421
899.5H29142570k64227j204371q15630K12013K00689r12666j449883o37412K29835
917.8H24500918j87397j274705j357674l00229L00765m00185j283408j041650m5300
936.2H18911135K36690o54697j429379j038313k66075m96447j691401k469957j843155
954.5H09258401m37498p3373j422822k758384j796842R18687J842379L35336o12140
$$ y = [816844881, 813232422, 808356941, 799973071, 784504890, 756335497, 714113772, 672149062, 651055396, 661195993, 700680256, 749716997, 784272909, 801328421, 810482323, 817131519, 821529984, 823173523, 823269963, 823140502, 822297812, 819696248, 815683782, 811361790, 807467937, 805122554, 806083143, 811021388, 818392694, 824957132, 828186333, 828435063, 827993929, 828419149, 829142570, 828878343, 827673972, 826858342, 827070355, 827271044, 826358378, 824908495, 824271083, 824500918, 824313521, 823038816, 821681142, 821380913, 821681678, 821281493, 819998085, 818956435, 818911135, 819147825, 818493128, 817063749, 816025436, 815759361, 815262914, 813571513, 811101556, 809258401, 808820903, 808747530, 807324708, 804566324, 802769482, 803688169, 805530548, 805865884, 805253744]
972.9H05253744l15547l68535j249671j913786j537800q17657r22501j789570k254605
991.3G94084072j859426j534224k109647l116727l523647l169954l197491m887343
1007.6G70685613p746816r367585r135604r754240j2652815j6154289j7984569j5140235
1023.9F72749460l404856J5855849L0785143L1510294K1979153J1472225M337370R14634
1040.2G86199272J6749k81692j194298k247989k457679k026736k095819l053963l988624
1058.6G68869221m148483m092515m842817o322742p383585p375181o861448o462514
1074.9G21379936n770028l998279j341105Q43108J464605R36091K74599n11468k208352
1093.2G11069107n083680q511186j2018621j6277432k2380948k9728055l2701850k1556616
$$ y = [805253744, 804938197, 804569662, 803319991, 801406205, 799868405, 799050748, 798128247, 796338677, 794084072, 792224646, 790690422, 788580775, 785464048, 781940401, 778770447, 775572956, 770685613, 762938797, 753571212, 744435608, 734681368, 722028553, 705874264, 687889695, 672749460, 669344604, 685200453, 715985596, 747495890, 769475043, 780947268, 785284638, 786199272, 786216021, 785934329, 784740031, 782492042, 780034363, 778007627, 775911808, 772857845, 768869221, 764720738, 760628223, 755785406, 749462664, 742079079, 734703898, 727842450, 721379936, 715609908, 711611629, 710270524, 711113632, 712578237, 713514328, 713788927, 713277459, 711069107, 705985427, 697474241, 685455620, 669178188, 646797240, 617069185, 584367335, 562810719]
1109.6E62810719L030956K2309840K1400690N406499j3181150k5650204k5568843r292185
1125.9E41266322J6188085L4320593L6597788K9963196K3396253J8698931J4319420
1140.1G14750588R494722M789650J212478j150668l406226o529093r895504j1534333
1156.5F97731614j0817945j1053502j7043531l0352116m8336566o3556551o1852456
1170.7D54718947k9594898K8352767Q1876129J00036323Q1815720N0409436K5366605
1185G92981029J1241138M201293O2227k647162l731787l420830k739489k342701j908302
1203.4G91695416j111686o12438j192331k383769k863228k310932j885176k637267
1219.7G76698589m203915n546749o406724p482350r236157j1095882j2117862j1422038
$$ y = [562810719, 565841675, 588151515, 609552205, 614958704, 601777554, 576127350, 550558507, 541266322, 557454407, 591775000, 628372788, 658335984, 681732237, 700431168, 714750588, 724245310, 729034960, 730247438, 729096770, 725690544, 719161451, 709265947, 697731614, 686913669, 675860167, 658816636, 628464520, 580127954, 516571403, 454718947, 425124049, 453476816, 535352945, 635389268, 717204988, 767614424, 792981029, 804222167, 808423460, 808485687, 805838525, 802106738, 798685908, 795946419, 793603718, 791695416, 790583730, 789971292, 788778961, 786395192, 783531964, 781221032, 779335856, 776698589, 772494674, 766947925, 760541201, 753058851, 743822694, 732726812, 720608950, 709186912]
1236G09186912q341134l779650n20348l11733k533674n979657r803414j3275326j6111135
1254.4F48530841j8637777k1058499k2959769k3995996k5322914k8648078l4276098
1268.6D73631710m0503264m4022739m1850864l3695996k1855861q752436L955156J4531732
1285C01437438K4990141M1186064O0879827P1108401O3122898M2723179J9723594j642644
1301.3F23528898j6990245k5585651l9411902n3700567l0996203K7844578O6745370
1315.6E51434278O4518869M7332287L4044504K7093709K3061275J8798531J3963639
1329.8G80247092R528101N760014K278924q41737j915455M77255M319012O287515N473792
1348.2H11614513L465891J362205j595080o925821j5811444l0580997n0900519n9347808
$$ y = [709186912, 700845778, 697066128, 696545780, 696234047, 693700373, 687720716, 677917302, 664641976, 648530841, 629893064, 608834565, 585874796, 561878800, 536555886, 507907808, 473631710, 433128446, 389105707, 347254843, 313558847, 291702986, 282950550, 286905706, 301437438, 326427579, 367613643, 428493470, 499601871, 562724769, 605447948, 625171542, 623528898, 606538653, 580953002, 541541100, 487840533, 456844330, 484688908, 551434278, 615953147, 663285434, 697329938, 724423647, 747484922, 766283453, 780247092, 789775193, 795535207, 797814131, 796972394, 795056939, 795534194, 799853206, 806140721, 811614513, 815080404, 816442609, 814847529, 807921708, 792110264, 761529267, 710628748, 651280940]
1364.5F51280940l9916635l675997K6988923L8961172L7883699K9990077K0370901
1378.8G61883080J2576878P027745K422273l083586p868588p167578M48108J0836065
1395.1G77074397J4596164J1461019P280231M163205K347053J384377J090646J175403
1411.4H20572495R76801J28091r00328j297236j148879j956463l427208m991531p268608
1429.8H00687134r833693j3314724k2734285l3392012k9020488j0616958J3552904
1444.1F95327878K5892854J9195318R546280J0158002J2497366R580791M250884P85887
1460.4G87235260j578391m529357o641626q539915j5781820k7423858j7886579J6111850
1476.7G20965564L6407292K9647768J3001918K153159k177477m011631m678011m702151
$$ y = [651280940, 611364305, 607688308, 634677231, 673638403, 711522102, 741512179, 761883080, 774459958, 781487703, 783909976, 780826390, 772957802, 765790224, 766238332, 777074397, 791670561, 803131580, 810411811, 814575016, 816922069, 818306446, 819397092, 820572495, 821549296, 821677387, 820777059, 819479823, 818330944, 816374481, 812947273, 807955742, 800687134, 790853441, 777538717, 754804432, 721412420, 692391932, 681774974, 695327878, 721220732, 740416050, 749962330, 760120332, 772617698, 782198489, 786449373, 787235260, 785656869, 781127512, 774485886, 765945971, 750164151, 722740293, 704853714, 720965564, 757372856, 787020624, 800022542, 802175701, 799998224, 795986593, 791308582, 786606431]
1493G86606431n983353q504986j0081530j1081815j3043761k0335078l3195556l5849273
1509.3F48531079l8807809l9092362j1172950L8407087P0587516P4315488N0302625
1523.6G93070674K1880865P448375J25706l944277o111980n344212m960298o993115
1539.9G95171738p011652m916370l926873l194213k960384l161550l899097n096436
1556.2G61005163q459627j0709644q294225r921133j3468862j8282175k5266826k3200869
1572.6F43401802n458415J8444657J3812244r019732k2335053k7760207l1129778l4076571
1588.9E45878947l5666704l4910977l1506717k4414152j3603092J35780J6202181L2440543
1605.2D54555809M5292229N0284713M3787361K9028892J2801171k909363j2037575
$$ y = [786606431, 780623078, 772118092, 762036562, 750954747, 737910986, 717575908, 684380352, 648531079, 609723270, 570630908, 559457958, 597865045, 668452561, 742768049, 793070674, 814951539, 822399914, 822525620, 818581343, 812469363, 807125151, 802164853, 795171738, 788160086, 783243716, 779316843, 776122630, 773162246, 770000696, 766101599, 761005163, 752545536, 741835892, 733541667, 723620534, 710151672, 691869497, 666602671, 643401802, 637943387, 656388044, 670200288, 661180556, 638845503, 611085296, 579955518, 545878947, 510212243, 475301266, 443794549, 419380397, 405777305, 405913085, 422115266, 454555809, 499848038, 550132751, 593920112, 622949004, 635750175, 632840812, 620803237]
1619.5F20803237j5375137j7980814j8084228j8898905k0144939j7004609j0721982
1633.7E02592623J223386J7846167K8557360L3867180L4005463L4290314L2054365
1648F84436858K2753834J9210279J8051863P507920k61783n174518j1406183j6955137
1664.3G18163133k0275474k7639270l7102401m0234745m9539983n8143228m7848553
1678.6D37379479l3082038k0901680r218693M678429J8357932L0501455L4857959L7366152
1694.9D99938995L7536293L3024728L3434212K6898444K1556795K1050453J8477797
1709.2F91917717J6198040J4642059J3475716J3440252J2485504J0113358Q786202
1723.5G81058848P788181O409705N545199N072653N399823N463779M017711K942324
$$ y = [620803237, 605428100, 587447286, 569363058, 550464153, 530319214, 513314605, 502592623, 503816009, 521662176, 550219536, 584086716, 618092179, 652382493, 684436858, 707190692, 726400971, 744452834, 751960754, 751698971, 746524453, 735118270, 718163133, 697887659, 670248389, 633145988, 592911243, 543371260, 485228032, 437379479, 404297441, 383395761, 374177068, 378855497, 397213429, 427714884, 462572843, 499938995, 537475288, 570500016, 603934228, 630832672, 652389467, 673439920, 691917717, 708115757, 722757816, 736233532, 749673784, 762159288, 772272646, 781058848, 788847029, 795256734, 800801933, 805874586, 811274409, 816738188, 820755899, 823698223]
1739.8H23698223K516210K113104J988947K363265L168404L721177L065050K050996
1756.1H44685376J530528J295089J258493J502514J589954J708030J829982J865387
1772.4H57265353J800716J288831O12200K8670l44754k14994P76112J726032J873016
1790.8H64811182J806796J709282J385868J011073P69198O70076O45458N98014M91440
1809.2H73898387L67522K93791K16544J65284J22368j50561m89891l58999P3970K53320
1829.6H74391735M58359O46532P31587Q63850P12574J54674j78635K72035O42777M15921
1850H79111409O9320j2397J28626J53900m7148k40087k38121k27034k58446j14381
1870.3H78325641K9504K3127k8610k31743n25832o43015n64933n77211q35359r57311
$$ y = [823698223, 826214433, 828327537, 830316484, 832679749, 835848153, 839569330, 842634380, 844685376, 846215904, 847510993, 848769486, 850272000, 851861954, 853569984, 855399966, 857265353, 859066069, 860354900, 860967100, 860995770, 860651016, 860436022, 861212134, 862938166, 864811182, 866617978, 868327260, 869713128, 870724201, 871493399, 872163475, 872808933, 873406947, 873898387, 874265909, 874559700, 874776244, 874941528, 875063896, 874913335, 874423444, 874064445, 874138415, 874391735, 874850094, 875496626, 876228213, 877092063, 877804637, 877959311, 877780676, 878052711, 878695488, 879111409, 879180729, 879168332, 879296958, 879450858, 879403710, 879163623, 878925502, 878698468, 878440022, 878325641, 878355145, 878378272, 878349662, 878117919, 877592087, 876949072, 876384139, 875806928, 874971569, 874014258]
1890.7H74014258q27431p53463p66217q91626j058459j058817j024545j282155j844168
1909.1H64507377k605140l805518m665494k594292K382815N349457M748881L038764
1925.4H66356850J667261Q95798O17266N07593K62618j31667m46439m42445j05679
1943.8H69181156P9394j06335k16127n6803O9022p0452l40402m27306k81632k29657
1964.2H67600858m00245m35710j76608O5982r716m09484q07583r32693q76010q78930
1984.6H62739861r01103o71148j46509L71814M79520J98066q404J3589o6161l65674
2005H61643851n43595l75866j63079k88546o83427p99715k64287M53591O40214K60412
2025.4H59879553j46568k44259j14560N5372K17796M15682N44131M29511J49131K1517
$$ y = [874014258, 873186827, 872433364, 871667147, 870775521, 869717062, 868658245, 867633700, 866351545, 864507377, 861902237, 858096719, 853431225, 850836933, 853219748, 858569205, 863318086, 866356850, 868024111, 868919909, 869537175, 870044768, 870307386, 870175719, 869729280, 869286835, 869181156, 869260550, 869154215, 868938088, 868881285, 868950307, 868879855, 868539453, 868112147, 867830515, 867600858, 867200613, 866764903, 866588295, 866654277, 866644561, 866235077, 865427494, 864494801, 863618791, 862739861, 861838758, 861167610, 861021101, 861392915, 861872435, 862070501, 862062097, 862075686, 862009525, 861643851, 861100256, 860724390, 860561311, 860272765, 859589338, 858789623, 858525336, 858978927, 859619141, 859879553, 859732985, 859488726, 859374166, 859429538, 859647334, 860063016, 860607147, 861036658, 861185789, 861207306]
2045.8H61207306J54853K83957J60098q0645j31488R239O3479p5996k26498j74701
2066.2H61189604j311M589j82569l25143k56002j15156j35124k63989k55168r9718
2086.6H59560013l2008j55747l24368l32237k05993j67251l03209m18067l70443k97188
2106.9H56953502l67344n67078p07329o81281o00338n91755n78999m26889k23875k11537
2127.3H51997077m66585p76350q01444m32492Q3268M79162P09951Q56280R17614Q00192
2147.7H53366673N36263L44455L20673L22402K18212P0393J8835P4566J09255L3558
2168.1H55415285k3008P4446J99199J62840j5259j73270j88351r9540q1658j91152
2188.5H55079532k75970k09451j00016j29044k60949l25740k51651j51038j82211k78831
$$ y = [861207306, 861362159, 861646116, 861806214, 861725569, 861594081, 861603320, 861666799, 861590803, 861364305, 861189604, 861188293, 861192882, 861010313, 860685170, 860429168, 860314012, 860178888, 859914899, 859659731, 859560013, 859528005, 859372258, 859047890, 858715653, 858509660, 858342409, 858039200, 857621133, 857250690, 856953502, 856586158, 856019080, 855311751, 854630470, 854030132, 853438377, 852859378, 852432489, 852208614, 851997077, 851530492, 850754142, 849952698, 849520206, 849603474, 850082636, 850792587, 851648867, 852566481, 853366673, 853902936, 854247391, 854568064, 854890466, 855108678, 855179071, 855197906, 855272472, 855381727, 855415285, 855392277, 855466723, 855665922, 855828762, 855813503, 855640233, 855451882, 855352342, 855270684, 855079532, 854803562, 854594111, 854494095, 854365051, 854104102, 853778362, 853526711, 853375673, 853193462, 852914631]
2208.9H52914631k60114j21177K9028J15991J26540J08242Q2076j3292j35422j45614
2229.3H52700889m9174N186o4492j75119k25901k50936l58462n04732m74394k17974
2249.7H50384891P5042K42770K56896K09987J87278J47998L4690r2268j16944o8188
2270.1H51262152q4996j40071j13904m6790k1219o3718j63912k37227k45571k71142
2290.5H49873602l54707m13000l93331l49701l28302l27409l31103l19779l26932l64303
2310.9H46365035l58105l11911l48449m42743l99888j99854k7001r3401l08275k65002
2331.3H43610406L3557J67787J35124J17004Q7202J16050L88443O28710K96891m83513
2351.7H45097661j163959j357794j252115j019359o89149l42011j2696K47896M15563
$$ y = [852914631, 852654517, 852533340, 852562368, 852678359, 852804899, 852913141, 852995217, 852981925, 852846503, 852700889, 852651715, 852656901, 852592409, 852417290, 852191389, 851940453, 851581991, 851077259, 850602865, 850384891, 850459933, 850702703, 850959599, 851169586, 851356864, 851504862, 851539552, 851447284, 851330340, 851262152, 851177156, 851037085, 850923181, 850876391, 850855172, 850791454, 850627542, 850390315, 850144744, 849873602, 849518895, 849105895, 848712564, 848362863, 848034561, 847707152, 847376049, 847056270, 846729338, 846365035, 846006930, 845695019, 845346570, 844903827, 844503939, 844304085, 844277084, 844183683, 843875408, 843610406, 843643963, 843811750, 843946874, 844063878, 844151080, 844267130, 844655573, 845284283, 845581174, 845097661, 843933702, 842575908, 841323793, 840304434, 839615285, 839273274, 839260578, 839508474, 839924037]
2370.1H39924037N11408M77851L32772J89901O6936r9957k93434m14014l75568k42770
2390.4H40077162k03848l33846n27680o09338m92275k74479q7977N4837J83284K79427
2410.8H38065267L22461L28362L43680M00007M31895L91543L35693K62142J33037J5915
2431.2H41030002p2360j61469j67311j37388k26438l60132l89337k77341o5982J07229
2451.6H39279473J59383J83284K23458J92821P7426j5259n483M8995K9444p9572j91629
2474.1H39902341k38895k16723j95026k55287l65555m12941l56078k64943j93715j02162
2494.5H37301016J1563N2273R120m7207q6546q3685r4294k09570l48985l85285l52085
2516.9H35766315l70025m88162n98848m98593j31428K48432L21329J07288j27792k52366
$$ y = [839924037, 840435445, 840913296, 841246068, 841435969, 841502905, 841402948, 841109514, 840695500, 840319932, 840077162, 839873314, 839539468, 839011788, 838402450, 837910175, 837635696, 837547719, 837602556, 837785840, 838065267, 838387728, 838716090, 839059770, 839459777, 839891672, 840283215, 840618908, 840881050, 841014087, 841030002, 840957642, 840796173, 840628862, 840491474, 840265036, 839904904, 839515567, 839238226, 839172244, 839279473, 839438856, 839622140, 839845598, 840038419, 840115845, 840100586, 840095103, 840144098, 840173542, 840093970, 839902341, 839663446, 839446723, 839251697, 838996410, 838630855, 838217914, 837861836, 837596893, 837403178, 837301016, 837312579, 837364852, 837373972, 837326765, 837240219, 837156534, 837062240, 836852670, 836503685, 836118400, 835766315, 835396290, 834908128, 834309280, 833810687, 833679259, 833927691, 834249020, 834356308, 834228516, 833976150]
2537.3H33976150l28601m06682m15862l32057k69533k35438q0466K12192M64142N11467
2557.7H33095312L56555J88410J56224J48416K3782j49429k60055k94626l69310n91219
2578.1H32304060q44061r15110p73132n28753l02851j29163O3777K05517J13427j69396
2598.5H29024315m08232m79520m98712o09874p07984n69821k29359L1293J16169K51234
2618.9H25919509N54621P48813N44429Q8751l06725n38766o89567r00864j170755j298248
2639.3H22951198j129866q14915n99682m56333j99497J37687K61903K0623l94523p37369
2659.7H19039226r42350j091897j245797j298070j131594q03650m42624p8380L62933
2678H12367797Q58366J199186J274169J159668R48250P07269M19438M8577l03626m55498
$$ y = [833976150, 833647549, 833240867, 832825005, 832492948, 832223415, 831987977, 831907511, 832119703, 832583845, 833095312, 833451867, 833640277, 833796501, 833944917, 833968699, 833819270, 833559215, 833264589, 832895279, 832304060, 831459999, 830544889, 829771757, 829243004, 828940153, 828810990, 828874767, 829080284, 829193711, 829024315, 828616083, 828136563, 827637851, 827027977, 826319993, 825750172, 825520813, 825552106, 825668275, 825919509, 826474130, 827222943, 827767372, 827856123, 827549398, 827010632, 826321065, 825420201, 824249446, 822951198, 821821332, 821006417, 820406735, 819950402, 819750905, 819888592, 820150495, 820171118, 819776595, 819039226, 818096876, 817004979, 815759182, 814461112, 813329518, 812525868, 812083244, 812004864, 812367797, 813226163, 814425349, 815699518, 816859186, 817807436, 818514705, 818934143, 818982720, 818679094, 818223596]
2698.4H18223596l68774k18034j31250l278K84434N92887P04110O05821M88460N22256
2718.8H20700228O14047N52118L51250K15888K03610J61409k1934k77579m57883n04375
2739.2H21536779m95016m85361m10735k72751k27630l87371o42776p51496o86705o59406
2759.6H16517532p57516q68856q50738o35564k81453J12116M64857O71506P10487O22452
2780H15704823M15861J95265R0301j0371k73586n12540m65214k56121j82092l35634
2800.4H14370692n34117n97001n43236n11885o02663o47544m72725k44438j33813j00672
2820.8H09982598m828J81198K72095J43469r3997k84016l82424m89413p80881j102686
2841.2H07441115j085162q54969q10563r37343r32634p38740n49376m95851o74844
$$ y = [818223596, 817854822, 817636788, 817505538, 817502260, 817786694, 818379581, 819083691, 819689512, 820177972, 820700228, 821314275, 821866393, 822217643, 822433531, 822637141, 822798550, 822776616, 822499037, 822041154, 821536779, 821041763, 820556402, 820145667, 819872916, 819645286, 819257915, 818615139, 817863643, 817176938, 816517532, 815760016, 814891160, 814040422, 813404858, 813123405, 813235521, 813700378, 814371884, 815082371, 815704823, 816120684, 816315949, 816406250, 816395879, 816122293, 815609753, 815144539, 814888418, 814706326, 814370692, 813836575, 813239574, 812696338, 812184453, 811581790, 810934246, 810461521, 810217083, 810083270, 809982598, 809977770, 810158968, 810431063, 810574532, 810480535, 810196519, 809814095, 809324682, 808543801, 807441115, 806355953, 805500984, 804690421, 803753078, 802820444, 802081704, 801532328, 801036477, 800361633]
2859.5H00361633j087427j521230j832604k034128j893758j148105j92762L33012L09288
2877.9G91293919j4603m01974q57830j590967k735198m185497n671203o982267p707060
2896.3G61147320o226480o99401O830573J0938883R689451O193578L482163J923978
2912.6G93280065P26163m46379j483381k335310l003060l248215k758741j967192j664996
2930.9G77098954j807034k051413k468408k711713j658320O33001J863718N87702j869500
2949.3G67616987l752291m473686l767193j701593L21507P80643M97877J472294K910734
2967.6G59905279K202451q12292m511416p977486j0832429j2378216j1027932n340159
2984G09227800M017175J3734519J9019902J7599523J2522638Q111715N418360L578604
$$ y = [800361633, 799274206, 797752976, 795920372, 793886244, 791992486, 790844381, 790651619, 790984631, 791293919, 791279316, 790877342, 790019512, 788428545, 785693347, 781507850, 775836647, 768854380, 761147320, 754920840, 754221439, 761052012, 771990895, 781680346, 787873924, 791356087, 793280065, 794006228, 793559849, 792076468, 789741158, 786738098, 783489883, 780731142, 778763950, 777098954, 775291920, 773240507, 770772099, 768060386, 766402066, 767035067, 768898785, 769486487, 767616987, 763864696, 759391010, 755623817, 753922224, 754243731, 755024374, 755522251, 756994545, 759905279, 762107730, 761295438, 756784022, 748806536, 737974107, 725595891, 714567959, 709227800, 713244975, 726979494, 745999396, 763598919, 776121557, 784233272, 789651632, 793230236]
3000.3G93230236K218782J269937P20024O35743P63595O45161J84476l12209o08742
3018.6G98747003p05123p19130o24955k99096K5213m1962n03420j090229j600921k026081
3039G91161299k530813k849460j870513P11381K803505K493977Q76367k13444o47366
3057.4G89934933r20296j188039j460076j619517j548827j087487j67131Q16285J394689
3075.7G84154534J361370P96080J89245j13547k48671k93612l29197n13970o63579
3094.1G84338653n78940l65913k25484k40684k98261l17097m43280p35879q66949p50006
3114.5G79516160p54714r67264j225233j364887j220643r09090o96242p11560q44121
3132.8G70822406r09209r81987j254559j700460j987815j706839q19445M5062J63674
$$ y = [793230236, 795449018, 796718955, 797438979, 798074722, 798838317, 799483478, 799667954, 799355745, 798747003, 798041880, 797322750, 796697795, 796398699, 796423912, 796381950, 795878530, 794788301, 793187380, 791161299, 788630486, 785781026, 783910513, 784621894, 787425399, 789919376, 790795743, 790582299, 789934933, 789014637, 787826598, 786366522, 784747005, 783198178, 782110691, 781943560, 782759845, 784154534, 785515904, 786311984, 786501229, 786387682, 786139011, 785845399, 785516202, 785002232, 784338653, 783759713, 783393800, 783168316, 782927632, 782629371, 782312274, 781868994, 781133115, 780266166, 779516160, 778761446, 777794182, 776568949, 775204062, 773983419, 773074329, 772378087, 771666527, 770822406, 769913197, 768931210, 767676651, 765976191, 763988376, 762281537, 761462092, 761507154, 761670828]
3151.2G61670828l48508q19386j003205j134932j332879j514972j619041j718580j880825
3169.6G50298500k002895k034545k085566k215088k340853k469301k687395l002763
3185.9G31460094l392279l791332m176378m584134n033076n491256n876899o194294
3202.2F92920446o484031o713510o900489p059694p199287p340670p257819o588757
3218.5F37376189n063295k618909M26233L489792N889535P099629O966531N719781
3234.8F59285486M011929K529859J571238J174271J358569K128184L290832M434168
3251.1F79784536N021692M772424L927231K912939J969099J141429M16577k27869p81298
3269.5F98936760j226008j586914j892447k173781k444029k696336k944052l191948
$$ y = [761670828, 761322320, 760502934, 759499729, 758364797, 757031918, 755516946, 753897905, 752179325, 750298500, 748295605, 746261060, 744175494, 741960406, 739619553, 737150252, 734462857, 731460094, 728067815, 724276483, 720100105, 715515971, 710482895, 704991639, 699114740, 692920446, 686436415, 679722905, 672822416, 665762722, 658563435, 651222765, 643964946, 637376189, 632312894, 629693985, 630120218, 633610010, 639499545, 646599174, 653565705, 659285486, 663297415, 665827274, 667398512, 668572783, 669931352, 672059536, 675350368, 679784536, 684806228, 689578652, 693505883, 696418822, 698387921, 699529350, 699945927, 699718058, 698936760, 697710752, 696123838, 694231391, 692057610, 689613581, 686917245, 683973193, 680781245]
3285.8F80781245l374040l511667l792823m241347m702747n114495n447865n668581
3302.1F44927680n876719o304265o894886p236123p154524o836653o517708o359578
3318.4E91747224o431639o729960p302404q138776q884072r326041r685576r906470
3334.8E25342286r716034r043813p670492n294949k091884J311451M134863O076873
3351.1E03048301P967710J0628999J3292074J4431774J3707757J1876345R687364P606089
3367.4E92246413N898714M577995L465652K429187J468420O06657k10643r82046j651884
3385.7F07848465k221763k797305l473223m151344m742205n282044n896986o758094
3402.1E72525501p708132q421302q976757r547115r959996r926855r227634p774770
$$ y = [680781245, 677407205, 673895538, 670102715, 665861368, 661158621, 656044126, 650596261, 644927680, 639050961, 632746696, 625851810, 618615687, 611461163, 604624510, 598106802, 591747224, 585315585, 578585625, 571283221, 563144445, 554260373, 544934332, 535248756, 525342286, 515626252, 506582439, 498911947, 493616998, 491525114, 492836565, 496971428, 503048301, 511016011, 521645010, 534937084, 549368858, 563076615, 574952960, 584640324, 592246413, 598145127, 602723122, 606188774, 608617961, 610086381, 610693038, 610482395, 609500349, 607848465, 605626702, 602829397, 599356174, 595204830, 590462625, 585180581, 579283595, 572525501, 564817369, 556396067, 547419310, 537872195, 527912199, 517985344, 508757710, 500982940]
3418.4E00982940n683511l014207J36673L424466O404906Q608640R983956J0675192
3434.7E31519055J0571540R829581Q946716Q092165P160902O190360N044997L674864
3451E91030180K510250K279937L403604N029917N770624N547523N083025M449904L498733
3469.4F28603697K644956K356589K438783K554238K472043K223671K206445K329349
3485.7F47829771K274275K181947K208769K278567K311945K187490J998186J913011
3502F65183961J794696J641274J592755J677871J854956J854897J647710J551152J625418
3520.4F80424690J740635J684427J495123J531482J760721J896977J948118J877606
3536.7F94359779J712799J758159J872718J703739J423478J438797J622319J732826
$$ y = [500982940, 495299429, 492285222, 492421895, 495846361, 502251267, 510859907, 520843863, 531519055, 542090595, 551920176, 560866892, 568959057, 576119959, 582310319, 587355316, 591030180, 593540430, 595820367, 599223971, 604253888, 610024512, 615572035, 620655060, 625104964, 628603697, 631248653, 633605242, 636044025, 638598263, 641070306, 643293977, 645500422, 647829771, 650104046, 652285993, 654494762, 656773329, 659085274, 661272764, 663270950, 665183961, 666978657, 668619931, 670212686, 671890557, 673745513, 675600410, 677248120, 678799272, 680424690, 682165325, 683849752, 685344875, 686876357, 688637078, 690534055, 692482173, 694359779, 696072578, 697830737, 699703455, 701407194, 702830672, 704269469, 705891788, 707624614]
3553G07624614J809001J852513J882135J892031J724422J492440J792133K425969K482354
3571.3G24977612K178014K053499K140582K331912K481342K366900J995981J920819
3587.7G42446661K375364K456427K167046K190351K387465K408802K390444K250791
3604G61073351J827359J625002J848876J996458K023875J845956J596630J896500K139569
3622.3G77873576J691281Q85785N50926J477420K010226J619876J296043J146496J020729
3640.7G89572358Q98957N74887o556k1398J029431J458884Q59678O69658R94980P27534
3661.1G96758413K43128J08719k49982p32661k57313m1127o06537l517P82550P10368
3681.5G96712041N61893L85165j7285k07484K98440P56920P26402M53770O1035j47939
$$ y = [707624614, 709433615, 711286128, 713168263, 715060294, 716784716, 718277156, 720069289, 722495258, 724977612, 727155626, 729209125, 731349707, 733681619, 736162961, 738529861, 740525842, 742446661, 744822025, 747278452, 749445498, 751635849, 754023314, 756432116, 758822560, 761073351, 762900710, 764525712, 766374588, 768371046, 770394921, 772240877, 773837507, 775734007, 777873576, 779564857, 780450642, 781001568, 782478988, 784489214, 786109090, 787405133, 788551629, 789572358, 790471315, 791046202, 791039646, 791018248, 792047679, 793506563, 794366241, 795035899, 796030879, 796758413, 797001541, 797110260, 796860278, 796127617, 795870304, 795829177, 795222640, 795219123, 796001673, 796712041, 797273934, 797659099, 797641814, 797434330, 797732770, 798489690, 799216092, 799669862, 799730897, 799582958]
3701.9G99582958J37747K61068j67906o85931m52935M40418O13034J09971l70264n03302
3722.3G98964858l33488n6088J66118r7751o69837p50959j7047P55906M99606o99818
3742.7G97761500j127601O676O974n65350K87115R22680M37141l7253J51515K41041
3763.1G98084438m7922j86146k34663k0027L14355K20239j03593k62022j58131j30058
3783.5G97476470j58369j9789M7565n7757k83003m64737m04954o07014n98788J14381
3803.9G95044005L9041j36316L69191L45350l60072p02620l44216n08011l57449L79622
3824.3G93768525L50416J10507q3506k17438j89602n11051o88791j11878L10600L92914
3844.6G93130696L85701J01448p47920j779973p03394J039087Q23319j8120n05149
$$ y = [799582958, 799720705, 799981773, 799813867, 799127936, 798675001, 799115419, 799728453, 799838424, 799468160, 798964858, 798631370, 798575282, 798741400, 798643649, 797973812, 797222853, 797205806, 797961712, 798461318, 797761500, 796633899, 796640575, 796647549, 796082199, 796369314, 797291994, 797729135, 797691882, 797843397, 798084438, 798036516, 797850370, 797615707, 797595680, 797910035, 798130274, 798026681, 797764659, 797606528, 797476470, 797318101, 797298312, 797345877, 797288120, 797005117, 796540380, 796135426, 795528412, 794929624, 795044005, 795083046, 794946730, 795315921, 795661271, 795301199, 794598579, 794254363, 793746352, 793388903, 793768525, 794118941, 794229448, 794145942, 793928504, 793738902, 793227851, 792539060, 792427182, 792737782, 793130696, 793516397, 793617845, 792869925, 791089952, 790386558, 791425645, 792248964, 792230844, 791725695]
3863G91725695l32713j10328m17769k97547K49446M72248K74777l32356l48746m2498
3883.4G90840209j94014O199K7836k65777K1457J66416l29375p04408n84364k14815
3903.8G88769364L07858N49436L08752K5690j95206m13179l36230l278Q3923n2750
3924.2G89044380K6226J03414r1791r5487J37508J12415o1214j59085j94669q9764
3944.6G88731933k0147j9371O6042O5386p3850j66655j26898p6056r1612r2447l8206
3967G88158119J6749k1279j04606q2493j8060m1485q0288p8320r7692j03355p8678
3989.5G87468612r9718j22667q4519o0439
3997.6G87101269
$$ y = [791725695, 791392982, 791282654, 790864885, 790567338, 790816784, 791289032, 791563809, 791231453, 790882707, 790840209, 790646195, 790652394, 790680230, 790414453, 790435910, 790602326, 790272951, 789568543, 788984179, 788769364, 789077222, 789626658, 789935410, 789961100, 789765894, 789352715, 789016485, 789013207, 789097130, 789044380, 789070606, 789174020, 789082229, 788986742, 789124250, 789236665, 789175451, 789016366, 788821697, 788731933, 788711786, 788692415, 788758457, 788823843, 788749993, 788583338, 788456440, 788380384, 788288772, 788196325, 788158119, 788174868, 788153589, 788048983, 787966490, 787948430, 787906945, 787826657, 787748337, 787650645, 787547290, 787468612, 787368894, 787246227, 787161708, 787101269]
##END=$$ End of the data block
