##TITLE=Copol PLGA $$ Begin of the data block
##JCAMP-DX=5.00 $$ ACD/SpecManager v 10.08
##DATE=20 Nov 2013 08:47:02
##DATA TYPE=INFRARED SPECTRUM
##DATA CLASS=XYDATA
##ORIGIN=Marcelo Quint
##OWNER=
##NPOINTS=1667
##FIRSTX=599.57470703
##LASTX=3997.16503906
##MAXX=3997.16503906
##MINX=599.57470703
##MAXY=0.99830997
##MINY=0.89610684
##XFACTOR=1.0000000000
##YFACTOR=1.000000000000000e-9
##FIRSTY=0.97994816
##DELTAX=2.03937006
##XUNITS=1/CM
##YUNITS=ARBITRARY UNITS
##XYDATA=(X++(Y..Y))
599.6I79948163K83539j66118o4730k6942j2278O1035k61784q24153r21548o80148
620I77335036n36204k16007J12176o7770m38929n40614n10931l58045j1027J97291
640.4I74964976o3181n20110n24819m53770n71847k25782J51396M6849k13683l54051
660.8I72235978k98858l09825m12703j75178K41876J74820k06887k94626K6047O1035
681.1I71041679m0948N4896j19j03236j01387j75178j82390j18256j22488q3327L5763
703.6I70205009J70946L13282M99487O93321Q94726J167476J329481J332522J356721
721.9I77962971J277327P69735j81973j237929k226949k942979l067434k713919k165437
740.3I65473413j696884j402915j162886j088322j010775m93407M10795J242161J743674
$$ plain form
599.6 979948163 980231702 980065584 980000854 979973912 979961634 980022669 979760885 978936732 978015184 977335036
620 977335036 976798832 976582825 976695001 976627231 976188302 975647688 975136757 974778712 974767685 974964976
640.4 974964976 974901795 974381685 973856866 973403096 972831249 972605467 972756863 972803712 972590029 972235978
660.8 972235978 971937120 971627295 971214592 971039414 971281290 971456110 971249223 970954597 970980644 971041679
681.1 971041679 971000731 971055627 971055508 970952272 970850885 970675707 970493317 970375061 970252573 970169246 970205009
703.6 970205009 970375955 970689237 971188724 971882045 972776771 973944247 975273728 976606250 977962971
721.9 977962971 979240298 980010033 979828060 978590131 976363182 973420203 970352769 967638850 965473413
740.3 965473413 963776529 962373614 961210728 960122406 959111631 958618224 959029019 960271180 962014854
758.6I62014854K231717K683282K619266K333940K269208K082825J744926J557767
775I79537785J235187O84738K02000j26481l07560m81128o39618l95715M12762J432061
795.4I81554031K018214J775145J244724R98020P36952L77595K44737J50442o258j4246
815.7I89079356o9856k35975k31207j847J07109r0182k42591j42395q2672k77042n30601
838.2I87282097p37250q95380r32754q83281p55667p13170j142800k050102l005147
856.5I76166546l458559l012061k000034j054287l13282L23713R39488J653314K433240
874.9I71678078K933145L018379K703488J828730P37846l6895m55499n36978l72410
893.2I81497884k48254j92344j21832j30832j13964k0564j1324Q761O3241O139j08540
$$ plain form
758.6 962014854 964246571 966929853 969549119 971883059 974152267 976235092 977980018 979537785
775 979537785 980772972 981457710 981659710 981533229 981225669 980744541 980104923 979709208 980121970 981554031
795.4 981554031 983572245 985347390 986592114 987590134 988327086 988704681 988949418 989099860 989093602 989079356
815.7 989079356 989009500 988773525 988542318 988540471 988647580 988557398 988314807 988172412 988089740 987812698 987282097
838.2 987282097 986544847 985649467 984716713 983833432 983077765 982364595 981221795 979171693 976166546
856.5 976166546 972707987 969695926 967695892 966641605 966328323 966652036 967591524 969244838 971678078
874.9 971678078 974611223 977629602 980333090 982161820 982899666 982862771 982407272 981870294 981497884
893.2 981497884 981249630 981057286 980935454 980804622 980690658 980670094 980658770 980667531 980730772 980736911 980628371
915.7I80628371j44601o3181K4736M0114L4809P153r3937j86443q5235R3877K5392
938.1I80281055j66535j95563j62304k38359m25279o81698q23677n98371j6629P38442
958.5I77711082J368284J523733J208961P55250L74437Q3387r2209j82807k64764l24130
978.9I82161224l15547l10183l72350m50492n17785n91815q24213j203179j455784
997.3I76119876j643002j981914k445102k983153l611445m246474m758536n105555
1013.6I49344695n281747n194008m686594l794730k854168k228618j966596j902759
1029.9I21435475j912892j836836j529455r74774k43724N33045J233816J663208J761973
1048.2I20129836J711487J579464J326561Q25584j85848j888096l941119n487263n769670
$$ plain form
915.7 980628371 980483770 980420589 980445325 980485439 980520248 980527401 980433464 980247021 980161786 980255663 980281055
938.1 980281055 980114520 979918957 979756653 979518294 979093015 978411317 977587640 976989269 976972640 977711082
958.5 977711082 979079366 980603099 981812060 982567310 982941747 983025134 982932925 982750118 982485354 982161224
978.9 982161224 981845677 981535494 981163144 980712652 980194867 979603052 978778839 977575660 976119876
997.3 976119876 974476874 972494960 970049858 967066705 963455260 959208786 954450250 949344695
1013.6 949344695 944062948 938868940 934182346 930387616 927533448 925304830 923338234 921435475
1029.9 921435475 919522583 917685747 916156292 915181518 914937794 915470839 916704655 918367863 920129836
1048.2 920129836 921841323 923420787 924747348 925572932 925387084 923498988 919557869 914070606 908300936
1066.6I08300936m842102l479302k233207j209796m29690J69397P35044J277208J761914
1084.9I00050402K250850K699852L007948L180862L327310L511846L701150L887892
1101.3I25618112M068494M156232L960013L269732K192497J012803j40787j101970
1117.6I43035126j863718k511919k667010j962483o20067Q42691K038359K981246L929794
1135.9I43202019M922271N700767N982637N618513M694938L507376K314091J326203
1152.2I77268815N80430p4327o76691j359225k233088l312826m901528p092595r370566
1170.6I48828399j0909676j0702551q313417m641652j053214J633644L297746M127800
1186.9I22267079M257322L919065L384113K796114K287447J913071J560747J232207
$$ plain form
1066.6 908300936 903458834 899979532 897746325 896536529 896106839 896276236 897011280 898288488 900050402
1084.9 900050402 902301252 905001104 908009052 911189914 914517224 918029070 921730220 925618112
1101.3 925618112 929686606 933842838 937802851 941072583 943265080 944277883 944137096 943035126
1117.6 943035126 941171408 938659489 935992479 934029996 933409929 934252620 936290979 939272225 943202019
1135.9 943202019 948124290 953825057 959807694 965426207 970121145 973628521 975942612 977268815
1152.2 977268815 977849245 977774918 977098227 975739002 973505914 970193088 965291560 958198965 948828399
1170.6 948828399 937918723 927216172 918902755 914261103 913207889 914841533 918139279 922267079
1186.9 922267079 926524401 930443466 933827579 936623693 938911140 940824211 942384958 943617165
1203.2I43617165J042664R79722J045286J264334J578868J869678K052724K156735
1219.5I55607176K223611K180934J961946J673937J415670J129150P42793L34978J04189
1237.9I67374384l576k33233m75943n69582n89490n92053o73115q07881q79705q92401
1258.3I61657405q09074o06775l23117R9242O56068J185537J599848J944006K248704
1276.7I67651844K457023K570390K631367K506375K125204J580655R28164L09407n8233
1295I82702196j59681j51575j23262o8307Q225L0577K7121P3433P8439L6419M6491
1317.4I82500076P4983N1081M530l8624q5592j31905j90377k34843k63810l10004l46481
1339.9I81029034l80040n43832q48592j122951j279295j270055j145959r72808o98209
$$ plain form
1203.2 943617165 944659829 945639551 946684837 947949171 949528039 951397717 953450441 955607176
1219.5 955607176 957830787 960011721 961973667 963647604 965063274 966192424 966935217 967270195 967374384
1237.9 967374384 967370808 967137575 966661632 966092050 965502560 964910507 964237392 963429511 962549806 961657405
1258.3 961657405 960848331 960241556 959918439 960017681 960673749 961859286 963459134 965403140 967651844
1276.7 967651844 970108867 972679257 975310624 977816999 979942203 981522858 982451022 982760429 982702196
1295 982702196 982542515 982390940 982267678 982199371 982207596 982238173 982265294 982338727 982417166 982453585 982500076
1317.4 982500076 982575059 982626140 982630670 982592046 982506454 982374549 982184172 981949329 981685519 981375515 981029034
1339.9 981029034 980648994 980105162 979256570 978133619 976854324 975584269 974438310 973465502 972767293
1358.2I72767293l84748o0737L17157O52551J052440J387119J125932J04546j162946
1376.6I75798607j747310j262248q0049J076520K130031K920568K888441K549052K215922
1394.9I86489534J631320J129448Q26180M97759L11494L08513K87891K63452K25008
1413.3I91970599P7307l4094R6977K01642Q6010k8372j46091l55780n52178q01146
1433.7I90514874j393437k060950k481043l194988l687441l383637k639353j553595
1450I70120430n97596L9697J033663K728939L210843K918959L123879L141522K314628
1468.4I88034964J509010J217068J141727R29534O57857M60803L52621K35081N5015
1486.7I94593680k2769J75714K65956K2471j63972k0921J19805j3351l44694m48763
$$ plain form
1358.2 972767293 972382545 972321808 972638965 973291516 974343956 975731075 976857007 976961553 975798607
1376.6 975798607 974051297 972789049 972709000 973785520 975915551 978836119 981724560 984273612 986489534
1394.9 986489534 988120854 989250302 990076482 990574241 990885735 991194248 991482139 991745591 991970599
1413.3 991970599 992047906 992013812 992110789 992312431 992398441 992370069 992223978 991868198 991316020 990514874
1433.7 990514874 989121437 987060487 984579444 981384456 977697015 974313378 971674025 970120430
1450 970120430 969522834 969562531 970596194 973325133 976535976 979454935 982578814 985720336 988034964
1468.4 988034964 989543974 990761042 991902769 992832303 993490160 993950963 994303584 994538665 994593680
1486.7 994593680 994570911 994746625 995012581 995035052 994871080 994850159 994969964 994956613 994611919 994163156
1507.1I94163156O4313L18110K14875J8775j12951j59740j37329K4438J16884J70649
1527.5I94681180J70290j3530j01686N663o9380k35737j39951O9976K41100K11001
1547.9I94818926N7042k1697r7096k00092k60830J28627M08351K14100P868j23918
1568.3I94931281p9930L9220m3333j21772j908M7088j0669n0664l2246n365l4928q5056
1592.8I94551718p3790j7107n245k4140k7597l3140l4750l7670l0040o7354j64866
1615.2I94036019j30475k0742j13785j87576n1558M1723N2392J3650j39892k55346
1635.6I93244410m7148Q8215q404j70291l21388j14202J11222o7174k7717L69847L55601
1658I93412971J26422q2433n5015j7286j91509j60397N1976K3305o8068o5089j53422
$$ plain form
1507.1 994163156 994227469 994545579 994760454 994779229 994666278 994506538 994369209 994393647 994510531 994681180
1527.5 994681180 994851470 994837940 994736254 994741917 994672537 994436800 994296849 994366825 994607925 994818926
1547.9 994818926 994875968 994854271 994757175 994557083 994296253 994424880 994833231 995047331 995055199 994931281
1568.3 994931281 994851351 994890571 994847238 994725466 994723558 994770646 994759977 994709313 994677067 994671702 994636774 994551718
1592.8 994551718 994477928 994460821 994455576 994431436 994403839 994370699 994335949 994298279 994268239 994200885 994036019
1615.2 994036019 993905544 993884802 993771017 993583441 993531883 993573606 993625998 993639648 993499756 993244410
1635.6 993244410 993197262 993285477 993277073 993106782 992785394 992671192 992782414 992715240 992687523 993057370 993412971
1658 993412971 993539393 993456960 993401945 993384659 993193150 993032753 993084729 993108034 993039966 992974877 992821455
1680.5I92821455l33190k86221R000N483j16407j99914m54188o12795o37174p09891
1700.9I89486158n48482o37591q93354r35793j050532j354993j704037k090990k014756
1719.2I78255630j940310k662898l765165m963816o426632p551730r233057r036780
1735.5I32675242n713701l970086k655268r89199R0003Q11041J677572K580583K914489
1753.9I27420676L316879M064679M506529N130589N131363M376233L918648L553033
1770.2I61418629L609717L652215L254652L156006L348648L282726K971053K556682
1786.5I87250328J936913J376628J129747R46104O62983M26471K85149L06487L29256
1804.9I94650066K26855J00017J02520J80363J80781J13607Q5532P9573M2975P2836
$$ plain form
1680.5 992821455 992488265 992202044 992211044 992216527 992100120 991900206 991446018 990833223 990196049 989486158
1700.9 989486158 988937676 988300085 987406731 986470938 985420406 984065413 982361376 980270386 978255630
1719.2 978255630 976315320 973652422 969887257 964923441 958496809 950945079 941712022 932675242
1735.5 932675242 926961541 922991455 920336187 919346988 919436991 920248032 921925604 924506187 927420676
1753.9 927420676 930737555 934802234 939308763 944439352 949570715 953946948 957865596 961418629
1770.2 961418629 965028346 968680561 971935213 975091219 978439867 981722593 984693646 987250328
1786.5 987250328 989187241 990563869 991693616 992639720 993302703 993729174 994014323 994320810 994650066
1804.9 994650066 994876921 994976938 995079458 995259821 995440602 995554209 995639741 995719314 995762289 995835125
1825.3I95835125R9600Q9168J59324K14099J68264J25707J06751K7776n7578K6107
1845.7I96794343J10328P1943O6876P7367P6115N1260K7955J6868j6391r0003j11997
1868.1I97074664M5597J56999J14143M8935L338j8358j4723j0609r239k2471j1206
1890.5I97357070J3531j2577j3769J0133K7120N3048L6240l1829n4717m828K9922Q94
1915I97410238l9816J8716O4432J5378R418Q285n841L3140N5134M1306K5451m1425
1939.5I97594416j08421m4107K6345N782J669j4425m7505l6895j2994k6703m8458k6643
1963.9I97262061J8119M0591K6763J2219J8417M0114M6254O795k5690j2636l58k2352
1988.4I97410297n0068k7239L4332P0036Q4281N9903j4663o1631l2247L5942N8174
$$ plain form
1825.3 995835125 995934725 996023893 996183217 996397316 996565580 996691287 996798038 996825814 996768236 996794343
1845.7 996794343 996904671 996976614 997043490 997120857 997196972 997248232 997276187 997293055 997276664 997186661 997074664
1868.1 997074664 997120261 997277260 997391403 997440338 997443676 997425318 997410595 997399986 997390747 997368276 997357070
1890.5 997357070 997370601 997358024 997344255 997354388 997381508 997434556 997470796 997438967 997384250 997379422 997409344 997410238
1915 997410238 997370422 997389138 997453570 997468948 997478366 997486651 997480810 997513950 997569084 997610390 997635841 997594416
1939.5 997594416 997485995 997441888 997468233 997474015 997475684 997461259 997413754 997376859 997363865 997337162 997288704 997262061
1963.9 997262061 997280180 997320771 997347534 997359753 997378170 997418284 997464538 997471333 997445643 997433007 997432649 997410297
1988.4 997410297 997360229 997332990 997367322 997437358 997521639 997581542 997566879 997505248 997473001 997508943 997567117
2010.8I97567117L2664J6748J6928J5736p212j6928K4140N4836M5419K3007k0027m7088
2035.3I97705340k7597j5258j9789k2948j1086o140l1709k8014R536k801o9320o6698
2059.8I97413516L517R715j6451M471K6047P927l7551n6743J1682P0751M8161K4974
2084.3I97510016k5928p9036l5107J8895L0517M1366K8253j1683o378J5319j312P16
2108.7I97485638n007l2902j7345M3631O1452l815j9431K5511J5199P749M6492L1948
2133.2I97639120l8743o0857l099M2915L9995K5570N007m947j7643j6570L9279Q3208
2157.7I97733235K6107o4194o6221J729P2181P1347p153o9618o9201j7047L8385N3227
2182.2I97702777L6300R834j1026o855O616K0385M8637K5690o6519r7155l2068K2412
$$ plain form
2010.8 997567117 997599781 997616529 997633457 997649193 997641981 997625053 997649193 997704029 997749448 997772455 997752428 997705340
2035.3 997705340 997677743 997662485 997642696 997619748 997608662 997602522 997570813 997542799 997552335 997549534 997480214 997413516
2059.8 997413516 997417033 997426748 997410297 997414768 997440815 997448742 997411191 997354448 997366130 997436881 997485042 997510016
2084.3 997510016 997484088 997405052 997369945 997388840 997419357 997460723 997488976 997477293 997470915 997486234 997484922 997485638
2108.7 997485638 997480631 997447729 997430384 997474015 997535467 997531652 997512221 997537732 997552931 997560680 997607172 997639120
2133.2 997639120 997600377 997539520 997536421 997579336 997619331 997644901 997649908 997644961 997627318 997610748 997650027 997733235
2157.7 997733235 997759342 997695148 997628927 997630656 997702837 997774184 997767031 997697413 997628212 997611165 997649550 997702777
2182.2 997702777 997739077 997748911 997737885 997731030 997737646 997758031 997806668 997832358 997765839 997668684 997636616 997659028
2206.6I97659028J5914M411Tk981P153J0609k5928p7009n1200M1723N7221j2815o4493
2233.1I97566044l0100N1498N5969K4140L4690J2040j7583k7895m0949j847M4584N4896
2257.6I97725487M9710j1861p8559m6909O258l695k1815k5511k1517M053L0458TK801
2284.1I97639358k4557k0742q464j848O497j4067p0691q9228m2439j251J7345j6988
2308.6I97372925o3896k4259M768l5882n6326l6418M4822J27256O5386n6445q7857
2331I97254074O4373K22087J73568O6221j7762n4479o8843n7578j312J073M77O9320
2355.5I97651219M1187j371J6153q4400j12534l1888k2769o7055k6822O9439J8060
2377.9I97449219j25527j32442R001J09017J04188M0114j7285j1325o556p391K8491
$$ plain form
2206.6 997659028 997674942 997679353 997683764 997680783 997687936 997698545 997672617 997595608 997544408 997586131 997643352 997630537 997566044
2233.1 997566044 997535944 997587442 997643411 997667551 997702241 997714281 997696698 997668803 997627854 997626007 997670591 997725487
2257.6 997725487 997775197 997763336 997684777 997637868 997644126 997640431 997618616 997593105 997571588 997575641 997606099 997636557 997639358
2284.1 997639358 997614801 997594059 997585595 997583747 997590244 997576177 997505486 997416258 997373819 997372568 997389913 997372925
2308.6 997372925 997309029 997284770 997289538 997253656 997197330 997160912 997205734 997332990 997398376 997341931 997254074
2331 997254074 997318447 997540534 997714102 997780323 997762561 997708082 997639239 997581661 997580349 997581422 997581899 997651219
2355.5 997651219 997692406 997691035 997707188 997622788 997510254 997478366 997455597 997388542 997361720 997431159 997449219
2377.9 997449219 997323692 997191250 997200251 997309268 997413456 997453570 997436285 997424960 997418404 997411013 997439504
2400.4I97439504M2557L577k2590q405Q524J6272K6285L3617J2398j4543p630K742
2424.8I97532308P808K8014L9995O4075O6281L814m0292n9605m7922J4424N9784N7280
2449.3I97725964K0682j4662m4108m3988J19J1087P331J0729r477l457K8848R656n7041
2475.8I97641683p6890k4379M7326P6116M4584k7716p5758m2319J9014L9398o377l6836
2500.3I97577846l457J6749K086%M4704N4419q643m2260j5437n961l7610n0128k5213
2526.8I97507095j0311j1325J4663J9431L278J5795K3186L4511K6823l3558n6445J3887
2551.3I97547030P6712M6253n186j3113k4557l8981l1710k5511k0504J133M6491N0426
2575.7I97608483j5497o1989k3723M9412N5015L219l3796m1663m3094k6942R120K7060
$$ plain form
2400.4 997439504 997482061 997485638 997463048 997454643 997463167 997479439 997505724 997539341 997551739 997537196 997529566 997532308
2424.8 997532308 997540116 997568130 997608125 997672200 997738481 997742295 997702003 997642398 997594476 997608900 997668684 997725964
2449.3 997725964 997746646 997731984 997687876 997643888 997644007 997655094 997662425 997673154 997663677 997660220 997689068 997698724 997641683
2475.8 997641683 997564793 997540414 997587740 997663856 997708440 997680724 997604966 997562647 997581661 997621059 997614682 997577846
2500.3 997577846 997574389 997591138 997593224 997593224 997637928 997692347 997683704 997641444 997626007 997620046 997582436 997532308 997507095
2526.8 997507095 997496784 997485459 997500122 997519553 997522831 997538626 997561812 997596323 997623146 997589588 997533143 997547030
2551.3 997547030 997623742 997669995 997664809 997651696 997627139 997588158 997556448 997530937 997510433 997511566 997558057 997608483
2575.7 997608483 997592986 997530997 997507274 997556686 997611701 997614920 997581124 997539461 997496367 997469425 997478545 997505605
2600.2I97505605K7478N841j9550k921l516l7313o914J5199l1829j6153L7551K4081
2624.7I97497559j0074k8789m8101k5153N4777P2002r954k5630K2531J9848J6272m17
2649.2I97534871j2338P391j4663k1756O557J2755L1591K9802k6285m1903m470J3888
2673.6I97515440K98Q106L1650J4067p033k3604m2259k5988k0266l7491j4424L3736
2698.1I97432232L8505M351k6524l8565l3974J251P6175J18137N2750l7015m6611j788
2722.6I97538924M4465L6419l5584j04904j07825L576J04070N9545j2338j3411n305
2745I97507632p034M3214P7784K2888r000L57l6776n7518j0550J6689k0325m6313J2219
2771.5I97493267L6180j8716k2709o378l1173m2796k7597j8716j729N544k0027k8015
$$ plain form
2600.2 997505605 997533083 997538924 997519374 997516453 997512937 997475624 997468710 997483909 997452080 997435927 997473478 997497559
2624.7 997497559 997487485 997458696 997410595 997385442 997440219 997512221 997502267 997476637 997499168 997519016 997535288 997534871
2649.2 997534871 997522533 997529924 997515261 997493505 997500062 997512817 997544408 997574210 997547925 997506022 997501552 997515440
2673.6 997515440 997515738 997523844 997555494 997569561 997562528 997538924 997496665 997470677 997450411 997412920 997398496 997432232
2698.1 997432232 997470737 997475088 997448564 997409999 997376025 997377276 997453451 997571588 997624338 997587323 997540712 997538924
2722.6 997538924 997583389 997619808 997584224 997479320 997371495 997375071 997479141 997538686 997526348 997512937 997507632
2745 997507632 997500598 997543812 997621596 997644484 997635484 997635841 997599065 997541547 997530997 997547686 997527361 997481048 997493267
2771.5 997493267 997529447 997510731 997488022 997481644 997450471 997407675 997380078 997361362 997359633 997365177 997345150 997317135
2796I97317135q34M828m0293k5511N6506K2828j22845j25349n304k4915o6042J5497
2820.5I97005701K7001m2677n1081o0J7524r1016j65701p5698m7326k02954l73483
2842.9I96000230m42385m33982l02911p2181R2566J61112K28762K73943K09034J09732
2863.3I95823920M8876l2962q2791o0379n1975l7671j6868j9312J3233K3722p212l6537
2887.8I95564044r8229j17540n9963m6014q7500j02162r5427j44422k53380l08633
2908.1I94250774k67565k87831m17173m96745m35769k60651q7679M6730J69039K16067
2928.5I92429197J74343J00315J9729q8453k27273l07321j84238P0035K20299K39432
2948.9I92446065K41876K66730K71142K37048K32756K61426K23577J62899J72913J61469
$$ plain form
2796 997317135 997316301 997321129 997280836 997255325 997311831 997334659 997211814 997086465 997081161 997056246 996990204 997005701
2820.5 997005701 997032702 996990025 996938944 996938884 996956408 996865392 996699691 996623993 996576667 996373713 996000230
2842.9 996000230 995557845 995123863 994820952 994748771 994841337 995002449 995231211 995505154 995714188 995823920
2863.3 995823920 995872796 995839834 995757043 995696664 995644689 995607018 995590150 995570838 995584071 995607793 995600581 995564044
2887.8 995564044 995465815 995348275 995288312 995242298 995154798 995052636 994957209 994812787 994559407 994250774
2908.1 994250774 993983209 993695378 993278205 992781460 992345691 992085040 991997361 992044091 992213130 992429197
2928.5 992429197 992603540 992703855 992723584 992635131 992407858 992100537 991916299 991986334 992206633 992446065
2948.9 992446065 992687941 992954671 993225813 993462861 993695617 993957043 994180620 994343519 994516432 994677901
2969.3I94677901R0599K2292m8637r6261j16051j83105l09706m03821m04179l64602
2989.7I92864430k96891j84417m6849J23203L44157N02706M87327L84689L23772L27587
3010.1I94829714L48449L82841L67403K73287K18272J91570J17898O5028Q8632Q2851
3030.5I96965945Q4936Q3566p749p510L3558L338N2809J15514L7909o5983n3882o318
3055I97236133j3650o199L1412Q821k1278J6987K9564j5974k3783Q584p332m4286j9014
3081.5I97179985J9133L2008J9073l8027n7817n186L3498P8738J19984N2750n1260
3103.9I97382879r6500o3419K5332M0829m291j490L5285K0087k0146P808K4736J3173
3128.4I97364283L5107J0371n0545n0306L815J2338k9087p212O794n6028p3016j0311
$$ plain form
2969.3 994677901 994768500 994790792 994742155 994645894 994529843 994346738 994037032 993633211 993229032 992864430
2989.7 992864430 992567539 992383122 992336273 992459476 992803633 993306339 993793666 994178355 994502127 994829714
3010.1 994829714 995178163 995561004 995928407 996201694 996419966 996611536 996729434 996794462 996883094 996965945
3030.5 996965945 997050881 997134447 997126698 997119188 997152746 997156084 997208893 997324407 997362316 997296333 997242451 997236133
3055 997236133 997222483 997216284 997247696 997256517 997235239 997252226 997281790 997265816 997242033 997250617 997243285 997198999 997179985
3081.5 997179985 997199118 997231126 997250199 997212172 997154355 997149169 997182667 997261405 997381389 997434139 997382879
3103.9 997382879 997286379 997222960 997248292 997289121 997284830 997283340 997318625 997338712 997318566 997326374 997351110 997364283
3128.4 997364283 997399390 997409761 997359216 997308910 997312725 997325063 997295976 997288764 997295558 997239530 997166514 997156203
3152.9I97156203M2379L2127J0371N9m8518p9512k1220K087m1008o1274n1439Q106
3177.3I96948361K9207M232K5570M0293J7524J013n603N841J7882m9711q8811o735
3201.8I96939063O3956L0875m0591k9385J3590M4406P5876J3948j17123j35482P272
3224.2I96866405J41442Q0228m3571j8001M1962K0504l5107l5584K3245M9234j4007
3246.7I97076750j00970o4373L2782M1723%J3829N8829K1339m8757j0609N8531L2008
3271.1I97111082J7345L1054J1921r596o7473j12057n9247K4736N2631K6822o556k0445
3295.6I97000217K39M3094M8816M1485K4498n9724o1512M0710Q0824N8949m650l1352
3320.1I97181594J7643j8656j06990o8665Q822K6226J0669n36K3484j79m1664J1504
$$ plain form
3152.9 997156203 997198582 997230709 997241080 997241139 997192621 997113109 997091889 997093976 997052968 996991694 996940255 996948361
3177.3 996948361 996977568 996981800 997007370 997047663 997065187 997066200 997060597 997066438 997084320 997034609 996945798 996939063
3201.8 996939063 997003019 997033894 996993303 996963918 996977508 997021914 997097790 997111738 996994615 996859133 996866405
3224.2 996866405 997007847 997088075 997044504 997026503 997068465 997088969 997053862 997018278 997041523 997090757 997076750
3246.7 997076750 996975780 996911407 996944189 996985912 996985912 996999741 997058570 997079909 997031152 997020543 997079074 997111082
3271.1 997111082 997128427 997159481 997171402 997161806 997094333 996982276 996923029 996947765 997000396 997027218 997020662 997000217
3295.6 997000217 997000456 997043550 997092366 997133851 997158349 997098625 997037113 997077823 997158647 997217596 997212946 997181594
3320.1 997181594 997199237 997180581 997073591 997004926 997013748 997039974 997050643 997050107 997073591 997073412 997031748 997043252
3344.6I97043252N8651J9252j3232k325J5617n37n8651l0696P4446P4268K0563k0563
3369I97180045r5725q3745K4974O8784K5094m1545o9856l5107M1127P8320j6272j16944
3393.5I96959150n0605L7253K4617L0637O8307L2842j4901K3067N1975O3121N1558
3415.9I97277021o4730q7500N7280R6023l457l099N8710l993l9697J5199K5332L9876
3440.4I97366965M0710j0610k8133k5451n5910r7811r5904k98J24514J34528M292q3566
3464.9I97273326j8120O5923O6221K2709p808n9009j03175p1526j9670K8611L5345
3487.3I97212827K4379K7596j5556n7698n7459k6881J8000M6611N1201K1159l5465
3509.7I97208714K0326J41561N4002j00077m5418O9439L3736l6537k2233L0339P3612
$$ plain form
3344.6 997043252 997101903 997121155 997107923 997105598 997121215 997120678 997062027 997031331 997105777 997180045 997200608 997180045
3369 997180045 997084320 997000575 997025549 997094333 997119427 997077882 997008026 996972919 997014046 997092366 997076094 996959150
3393.5 996959150 996908545 996945798 996970415 997001052 997069359 997102201 997087300 997110367 997162342 997225463 997277021
3415.9 997277021 997212291 997124791 997182071 997278094 997274637 997271538 997330248 997326255 997286558 997301757 997327089 997366965
3440.4 997366965 997407675 997397065 997368932 997343481 997287571 997189760 997093856 997093558 997218072 997352600 997356892 997273326
3464.9 997273326 997255206 997321129 997387350 997410059 997402251 997343242 997240067 997168541 997148871 997177482 997212827
3487.3 997212827 997237206 997264802 997249246 997191548 997134089 997107208 997125208 997171819 997223020 997244179 997208714
3509.7 997208714 997229040 997370601 997424603 997324526 997279108 997348547 997382283 997345746 997323513 997353852 997427464
3532.2I97427464L3557k7120j8001q046l5465q0526o1512N3823R0897K6524J1206K9683
3556.6I97442484P1645J14560n4538l25561k67148J10030L05772K40564P7665r9897
3577I97615576r7037P3493N0902j50680j45734J24634K07603K3484r0241m3631N6267
3599.5I97624636J13547N7756j8060o0498j05083j07646J1563L1710j26601m8518J30773
3621.9I97503579M9948j16706k64763j15812K17557K47597J42932O2764j3649l6002
3642.3I97677445j03950l42488m51863l8207L49999K73227N7698L874N6207Q2672P7605
3664.7I97642219l1710j73926r5487L5227K8252J20342J55509J16586J29342M1008
3685.1I97967362j00553q6188J5497L4154Q5652J22547J5378p3552K3245P1407q6725
$$ plain form
3532.2 997427464 997461021 997433901 997415900 997407854 997372389 997291863 997230351 997284174 997375071 997401595 997412801 997442484
3556.6 997442484 997514129 997628689 997574151 997248590 996981442 997091472 997397244 997637808 997715473 997615576
3577 997615576 997518539 997592032 997642934 997492254 997346520 997471154 997678757 997702241 997612000 997568369 997624636
3599.5 997624636 997738183 997795939 997777879 997717381 997612298 997504652 997516215 997547925 997421324 997372806 997503579
3621.9 997503579 997553527 997436821 997172058 997056246 997273803 997521400 997664332 997727096 997713447 997677445
3642.3 997677445 997573495 997231007 996779144 996740937 997090936 997364163 997421861 997425735 997481942 997564614 997642219
3664.7 997642219 997610509 997436583 997341096 997376323 997404575 997524917 997680426 997797012 997926354 997967362
3685.1 997967362 997866809 997780621 997796118 997830272 997915924 998038471 998053849 997980297 998003542 998074949 997988224
3707.6I97988224k09451j09613P8321J07109O1393L6240k4617k2054N0724K3186j17421
3730I97862041k14577j45614O3002K35141J83403p1645l03149j27435J17004J60516
3750.4I97758687J41739L3260p2837m5717O2347K4795q7082q7559r0182j4425K00093
3772.8I97823119K22743M9650p5876p1049L58Q1002N8532l3021l3319k7656r0778j7703
3797.3I97886002Q0824q3447j21593J192j9193m530P9453J53363R3997j23918k69056
3819.7I97673094q2850K23040J99318O9917k3306n9604j2815j8240p0452j0729R1195
3842.1I97978568J11342N5611p0870k55525m06623j50204K54035K35736R5666N2810
3862.5I97900546P6115n961j46270o3777J54019J77264P1943o4373j60039j21653k0146
$$ plain form
3707.6 997988224 997778773 997669160 997747481 997854590 997915983 997952223 997927606 997905552 997956276 997979462 997862041
3730 997862041 997647464 997501850 997564852 997799993 997983396 997911751 997608602 997481167 997598171 997758687
3750.4 997758687 997900426 997933686 997860849 997815132 997877479 997902274 997815192 997727633 997637451 997623026 997823119
3772.8 997823119 998045862 998095512 998019636 997948587 997948945 998029947 998088479 998055458 998022139 997994483 997903705 997886002
3797.3 997886002 997966826 997883379 997761786 997762978 997743785 997739255 997818708 997972071 998066068 997942150 997673094
3819.7 997673094 997590244 997813284 998012602 998082519 998059213 997999609 997986794 997968554 997898102 997887373 997978568
3842.1 997978568 998089910 998145521 998074651 997819126 997412503 997262299 997516334 997752070 997847736 997900546
3862.5 997900546 997976661 997970700 997824430 997760653 997914672 998091936 998163879 998099506 997939467 997817814 997797668
3885I97797668J31428J12117n2274O8963K30670K1398l21806m20570j52349J94966
3905.4I97610211K86580J91986N9605j08779k10345n0902K06411J94490K1160l577
3925.8I98196840l0994k10285j89424J01626K03133Q464p3493N7042R2387j7882p6293
3948.2I98061121M3928J07348M292m7744n8472q6188l2246Q8274O9797k2590p868J1146
3972.7I98130798o2704j17302j4484Q4937N1498K9505J9014p5877r5666N1499J68800
3995.1I98170018Q8155
3997.1I98258173
$$ plain form
3885 997797668 997929096 998041213 997988939 998057902 998288572 998309970 997988164 997567594 997415245 997610211
3905.4 997610211 997896791 998088777 998148382 998039603 997829258 997778356 997984767 998179257 998200417 998196840
3925.8 998196840 998165846 997955561 997766137 997867763 998070896 998079360 998005867 998062909 998155296 998137414 998061121
3948.2 998061121 998105049 998212397 998216689 998168945 998110473 998024285 997992039 998080313 998150110 998127520 998119652 998130798
3972.7 998130798 998068094 997950792 997936308 998021245 998072743 998102248 998121262 998045385 997949719 998001218 998170018
3995.1 998170018 998258173
3997.1 998258173
##END=$$ End of the data block
