##TITLE=Controle 1p3 $$ Begin of the data block
##JCAMP-DX=5.00 $$ ACD/SpecManager v 10.08
##SPECTROMETER/DATA SYSTEM=Alpha
##DATE=03 Sep 2014 08:47:40
##DATA TYPE=INFRARED SPECTRUM
##DATA CLASS=XYDATA
##ORIGIN=
##OWNER=
##NPOINTS=1765
##FIRSTX=399.76428223
##LASTX=3997.64306641
##MAXX=3997.64306641
##MINX=399.76428223
##MAXY=0.83393562
##MINY=0.49571833
##XFACTOR=1.0000000000
##YFACTOR=1.000000000000000e-9
##FIRSTY=0.79738492
##DELTAX=2.03961372
##XUNITS=1/CM
##YUNITS=ARBITRARY UNITS
##XYDATA=(X++(Y..Y))
$$ plain form
399.8 797384918 795663357 792972267 791698873 791568041 790350735 788561881 788276017 789221287 788988888
418.1 788988888 786786020 785441339 784903049 783214509 781538606 781484723 781839490 781029880 779758990
436.5 779758990 779417932 779392838 778389931 777107477 776502013 775620043 774124682 773244619 773277104 772824168
456.9 772824168 771233201 770154178 770236492 770040214 769161701 768740654 768850327 768349409 767372906 767053783
477.3 767053783 767163396 766843736 766278207 765910864 765478551 764774680 764251232 764138401 763753474 762806177
497.7 762806177 762116075 761883378 761276245 760218382 759457171 759004116 758181691 757156909 756639361
516 756639361 756308377 755392790 754284501 753681898 753166854 752214372 751413941 751311123 751189053 750279009
536.4 750279009 749278426 748910129 748556912 747775316 747247756 747278690 746987879 746100664 745609403 745768726
$$ packed form
399.8G97384918j721561k691090j273394j30832j217306j788854k85864R45270k32399
418.1G88988888k202868j344681n38290j688540j675903n3883L54767q09610j270890
436.5G79758990l41058k5094j002907j282454o05464q81970j495361q80063L2485m52936
456.9G72824168j590967j079023Q2314j96278q78513m21047J09673n00918r76503l19123
477.3G67053783J09613l19660n65529l67343m32313p03871n23448j12831l84927r47297
497.7G62806177o90102k32697o07133j057863p61211m53055q22425j024782n17548
516G56639361l30984r15587j108289o02603n15044r52482q00431j02818j22070r10044
536.4G50279009j000583l68297l53217p81596n27560L0934k90811q87215m91261J59323
$$ plain form
556.8 745768726 745663702 745046377 744720519 744881630 744637191 743805528 743441463 743761301 743658781 742908061
577.2 742908061 742652297 743058622 742909193 742113590 741928697 742418051 742338419 741501749 741089106 741354942
597.6 741354942 741237700 740581155 740406036 740771472 740569651 739685059 739349306 739815414 739845812 739392936
618 739392936 739946008 741603911 742972314 743723214 744908452 746669590 747838557 748192191 748911679
636.4 748911679 750237107 750947535 750803292 751072168 751961291 752215207 751737893 751872659 752745569 752976954
656.8 752976954 752386093 752372444 753247499 753792167 753461123 753484011 754441261 754931509 754720330 754930794
677.2 754930794 755918145 756351173 755859494 755821526 756614864 756849468 755774677 754604042 754443228 754267037
697.5 754267037 753218889 752882183 754332781 755937636 756472886 756949782 758039832 758749127 758513153
$$ packed form
556.8G45768726j05024o17325l25858J61111k44439q31663l64065L19838j02520p50720
577.2G42908061k55764M06325j49429p95603j84893M89354p9632q36670m12643K65836
597.6G41354942j17242o56545j75119L65436k01821q84592l35753M66108L0398m52876
618G39392936N53072J657903J368403P50900J185238J761138J168967L53634P19488
636.4G48911679J325428P10428j44243K68876Q89123K53916m77314J34766Q72910K31385
656.8G52976954n90861j3649Q75055N44668l31044K2888R57250M90248k11179K10464
677.2G54930794R87351M33028m91679l7968P93338K34604j074791j170635j60814j76191
697.5G54267037j048148l36706J450598J604855N35250M76896J090050P09295k35974
$$ plain form
715.9 758513153 758352637 759064794 760139465 761391938 763832390 767575681 770985782 773176193 775160670
734.3 775160670 777637601 779661059 780659437 781807542 784024775 786373496 787912488 789418817 791577041
752.6 791577041 793326318 793874741 794275582 795378685 796297848 796267450 796213031 797037899 798006296 798267722
773 798267722 798574150 799822986 801331818 802274406 803236067 804915369 806699395 807852864 808932483
791.4 808932483 810689807 812506735 813477159 814069927 815131247 816251934 816683054 816987216 818058431
809.7 818058431 819523573 820633411 821711600 823383749 825188577 826284647 826851010 827543080 828164339
828.1 828164339 828078508 827508211 827228725 827269971 827174902 827172518 827906847 829204619 830236137 830827951
848.5 830827951 831427693 832125545 832692802 833090186 833511412 833935618 833908737 833278894 832454205 831470847
$$ packed form
715.9G58513153j60516P12157J074671J252473K440452L743291L410101K190411J984477
734.3G75160670K476931K023458R98378J148105K217233K348721J538992J506329K158224
752.6G91577041J749277N48423M00841J103103R19163l0398n4419Q24868R68397K61426
773G98267722L06428J248836J508832R42588R61661J679302J784026J153469J079619
791.4H08932483J757324J816928R70424N92768J061320J120687M31120L04162J071215
809.7H18058431J465142J109838J078189J672149J804828J096070N66363O92070O21259
828.1H28164339q5831n70297k79486M1246r5069k384P34329J297772J031518N91814
848.5H30827951N99742O97852N67257L97384M21226M24206k6881o29843q24689r83358
$$ plain form
868.9 831470847 829709649 826793194 823167741 819744945 817382574 816775858 818168879 820806623 823390305
887.2 823390305 825178444 826283097 827081263 827552617 827509522 827267706 827264488 827314913 827078462 826846123
907.6 826846123 827074707 827518463 827617288 827447593 827478886 827621281 827338636 826626301 826013088 825568914
928 825568914 824830472 823753953 822835386 822183073 821279705 819936514 818605065 817420363 815925896
946.4 815925896 813995779 812083602 810308814 808134854 805320263 802324355 799401581 796194673
962.7 796194673 792604148 789192379 786270678 783412993 780303180 777251184 774408698 771339953
979 771339953 767875612 764511049 761511505 758461416 755111277 751878500 749029219 746142566 742892265
997.4 742892265 739567935 736400962 733056962 729232669 725214064 721339345 717451274 713396609
$$ packed form
868.9H31470847j761198k916455l625453l422796k362371o06716J393021K637744K583682
887.2H23390305J788139J104653P98166M71354m3095k41816l218N0425k36451k32339
907.6H26846123K28584M43756R8825j69695L1293J42395k82645p12335o13213m44174
928H25568914p38442j076519r18567o52313r03368j343191j331449j184702j494467
946.4H15925896j930117j912177j774788k173960k814591k995908k922774l206908
962.7G96194673l590525l411769k921701k857685l109813l051996k842486l068745
979G71339953l464341l364563k999544l050089l350139l232777k849281k886653l250301
997.4G42892265l324330l166973l344000l824293m018605l874719l888071m054665
$$ plain form
1013.7 713396609 709494770 706045151 702811897 699457467 696121097 693062663 690149486 687180877
1030 687180877 684376717 682035148 679939091 677719951 675475001 673415124 671353638 669026494 666604578
1048.4 666604578 664444327 662566483 660781085 659066260 657559276 656233430 654896080 653561473
1064.7 653561473 652446747 651553988 650663376 649813414 649281323 649122477 649201035 649590850 650525391 651956260
1085.1 651956260 653586388 655324996 657306314 659589171 662142754 665017307 668306112 671907246
1101.4 671907246 675495088 678751171 681482315 683505416 684674799 685122490 685281396 685660839 686624885
1119.8 686624885 688305736 690566719 692917168 694707155 695514321 695170522 693671703 691284299 688541770
1138.1 688541770 686013937 684080541 682837307 682126224 681690931 681394339 681237698 681254923 681527019
$$ packed form
1013.7G13396609l901839l449619l233254l354430l336370l058434k913177k968609
1030F87180877k804160k341569k096057k219140k244950k059877k061486k327144k421916
1048.4F66604578k160251j877844j785398j714825j506984j325846j337350j334607
1064.7F53561473j114726q92759q90612q49962n32091j58846P8558L89815R34541J430869
1085.1F51956260J630128J738608J981318K282857K553583K874553L288805L601134
1101.4F71907246L587842L256083K731144K023101J169383M47691J58906L79443R64046
1119.8F86624885J680851K260983K350449J789987Q07166l43799j498819k387404k742529
1138.1F88541770k527833j933396j243234p11083m35293k96592j56641J7225K72096
$$ plain form
1156.5 681527019 682197928 683434427 685350060 687913239 691001952 694589019 698725760 703400373
1172.8 703400373 708555222 714063287 719628155 724888802 729684412 734050274 737993419 741404653
1189.1 741404653 744195700 746451855 748260319 749477446 749963582 749858141 749308586 748292625 746894300
1207.5 746894300 745392501 743908882 742267609 740329802 738226891 736101747 733805180 731187224
1223.8 731187224 728466094 725934744 723550558 721195281 719053388 717390597 716162026 715243042
1240.1 715243042 714851618 715237856 716227055 717437208 718729913 720071137 721205890 721922040 722453535
1258.4 722453535 723201811 724181116 725165427 726186395 727407992 728614688 729365766 729624569 729751885
1276.8 729751885 729924679 730102062 730481744 731334686 732391715 733022213 733124375 733124852 733119488 732767105
$$ packed form
1156.5F81527019O70909J236499J915633K563179L088713L587067M136741M674613
1172.8G03400373N154849N508065N564868N260647M795610M365862L943145L411234
1189.1G41404653K791047K256155J808464J217127M86136j05441n49555j015961j398325
1207.5G46894300j501799j483619j641273j937807k102911k125144k296567k617956
1223.8G31187224k721130k531350k384186k355277k141893j662791j228571r18984
1240.1G15243042l91424L86238R89199J210153J292705J341224J134753P16150N31495
1258.4G22453535P48276R79305R84311J020968J221597J206696P51078K58803J27316
1276.8G29751885J72794J77383L79682Q52942J057029O30498J02162M77n364l52383
$$ plain form
1297.2 732767105 732040942 731365621 730916321 730422616 729781926 729293585 729092598 728966415 728915095 729303300
1317.6 729303300 730226457 731325150 732407689 733607113 734777749 735380113 735210896 734641135 733939886
1336 733939886 732900083 731518269 730412841 729918599 729629219 729197800 728810191 728638172 728371739
1354.3 728371739 727692485 726804554 725796402 724047065 721184850 717948616 715099454 712691426 710051298
1372.7 710051298 706584454 702899754 699863195 697364807 695073009 693256915 691916227 690552056
1389 690552056 689230084 688088298 686763644 685159445 683652699 682734728 682569981 682797313 683079600
1407.3 683079600 683337569 683394909 683210969 683210015 683691025 684273183 684468329 684401155 684053302 683074832
1427.7 683074832 681132138 678586900 676180661 673566878 670450032 667871058 666190684 665062726
$$ packed form
1297.2G32767105p26163o75321m49300m93705o40690m88341k00987j26183n1320L88205
1317.6G29303300R23157J098693J082539J199424J170636O02364j69217n69761p01249
1336G33939886j039803j381814j105428m94242k89380m31419l87609j72019k66433
1354.3G28371739o79254q87931j008152j749337k862215l236234k849162k408028k640128
1372.7G10051298l466844l684700l036559k498388k291798j816094j340688j364171
1389F90552056j321972j141786j324654j604199j506746r17971j64747K27332K82287
1407.3F83079600K57969N7340j83940r54M81010N82158J95146o7174l47853r78470
1427.7F83074832j942694k545238k406239k613783l116846k578974j680374j127958
$$ plain form
1444.1 665062726 664102733 662963152 661644399 660315096 659341276 659544647 661277056 663402855 665555239
1462.4 665555239 668189943 672490418 679980636 691203177 704572737 715305626 721798956 725489438
1478.7 725489438 726908684 726459682 724620342 721384168 716236055 709448338 702695310 695931613
1495 695931613 688081503 680048287 673129082 667395294 661329508 653131545 645427585 639270484 633737803
1513.4 633737803 629131734 625751674 623433113 621209323 618736982 616448224 614271879 612410605
1529.7 612410605 610996485 609859943 609211564 609365761 610117018 610908210 611875653 613301694 615317285
1548.1 615317285 618101835 621488273 625222206 629207551 634099483 638963401 642100573 645102859
1564.4 645102859 648649752 652509153 656248093 659120619 661770046 664569855 666490197 667625248
$$ packed form
1444.1F65062726r59993j139581j318753j329303r73820K03371J732409K125799K152384
1462.4F65555239K634704M300475P490218J1222541J3369560J0732889O493330L690482
1478.7G25489438J419246m49002j839340l236174n148113o787717o753028o763697
1495F95931613p850110q033216o919205n733788o065786q197963p703960o157101n532681
1513.4F33737803m606069l380060k318561k223790k472341k288758k176345j861274
1529.7F12410605j414120j136542o48379J54197P51257P91192R67443J426041K015591
1548.1F15317285K784550L386438L733933L985345M891932M863918L137172L002286
1564.4F45102859L546893L859401L738940K872526K649427K799809J920342J135051
$$ plain form
1580.7 667625248 668493688 669144273 669406712 669113815 668229699 666924059 665191650 662956178 660288990
1599.1 660288990 657239437 653684914 649442971 644448817 638582468 632017255 625120163 617149472
1615.4 617149472 607262313 597757757 588358700 576810181 564319670 552349627 541707873 534090042
1631.7 534090042 529295385 525771141 523107469 521362126 520391524 520156324 520508826 521059752 521725655
1650.1 521725655 523016989 524725616 526039481 527675509 530314326 533822179 537547410 541180491
1666.4 541180491 545487642 550410330 554902196 559620023 564801574 569675803 574449718 579950213
1682.7 579950213 586586475 592556834 597926676 603972495 610589921 619120657 629497766 640356123
1699 640356123 652323902 662300467 670705378 678972304 686095715 692371607 698184729 703797102
$$ packed form
1580.7F67625248Q68440O50585K62439k92897q84116j305640j732409k235472k667188
1599.1F60288990l049553l554523m241943m994154n866349o565213o897092p970691
1615.4F17149472r887159r504556r399057j1548519j2490511j1970043j0641754p617831
1631.7E34090042m794657l524244k663672j745343r70602k35200L52502N50926O65903
1650.1E21725655J291334J708627J313865J636028K638817L507853L725231L633081
1666.4E41180491M307151M922688M491866M717827N181551M874229M773915N500495
1682.7E79950213O636262N970359N369842O045819O617426Q530736J0377109J0858357
1699F40356123J1967779R976565Q404911Q266926P123411O275892N813122N612373
$$ plain form
1715.3 703797102 709411800 713909924 716739118 718540132 719264388 718503714 716028452 711415291 702850878
1733.7 702850878 690990269 678886473 665422499 652280569 643063724 639313936 642313600 652981341
1750 652981341 669776201 688328862 707461298 726017594 741735995 754845083 764638662 771657825
1766.3 771657825 777358532 781929195 785481036 788074195 790119231 792179227 794247508 796132982
1782.6 796132982 797933400 799635708 801228046 802853644 804395437 805514038 806475222 807554662
1799 807554662 808642328 809591293 810435414 811301231 812213957 813090444 813802779 814471006 815190613 815908790
1819.4 815908790 816610098 817346692 818077505 818741441 819366455 819829404 820184052 820615590 821133971 821663260
1839.8 821663260 822222531 822778463 823161781 823400795 823649943 823959053 824323356 824701011 825025380 825310349
$$ packed form
1715.3G03797102N614698M498124K829194J801014P24256p60674k475262m613161q564413
1733.7G02850878j1860609j2103796j3463974j3141930r216845l749788K999664J0667741
1750F52981341J6794860J8552661J9132436J8556296J5718401J3109088R793579P019163
1766.3G71657825N700707M570663L551841K593159K045036K059996K068281J885474
1782.6G96132982J800418J702308J592338J625598J541793J118601R61184J079440
1799H07554662J087666R48965Q44121Q65817R12726Q76487P12335O68227P19607P18177
1819.4H15908790P01308P36594P30813O63936O25014M62949L54648M31538N18381N29289
1839.8H21663260N59271N55932L83318K39014K49148L09110L64303L77655L24369K84969
$$ plain form
1860.2 825310349 825600207 825962842 826393962 826766729 826960981 827054739 827160835 827268600 827428758 827661633
1880.5 827661633 827873647 828038096 828276694 828591585 828777909 828824937 828932226 829114497 829245925 829335392
1900.9 829335392 829483628 829702735 829862773 829905689 829944015 830071628 830238700 830363333 830452502 830556870
1921.3 830556870 830623746 830565035 830514491 830604553 830710649 830696762 830669224 830774724 830925643 830964684 830910444
1943.8 830910444 830908477 830934584 830866754 830791712 830854833 830956340 830921233 830829024 830860674 830961406 830951452
1966.2 830951452 830858231 830832183 830860138 830812454 830707252 830685019 830724537 830676556 830567360 830587268 830701113
1988.7 830701113 830693543 830539286 830418825 830413461 830390334 830284894 830211043 830224276 830194950 830058575 829947650
2011.1 829947650 829943240 829919755 829792082 829673350 829629064 829568505 829416335 829279780 829268992 829269111 829157293
$$ packed form
1860.2H25310349K89858L62635M31120L72767J94252R3758J06096J07765J60158K32875
1880.5H27661633K12014J64449K38598L14891J86324M7028J07289J82271J31428Q9467
1900.9H29335392J48236K19107J60038M2916L8326J27613J67072J24633Q9169J04368
1921.3H30556870O6876n8711n0544R0062J06096j3887k7538J05500J50919L9041n4240
1943.8H30910444j967K6107o7830p5042O3121J01507l5107r2209L1650J00732r954
1966.2H30951452r3221k6048K7955m7684j05202k2233L9518m7981j09196J9908J13845
1988.7H30701113p570j54257j20461n364k3127j05440p3851J3233k9326j36375j10925
2011.1H29947650m410k3485j27673j18732m4286o0559j52170j36555j0788J19j11818
$$ plain form
2033.5 829157293 829056263 829089344 829122186 829019785 828896165 828904152 828933001 828824520 828688860 828695178 828749180
2056 828749180 828689754 828594506 828607559 828657866 828598976 828511477 828534484 828603625 828558862 828448951 828470290 828583479
2080.4 828583479 828584313 828499198 828542352 828699350 828740358 828648567 828644395 828757823 828798771 828736007 828751862 828892171
2104.9 828892171 828961074 828890324 828862607 828966081 829033673 828963399 828910649 828993976 829056203 828979433 828931093
2127.3 828931093 829027474 829133987 829129100 829126775 829243183 829344749 829300761 829249442 829338968 829462409 829460502
2149.8 829460502 829400718 829461157 829577744 829559982 829491615 829564750 829694152 829698622 829650283 829738677 829903066
2172.2 829903066 829935193 829875767 829915464 830036044 830059946 829995573 830025971 830150187 830172539 830095768 830133319
2194.6 830133319 830279171 830319524 830251753 830275834 830393910 830409944 830318451 830322921 830445349 830468476 830359638
$$ packed form
2033.5H29157293j01030L3081L2842j02401j23620P987K8849j08481j35660O318N4002
2056H28749180n9426r5248J3053N0307n8890q7499K3007O9141m4763j09911K1339J13189
2080.4H28583479Q34q5115M3154J56998M1008r1791m172J13428M0948o2764J5855J40309
2104.9H28892171O8903p0750k7717J03474O7592p0274n2750Q3327O2227p6770m8340
2127.3H28931093R6381J06513m887k325J16408J01566m3988n1319Q9526J23441j907
2149.8H29460502n9784O0439J16587j7762o8367P3135J29402M470m8339Q8394J64389
2172.2H29903066L2127n9426L9697J20580K3902o4373L0398J24216K2352p6771L7551
2194.6H30133319J45852M0353o7771K4081J18076J6034r1493M470J22428K3127j08838
$$ plain form
2217.1 830359638 830339849 830449164 830477297 830368996 830309093 830377579 830427587 830368340 830326200 830379367 830403507
2239.5 830403507 830319047 830256402 830310225 830336094 830223203 830124140 830159068 830186546 830091894 829993665 830003798
2262 830003798 830016971 829915464 829799116 829792440 829795003 829681337 829562008 829563320 829576313 829454422 829286516
2284.4 829286516 829235673 829235017 829117894 828952312 828895211 828876197 828748763 828547001 828402162 828291655 828096509
2306.8 828096509 827861547 827715278 827608645 827391863 827079594 826824546 826695979 826600969 826435506 826210082
2327.2 826210082 826042652 825951040 825798333 825610638 825493038 825384498 825254679 825263023 825460315 825502336
2347.6 825502336 825181186 824732542 824439228 824237466 823972642 823770225 823732495 823753715 823834777 823998272
2368 823998272 824145973 824232876 824300349 824379742 824467719 824538708 824557304 824521363 824438632 824312389 824171782
$$ packed form
2217.1H30359638j9789J09315K8133j08301n9903O8486N0008n9247m2140N3167K4140
2239.5H30403507q4460o2645N3823K5869j12891r9063L4928K7478r4652r8229J0133
2262H30003798J3173j01507j16348o676K563j13666j19329J312J2993j21891j67906
2284.4H29286516n0843o56j17123j65582n7101j9014j27434k01762j44839j10507j95146
2306.8H28096509k34962j46269j06633k16782l12269k55048j28567r5010j65463k25424
2327.2H26210082j67430r1612j52707j87695j17600j08540j29819Q344J97292M2021
2347.6H25502336l21150m48644k93314k01762k64824k02417l7730K1220Q1062J63495
2368H23998272J47701Q6903O7473P9393Q7977P0989J8596l5941q2731j26243j40607
$$ plain form
2390.4 824171782 824052036 823932767 823758543 823545992 823369622 823224723 823058248 822876871 822699606 822537959
2410.8 822537959 822378278 822196543 822013795 821838140 821643889 821449578 821277678 821103930 820912302 820721924
2431.2 820721924 820546865 820363164 820167661 819982171 819793344 819586754 819370151 819150448 818930149 818687797
2451.6 818687797 818422973 818197429 818011105 817797184 817540407 817284584 817052007 816812336 816560328 816320300
2472 816320300 816083014 815819502 815518320 815177739 814815223 814423442 813979089 813543677 813175499 812845945
2492.4 812845945 812534869 812275946 812079430 811881185 811620057 811347127 811128378 810908198 810644746 810387671
2512.8 810387671 810176969 809992909 809782803 809575260 809441805 809312224 809077799 808808208 808620334 808486164
2533.2 808486164 808303714 808070362 807888210 807754397 807553649 807283700 807065010 806931555 806777596 806557536
$$ packed form
2390.4H24171782j19746j19269j74224k12551j76370j44899j66475j81377j77265j61647
2410.8H22537959j59681j81735j82748j75655j94251j94311j71900j73748j91628j90378
2431.2H20721924j75059j83701j95503j85490j88827k06590k16603k19703k20299k42352
2451.6H18687797k64824k25544j86324k13921k56777k55823k32577k39671k52008k40028
2472H16320300k37286k63512l01182l40581l62516l91781m44353m35412l68178l29554
2492.4H12845945l11076k58923j96516j98245k61128k72930k18749k20180k63452k57075
2512.8H10387671k10702j84060k10106k07543j33455j29581k34425k69591j87874j34170
2533.2H08486164j82450k33352j82152j33813k00748k69949k18690j33455j53959k20060
$$ plain form
2553.6 806557536 806365073 806219399 806014895 805745542 805510104 805326223 805109680 804838419 804621518 804479420
2574 804479420 804272652 803952157 803654492 803446770 803205073 802884817 802620351 802452743 802236497 801919818
2594.4 801919818 801624358 801396787 801134288 800774992 800447822 800257683 800056219 799715459 799368382 799131930
2614.8 799131930 798890173 798531413 798165798 797918916 797679484 797312200 796902835 796589494 796319067 795955122
2635.2 795955122 795567989 795308650 795089364 794745982 794344068 794022381 793732524 793346107 792909741 792572856
2655.6 792572856 792295933 791915953 791464925 791109085 790821493 790454388 790055275 789781511 789573848 789254665
2676 789254665 788867295 788579166 788382232 788130879 787802935 787555575 787429512 787245750 786951244 786681354
2696.4 786681354 786443889 786129415 785753131 785439193 785197735 784880400 784421086 783948123 783536017 783072531
$$ packed form
2553.6H06557536j92463j45674k04504k69353k35438j83881k16543k71261k16901j42098
2574H04479420k06768l20495k97665k07722k41697l20256k64466j67608k16246l16679
2594.4H01919818k95460k27571k62499l59296l27170j90139k01464l40760l47077k36452
2614.8G99131930k41757l58760l65615k46882k39432l67284m09365l13341k70427l63945
2635.2G95955122l87133k59339k19286l43382m01914l21687k89857l86417m36366l36885
2655.6G92572856k76923l79980m51028l55840k87592l67105l99113k73764k07663l19183
2676G89254665l87370k88129j96934k51353l27944k47360j26063j83762k94506k69890
2696.4G86681354k37465l14474l76284l13938k41458l17335m59314m72963m12106m63486
$$ plain form
2716.8 783072531 782523811 782043278 781667411 781230032 780667126 780127823 779725075 779359460 778944135 778584063
2737.2 778584063 778315246 777984262 777540624 777121663 776790082 776426673 775961876 775520205 775172532 774773180
2757.6 774773180 774213731 773641765 773191273 772756517 772249460 771728277 771239698 770735085 770148396 769505739
2778 769505739 768871903 768233895 767554462 766876459 766226709 765530825 764732540 763901770 763122499 762329817
2798.4 762329817 761434317 760487795 759564996 758613408 757542491 756348908 755068302 753705561 752236128
2816.7 752236128 750653028 748961508 747084916 744877100 742283225 739377499 736184418 732591927
2833 732591927 728409767 723307788 716644049 707556069 695336044 679837644 661833048 643263996
2849.3 643263996 627278268 617386758 615589023 621121943 631072283 642059803 651495814 657940269
$$ packed form
2716.8G83072531n48720m80533l75867m37379n62906n39303m02748l65615m15325l60072
2737.2G78584063k68817l30984m43638m18961l31581l63409m64797m41671l47673l99352
2757.6G74773180n59449n71966m50492m34756n07057n21183m88579n04613n86689o42657
2778G69505739o33836o38008o79433o78003o49750o95884p98285q30770p79271p92682
2798.4G62329817q95500r46522r22799r51588j070917j193583j280606j362741j469433
2816.7G52236128j583100j691520j876592k207816k593875k905726l193081l592491
2833G32591927m182160n101979o663739r087980j2220025j5498400j8004596j8569052
2849.3F43263996j5985728r891510j797735N532920R950340J0987520R436011O444455
$$ plain form
2865.7 657940269 661184847 662276685 662973106 664562702 667058766 669640541 671520472 672271192 671775877
2884 671775877 670111716 667438507 663906693 659668207 654882967 649660349 644072235 638125002 631710529
2902.4 631710529 624642432 616687417 607572615 596997917 584678829 570572376 555226862 539900780
2918.7 539900780 526346385 516275704 510734677 509925663 513380349 520292401 529886663 541398704
2935 541398704 553939879 566587508 578494012 588885903 597074389 602567017 605297983 605791211
2951.3 605791211 605064690 604376495 604783714 606821835 610617995 616053760 622794688 630304813 638024092
2969.7 638024092 645600080 652807772 659482360 665636599 671337068 676533103 681158543 685214818
2986 685214818 688704252 691567421 693602681 694608927 694641709 693847954 692396283 690664113 689112782
$$ packed form
2865.7F57940269L244578J091838O96421J589596K496064K581775J879931P50720m95315
2884F71775877j664161k673209l531814m238486m785240n222618n588114n947233o414473
2902.4F31710529p068097p955015r114802j0574698j2319088j4106453j5345514j5326082
2918.7E39900780j3554395j0070681n541027q09014L454686O912052R594262J1512041
2935E41398704J2541175J2647629J1906504J0391891Q188486N492628K730966M93228
2951.3F05791211p26521o88195M07219K038121L796160N435765O740928P510125P719279
2969.7F38024092P575988P207692O674588O154239N700469N196035M625440M056275
2986F85214818L489434K863169K035260J006246L2782p93755j451671j732170j551331
$$ plain form
3004.4 689112782 688129127 688034952 688988030 690872967 693385601 696128666 698701978 700831711 702406228
3022.7 702406228 703415990 703929424 704111040 704108179 703958452 703634322 703170478 702643812 702016830 701256514
3043.1 701256514 700433552 699591637 698718905 697808087 696873724 695930600 694972932 694038451 693212569 692494929
3063.5 692494929 691827714 691210091 690677226 690240800 689882755 689591348 689331532 689041615 688719869 688416481
3083.9 688416481 688169777 688008308 687889636 687736750 687572539 687431037 687267840 687045097 686775982 686488152
3104.3 686488152 686193407 685858727 685427547 684946597 684502065 684047878 683481157 682775378 681988418 681180000
3124.7 681180000 680351198 679471791 678527892 677538097 676534832 675524175 674453676 673266053 671998501
3143 671998501 670712292 669419169 668160081 666917682 665560126 664063334 662518680 660973370 659449100
$$ packed form
3004.4F89112782r83655r4175R53078J884937K512634K743065K573312K129733J574517
3022.7G02406228J009762N13434J81616k861j49727l24130m63844n26666o26982p60316
3043.1G01256514q22962q41915q72732r10818r34363r43124r57668r34481q25882p17640
3063.5F92494929o67215o17623n32865m36426l58045k91407k59816k89917l21746l03388
3083.9F88416481k46704j61469j18672j52886j64211j41502j63197k22743k69115k87830
3104.3F86488152k94745l34680m31180m80950m44532m54187n66721p05779p86960q08418
3124.7F81180000q28802q79407r43899r89795j003265j010657j070499j187623j267552
3143F71998501j286209j293123j259088j242399j357556j496792j544654j545310j524270
$$ plain form
3161.4 659449100 657913566 656294942 654626548 652971864 651304781 649625719 647932708 646151662
3177.7 646151662 644315362 642503202 640698493 638890207 637100399 635319889 633506894 631669879
3194 631669879 629869461 628100038 626309097 624523044 622781813 621064901 619349360 617621899 615889788
3212.4 615889788 614169359 612480164 610817552 609110653 607355297 605615318 603875995 602112830
3228.7 602112830 600358248 598593652 596737266 594791710 592834592 590874434 588879406 586850762
3245 586850762 584770143 582627892 580482364 578353941 576207101 574035645 571839869 569639325 567499340
3263.4 567499340 565457284 563507318 561643302 559844434 558086455 556407630 554867923 553452492
3279.7 553452492 552118242 550864041 549720764 548701286 547781110 546920061 546078324 545268416 544527709
$$ packed form
3161.4F59449100j535534j618624j668394j654684j667083j679062j693011j781046
3177.7F46151662j836300j812160j804709j808286j789808j780510j812995j837015
3194F31669879j800418j769423j790941j786053j741231j716912j715541j727461j732111
3212.4F15889788j720429j689195j662612j706899j755356j739979j739323j763165
3228.7F02112830j754582j764596j856386j945556j957118j960158j995028k028644
3245E86850762k080619k142251k145528k128423k146840k171456k195776k200544k139985
3263.4E67499340k042056j949966j864016j798868j757979j678825j539707j415431
3279.7E53452492j334250j254201j143277j019478r20176q61049q41737q09908p40707
$$ plain form
3298 544527709 543843031 543211401 542649031 542116880 541553915 540957987 540373921 539817333 539267600 538700104
3318.4 538700104 538122773 537560403 536967278 536285043 535539448 534775734 534011960 533241093 532417178 531518340
3338.8 531518340 530558586 529545367 528495789 527435362 526362121 525205970 523948908 522677600
3355.2 522677600 521413982 520123541 518831551 517578781 516381204 515200973 513927817 512516975
3371.5 512516975 511109769 509863734 508756876 507681966 506618679 505642593 504771769 504021406 503391087
3389.8 503391087 502709270 501885653 501098633 500531077 500084817 499488473 498734474 498105466 497682124 497310251
3410.2 497310251 496899843 496470392 496103793 495870322 495756686 495718330 495772749 495940059 496196896 496526659
3430.6 496526659 496987402 497560531 498067409 498477548 498986542 499690562 500522912 501415730 502301812 503196418
$$ packed form
3298E44527709o84678o31630n62370n32151n62965n95928n84066n56588n49733n67496
3318.4E38700104n77331n62370n93125o82235p45595p63714p63774p70867q23915q98838
3338.8E31518340r59754j013219j049578j060427j073241j156151j257062j271308
3355.2E22677600j263618j290441j291990j252770j197577j180231j273156j410842
3371.5E12516975j407206j246035j106858j074910j063287r76086q70824p50363o30319
3389.8E03391087o81817q23617p87020n67556m46260n96344p53999o29008m23342l71873
3410.2D97310251m10408m29451l66599k33471j13636l8356N4419J67310K56837L29763
3430.6D96526659M60743N73129N06878M10139N08994P04020Q32350Q92818Q86082Q94606
$$ plain form
3451 503196418 504145622 505153000 506275415 507501304 508713305 509953439 511340201 512788713 514094174
3469.4 514094174 515226662 516425550 517847419 519381642 520873308 522334814 523853660 525432646
3485.7 525432646 527040899 528673589 530355990 532087147 533817708 535531700 537305653 539130270
3502 539130270 540872931 542531788 544276536 546171129 548125565 550078630 552011728 553964138 556041539
3520.4 556041539 558268070 560445249 562458158 564473450 566602409 568820477 571157515 573517025
3536.7 573517025 575776637 578127444 580663145 583200216 585567415 587806344 590156913 592675865
3553 592675865 595148325 597590685 600172639 602789998 605316222 608017325 611129045 614121199 616699874
3571.3 616699874 619311154 622162521 625143826 628212988 631295145 634313405 637437880 640842378
$$ packed form
3451E03196418R49204J007378J122415J225889J212001J240134J386762J448512J305461
3469.4E14094174J132488J198888J421869J534223J491666J461506J518846J578986
3485.7E25432646J608253J632690J682401J731157J730561J713992J773953J824617
3502E39130270J742661J658857J744748J894593J954436J953065J933098J952410K077401
3520.4E56041539K226531K177179K012909K015292K128959K218068K337038K359510
3536.7E73517025K259612K350807K535701K537071K367199K238929K350569K518952
3553E92675865K472460K442360K581954K617359K526224K701103L111720K992154K578675
3571.3F16699874K611280K851367K981305L069162L082157L018260L124475L404498
$$ plain form
3587.7 640842378 644141853 647067964 650042355 653231204 656393230 659490764 662549019 665459514
3604 665459514 668330014 671465695 674679458 677682579 680555403 683261693 686117411 689187825 691706717
3622.3 691706717 693640351 695708394 698720515 701847374 703883767 705656826 707567155 709417582
3638.7 709417582 711260974 713047385 714724958 716670334 719265342 721475244 722415149 723234653 724735677
3657 724735677 726086855 726978004 727869928 728796005 729743659 731087983 732450843 733180821 734094679
3675.4 734094679 735059381 735418022 735800445 736422658 737235963 738614678 740253270 741079986 741286576
3693.7 741286576 741545260 741930664 742432773 743141234 743734121 743995368 744306624 744998634 745860398 746148109
3714.1 746148109 745929122 745860636 746099770 746415496 746638596 746809244 746849835 746907413 747444272 748365998
$$ packed form
3587.7F40842378L299475K926111K974391L188849L162026L097534L058255K910495
3604F65459514K870500L135681L213763L003121K872824K706290K855718L070414K518892
3622.3F91706717J933634K068043L012121L126859K036393J773059J910329J850427
3638.7G09417582J843392J786411J677573J945376K595008K209902R39905Q19504J501024
3657G24735677J351178Q91149Q91924R26077R47654J344324J362860P29978R13858
3675.4G34094679R64702L58641L82423O22213Q13305J378715J638592Q26716K06590
3693.7G41286576K58684L85404N02109P08461N92887K61247L11256O92010Q61764K87711
3714.1G46148109k18987o8486K39134L15726K23100J70648M0591N7578N36859R21726
$$ plain form
3734.5 748365998 749015331 748932064 748275220 748001933 748796523 749295950 749179304 749605238 749997079 749694288
3754.9 749694288 749360561 749444604 749597967 749511123 749509215 749650121 749826729 749969780 749880552 749757826
3775.3 749757826 749903023 750226796 750285983 750095665 750036180 750042796 750006557 749967456 749930322 750011027 750071049
3797.7 750071049 750170946 750661671 750790834 750601768 750764072 750647426 750148535 749996901 750480831 750802934
3818.1 750802934 750886679 751125395 750878990 750417888 750189543 750112534 750225127 750344217 750505984 750847399
3838.5 750847399 750926495 750717819 750489116 750140131 749671459 749408007 750102639 751167238 750956893 750193655
3858.9 750193655 749795139 749863088 750054896 749920428 749861002 750097454 750069857 749841094 749534011 749453485
3879.3 749453485 749671817 749677181 749706268 749595404 749211550 749215603 749313831 749026716 748807251 748963475 749223173
$$ packed form
3734.5G48365998O49333q3267o56844k73287P94590M99427j16646M25934L91841l02791
3754.9G49694288l33727Q4043J53363q6844j908J40906J76608J43051q9228j22726
3775.3G49757826J45197L23773N9187j90318n9485O616l6239l9101l7134Q0705O0022
3797.7G50071049R9897M90725J29163j89066J62304j16646m98891j51634M83930L22103
3818.1G50802934Q3745K38716k46405m61102k28345p7009J12593J19090J61767L41415
3838.5G50847399P9096k08676k28703l48985m68672k63452O94632J064599k10345p63238
3858.9G50193655l98516O7949J91808j34468n9426K36452k7597k28763l07083q0526
3879.3G49453485K18332N364K9087j10864l83854M053R8228k87115k19465J56224K59698
$$ plain form
3901.8 749223173 749337196 749202490 748787582 748367786 748156250 748106956 748198211 748312950 748261809 748103082
3922.1 748103082 748018503 747956872 747807205 747752845 747840643 747775495 747528434 747335672 747277141 747289777 747231662
3944.6 747231662 747120976 747113705 747104049 746958315 746800244 746736050 746728063 746710658 746606886 746445954 746368051
3967 746368051 746367753 746332943 746288717 746266484 746190190 746099293 746082425 746090829 746012151 745858431 745759368 745745301
3991.5 745745301 745747209 745708883 745650589
3997.6 745650589
$$ packed form
3901.8G49223173J14023j34706m14908m19796k11536m9294R1255J14739n1141j58727
3922.1G48103082q4579o1631j49667n4360Q7798o5148k47061j92762n8531J2636n8115
3944.6G47231662j10686p271r656j45734j58071o4194p987j7405j03772j60932p7903
3967G46368051k98l4810m4226k2233p6294r0897j6868Q404p8678j53720r9063j4067
3991.5G45745301J908l8326n8294
3997.6G45650589
##END=$$ End of the data block
