##TITLE=Controle 1p2 $$ Begin of the data block
##JCAMP-DX=5.00 $$ ACD/SpecManager v 10.08
##SPECTROMETER/DATA SYSTEM=Alpha
##DATE=03 Sep 2014 08:47:40
##DATA TYPE=INFRARED SPECTRUM
##DATA CLASS=XYDATA
##ORIGIN=
##OWNER=
##NPOINTS=1765
##FIRSTX=399.76428223
##LASTX=3997.64306641
##MAXX=3997.64306641
##MINX=399.76428223
##MAXY=0.84756058
##MINY=0.51324493
##XFACTOR=1.0000000000
##YFACTOR=1.000000000000000e-9
##FIRSTY=0.80382729
##DELTAX=2.03961372
##XUNITS=1/CM
##YUNITS=ARBITRARY UNITS
##XYDATA=(X++(Y..Y))
399.8H03827286j186490j779735j108170k2173j121342j857519l9935Q51154o49214
418.1G96913862j330077p21813j619458j816094j15156j99377j389802k82705L05295
436.5G89744675j542628j355707N74708n05030j913131k11715P9095j989722j103580
454.8G81776965P88748j120627j766562P83205K60353j883149k68817R91284j339912
473.2G78221488j176476J233100k03013j792133O62506J015246j879156r79602J300871
491.5G76402831q56638k030134O90579M42684k126515n30362J037359j721203k111495
509.9G69197106P73192j55032k274334n6386Q37326k140820j715958J128077n20468
528.3G65072703k267480M79699J028537k018630j242221J336098p32600k213419Q27551
$$ plain form
399.8 803827286 802640796 800861061 799752891 799730718 798609376 796751857 796711922 797563076 796913862
418.1 796913862 795583785 794861972 793242514 791426420 791311264 791111887 789722085 789439380 789744675
436.5 789744675 788202047 786846340 787421048 786916018 785002887 784791172 784870267 782880545 781776965
454.8 781776965 782565713 781445086 779678524 780461729 780722082 778838933 778570116 779561400 778221488
473.2 778221488 777045012 778278112 778075099 776282966 776945472 777960718 776081562 775101960 776402831
491.5 776402831 775546193 773516059 774206638 774649322 772522807 771992445 773029804 771308601 769197106
509.9 769197106 769970298 769815266 767540932 767484546 768321872 766181052 764465094 765593171 765072703
528.3 765072703 762805223 763284922 764313459 762294829 761052608 762388706 761656106 759442687 760270238
546.6G60270238R67204k137601q01861J690268o77466j928031J015961P40111k121807
565G57017016l88085J672148j129150j865506J274824O11365j990438j2696J588405
583.3G56777883j079381j250565J540542K78175j974524M21882J553536j396299j150250
601.7G53720999J666784J46091j869917N28693J220405j727700j174033J858831Q05259
620G55175412l66748K428890K845704q1062O57558K839983O18458r75669J624584J683057
640.4G66450167j207471k62320J713037n24759j509130J346052J244187j289964J76132
658.8G66135931K109051k79308k311408j600623m5896R48489K151847K298534m97043
677.2G68909574j206041J531303J102746j214207K67983J658320p08699j276493J005471
$$ plain form
546.6 760270238 761237442 759099841 758297980 759988248 759310782 757382751 758398712 759138823 757017016
565 757017016 756628931 758301079 757171929 755306423 756581247 757192612 755202174 755189478 756777883
583.3 756777883 755698502 754447937 755988479 756266654 754292130 754714012 756267548 754871249 753720999
601.7 753720999 755387783 755533874 753663957 754192650 755413055 753685355 752511322 754370153 755175412
620 755175412 754808664 757237554 760083258 760002196 760659754 763499737 764118195 763142526 764767110 766450167
640.4 766450167 765242696 764980376 766693413 766168654 764659524 766005576 767249763 765959799 766135931
658.8 766135931 768244982 767965674 765654266 764053643 764007747 764956236 767108083 769406617 768909574
677.2 768909574 767703533 769234836 770337582 769123375 769391358 771049678 770340979 769064486 770069957
695.5G70069957L26216j533449M47214K055228p2241m76539J614511O42299j452446
713.9G71620750o4253P69674j212954l29912L136814L157139J705885L299951M179716
732.2G86262810J763940J188517K947628J986802L05354K028406L112435J128495J031637
750.6H01756024K800048J528859l63946J055479J791239k55168l29673J530170P12574
768.9H10225606o87778Q88467J805901J37747K74598K141178J408696J17719J583338
787.3H17895472K272785N46098O38186K260328J371681k9921J103222J594782o735
805.6H27645898J24752J744271J165867J69694J471281K080023O54519O07431J708507
824H37372243P51257n82575K09689N21063q26478o97553P57814M78148k16722R55283
$$ plain form
695.5 770069957 770396173 768862724 769309938 771365166 771292925 770816386 772430897 773073196 771620750
713.9 771620750 771556497 772326171 771113217 770783305 773920119 777077258 778783143 782083094 786262810
732.2 786262810 788026750 789215267 792162895 794149697 794455051 796483457 799595892 800724387 801756024
750.6 801756024 804556072 806084931 805720985 806776464 808567703 808312535 807982862 809513032 810225606
768.9 810225606 809537828 810426295 812232196 812369943 812644541 814785719 816194415 816312134 817895472
787.3 817895472 820168257 820714355 821352541 823612869 824984550 824954629 826057851 827652633 827645898
805.6 827645898 827770650 829514921 830680788 830850482 832321763 834401786 835056305 835663736 837372243
824 837372243 838123500 837540925 837750614 838271677 837445199 836747646 837505460 837983608 837766886 838722169
844.4H38722169J557947L10480J67966J243174P88510j27435N66542Q88765k98798
862.8H43819320n33342K39372l52502j294672o97255l01958j119375r19699L13699
881.1H39153588K30968m37558J74761O17266k63155m79221K93016O080p60734k82109
901.5H38252902J91093m42625m92632L65257K56419m27186m8578L52562l65675o85036
921.9H36956501p7128k65301j052797p87019l27647r10521j191854o04808p49827j528799
942.3H29460800j399756j034975j618028k010464j564384j736521k601922k683699
958.6H14811051k453506l031194l353596k698302k465010k895355k649427k171755
974.9G93092906k622723l064692k694309k654731l178656l032685k510547k709687
$$ plain form
844.4 838722169 840280116 840590596 840758562 842001736 842790246 842662811 843229353 844118118 843819320
862.8 843819320 843285978 843525350 843172848 841878176 841180921 840878963 839759588 838839889 839153588
881.1 839153588 839384556 838946998 839121759 839739025 839475870 838996649 839289665 839295745 838535011 838252902
901.5 838252902 838443995 838001370 837508738 837873995 838130414 837703228 837654650 838007212 837641537 836956501
921.9 836956501 836879373 836614072 835561275 834774256 834446609 833536088 832344234 831739426 830989599 829460800
942.3 829460800 828061044 827026069 825408041 823397577 821833193 820096672 817494750 814811051
958.6 814811051 812357545 809326351 805972755 803274453 800809443 797914088 795264661 793092906
974.9 793092906 790470183 787405491 784711182 782056451 778877795 775845110 773334563 770624876
991.3G70624876k972782k597689k538741l081858l144801k893567l345549l871143
1007.6G46178746l635406l503561l889203l767610l174305l139377l266990k835989
1023.9G18966305k600491k910495k770245k146661k058685k190113j780152j575947
1040.2G00933516k041101k210975j940370k071500k292037j920461j618028j865566
1056.5F84973478j799225j291037j247823j434923j118302q41796j047612r90390n45740
1074.9F74656630m37856m72546J4305N94497P19011R25064J410246J509428J447737
1093.2F80366516K014995K737224K944588L143192L525913L330588K540946J890600
1109.6G02494562J228869K65002j86384K86639R46939J571417K361536K564370J638592
$$ plain form
991.3 770624876 767652094 765054405 762515664 759433806 756289005 753395438 750049889 746178746
1007.6 746178746 742543340 739039779 735150576 731382966 728208661 725069284 721802294 718966305
1023.9 718966305 716365814 713455319 710685074 708538413 706479728 704289615 702509463 700933516
1040.2 700933516 698892415 696681440 694741070 692669570 690377533 688457072 686839044 684973478
1056.5 684973478 683174253 681883216 680635393 679200470 678082168 677240372 676192760 675202370 674656630
1074.9 674656630 674218774 673746228 673760533 674355030 675074041 675999105 677409351 678918779 680366516
1093.2 680366516 682381511 685118735 688063323 691206515 694732428 698063016 700603962 702494562
1109.6 702494562 703723431 703988433 703802049 704088688 705035627 706607044 708968580 711532950 713171542
1127.9G13171542M53293n26845j841307l058732l205716k682329k243936j614928p79807
1146.3F97671235n05031p10368n87523k74360k29657N0307Q65578J552165J968324
1164.6F99800670K675295L449261L820420M284441N063295N378604N112291M973471
1180.9G34557748M852891M257142L652335L449678L081620K368688J925528J631141
1197.3G59776771Q96037J36196j63018n13018j080989j245261j149416j403927j690984
1215.6G53562391j656950j803338k251983k416491k358258k524615k584397k201319
1231.9G35765040j884043j827836j453698p19786j63257L40939J117050J670361J623988
1250.3G34468758J423299J281619R33767O48439Q18729J052678J043677J177669J440763
$$ plain form
1127.9 713171542 713624835 713097990 711256683 708197951 704992235 702309906 700065970 698451042 697671235
1146.3 697671235 697166204 696455836 695868313 695593953 695364296 695414603 696280181 697832346 699800670
1164.6 699800670 702475965 705925226 709745646 714030087 719093382 724471986 729584277 734557748
1180.9 734557748 739410639 743667781 747320116 750769794 753851414 756220102 758145630 759776771
1197.3 759776771 760672808 760809004 760645986 760132968 759051979 757806718 756657302 755253375 753562391
1215.6 753562391 751905441 750102103 747850120 745433629 743075371 740550756 737966359 735765040
1231.9 735765040 733880997 732053161 730599463 729879677 729716420 730057359 731174409 732844770 734468758
1250.3 734468758 735892057 737173676 738107443 738755882 739574611 740627289 741670966 742848635 744289398
1268.6G44289398J257837P62224N34535M17709J67549K81095Q79944J216411J057267
1287G50863969Q81017O61552J63316j56760j19626k53201m92871l24309n3286j58072
1307.4G51011729k47955j907J62541J95206N75959J069665J184225J231790J459777
1325.8G56641030J345635P33495K31504p7367o01828j102447j109303q66532o91950
1344.1G54502237m06623q9347j31131k67684j35303j75953n65230r08375j420736k349854
1364.5G48052001k871692k570927k047301k301991l256082l430307k564371j778543
1380.8G27230787j362860q36492m38451m09723l17931m55141j006663j115322q17418
1399.2G20470786m71651L14056J235187J416684R09567M10676K07781L47078Q75652
$$ plain form
1268.6 744289398 745547235 746309459 746843994 747261703 747429252 747710347 748590291 749806702 750863969
1287 750863969 751744986 752406538 752569854 752413094 752293468 752040267 751547396 751223087 751169801 751011729
1307.4 751011729 750763774 750761867 750924408 751119614 751695573 752765238 753949463 755181253 756641030
1325.8 756641030 757986665 758720160 758951664 758874297 758272469 757170022 756060719 755194187 754502237
1344.1 754502237 754095614 754006267 753875136 753607452 753472149 753296196 752730966 751822591 750401855 748052001
1364.5 748052001 745180309 742609382 740562081 738260090 735004008 731573701 729009330 727230787
1380.8 727230787 725867927 725031435 724592984 724183261 723865330 723410189 722403526 721288204 720470786
1399.2 720470786 719999135 720313191 721548378 722965062 723874629 724285305 724493086 724840164 725715816
1417.5G25715816J462817J435280R72092M10915k88964j425326k341210k242327k452672
1435.9G21246421l128349k508700j544118j245439j221598j285851j674115k211273
1452.2G06426978j990199q42035K98023Q18134J296460J853168L491879P324815J1887431
1470.6G30564654J4073074J0755241O170571L359615R80676r74536k206326l506541
1486.9G59216428n491376p008970o735980o776333p942617p933796o752789n594909
1503.2G04979658n821705q074403p886409o228566n237639m246295l369510k403021
1519.5F61712110k142489k484381k482832k287447j731813j311719j235068o34134
1535.8F47402227K74897N01394L38673O86050J181066J911223K768695L231824L524601
$$ plain form
1417.5 725715816 727178633 728613913 729586005 729996920 729707956 728282630 725941420 723699093 721246421
1435.9 721246421 718118072 715609372 714065254 712819815 711598217 710312366 708638251 706426978
1452.2 706426978 704436779 703594744 703892767 704710901 706007361 707860529 711352408 718677223 730564654
1470.6 730564654 744637728 755392969 761563540 764923155 765903831 764929295 762722969 759216428
1486.9 759216428 753725052 746716082 739980102 733203769 725261152 717327356 710574567 704979658
1503.2 704979658 699157953 691083550 683197141 676968575 671730936 667484641 664115131 661712110
1519.5 661712110 659569621 657085240 654602408 652314961 650583148 649271429 648036361 647402227
1535.8 647402227 647677124 648178518 648517191 649203241 650384307 652295530 655064225 658296049 661820650
1554.2F61820650M026651M722834L976524K702475L074884L463268L304184L100276
1570.5F90191746K706229K446354K042472J342893R10997N08786K38239m5836o43909
1588.9F99697971j233637j516998j999497k628803k891422l119170l769279m458129
1605.2F78081036m944802n827367o712914o845057p697999r895504r585082r103596
1621.5F17468715j1183858j2481094j2196600j0774791p448733m411161l198743k481341
1637.8E53292394j571358p00175J94311P11024P44819J077473J693905J585901J385390
1656.2E58413684K148629L151714L811896M053831M113973M559159M904389M711807
1672.5E89869082M971564N121112M910290N108714N638957O122351N586505N357265
$$ plain form
1554.2 661820650 665847301 670570135 674546659 677249134 680324018 683787286 687091470 690191746
1570.5 690191746 692897975 695344329 697386801 698729694 699640691 700149477 700387716 700341880 699697971
1588.9 699697971 698464334 696947336 694947839 692319036 689427614 686308444 682539165 678081036
1605.2 678081036 673136234 667308867 660595953 653750896 646052897 636157393 626572311 617468715
1621.5 617468715 606284857 593803763 581607163 570832372 563383639 558972478 555773735 553292394
1637.8 553292394 551721036 551020861 551215172 551926196 552671015 553748488 555442393 557028294 558413684
1656.2 558413684 560562313 563714027 567525923 571579754 575693727 580252886 585157275 589869082
1672.5 589869082 594840646 599961758 604872048 609980762 615619719 621742070 627328575 632685840
1688.8F32685840N914211O494642Q342504R911955J0139465J0905087R123325P606089
1705.1G01123118P288576O334602N583764N195796N200028N004764L627181K249599
1721.5G41607428J352489q0645j974106l766716n987882j1018336j4919639j4292717
1737.8F90919876j5472889j5078306j0289371l804565L719032J1952579J8593550K0606279
1754.1G01146185K1180690K0512640J7406404J4258743J0506093P658422O221831M873335
1770.4H03764343L786683K882064K202034K002835K003133J789093J459301J363039
1786.7H21252525J593351J605690J161813Q45314R50098R50872Q39592Q25703P70270
1805.1H30795228P28786Q01206P87258N36680N01633O92010P05898O02841O78897P30634
$$ plain form
1688.8 632685840 638600051 645094693 653437197 663349152 673488617 684393704 693517029 701123118
1705.1 701123118 708411694 714746296 720330060 725525856 730725884 735730648 739357829 741607428
1721.5 741607428 742959917 742879272 740905166 737138450 731150568 720132232 705212593 690919876
1737.8 690919876 675446987 660368681 650079310 646274745 649993777 661946356 680539906 701146185
1754.1 701146185 722326875 742839515 760245919 774504662 785010755 792669177 798891008 803764343
1770.4 803764343 807551026 810433090 812635124 814637959 816641092 818430185 819889486 821252525
1786.7 821252525 822845876 824451566 825613379 826458693 827408791 828359663 829199255 830024958 830795228
1805.1 830795228 831524014 832325220 833112478 833649158 834150791 834842801 835548699 836151540 836830437 837561071
1825.5H37561071N95570M58061L62993L58223L26992L54945M98593N97656M73261K57611
1845.9H41844976K05457J83582K11001K87354K59459K00331K95580L50475L08752L65555
1866.3H44512522L28839J0908j29640R8764K58148J63257Q2493J51336J71066J67787
1886.7H45815480K30729K06411Q7500J5437L5406O4551N8175J11460K19822J80066
1907.1H47025037L2306j669N5611J09255J46270J40011M9055r6143j12116%j013j7047
1931.5H47329557Q1837Q3745k6286J1861P9871n7936j23918N543N8591l9577p7486
1954H47325802j7166m7207r3401J9849J14858j2696j36018p1525l4571q1301j7106
1976.4H46949518M7326q0764j45615j0430K1636o6042j4126K1100j37448k07842o1452
$$ plain form
1825.5 837561071 838156641 838614702 838977695 839335918 839662910 840017855 840516448 841114104 841587365 841844976
1845.9 841844976 842050433 842234015 842445016 842732370 842991829 843192160 843487740 843838215 844146967 844512522
1866.3 844512522 844841361 844852269 844722629 844821393 845079541 845242798 845325291 845476627 845647693 845815480
1886.7 845815480 846046209 846252620 846340120 846355557 846390963 846455514 846513689 846625149 846844971 847025037
1907.1 847025037 847057343 847055674 847111285 847220540 847366810 847506821 847555876 847459733 847347617 847347617 847346604 847329557
1931.5 847329557 847411394 847495139 847468853 847480714 847560585 847502649 847378731 847384274 847442865 847403288 847325802
1954 847325802 847308636 847261429 847168028 847187877 847302735 847290039 847154021 847082496 847047925 846966624 846949518
1976.4 846949518 846996844 846916080 846770465 846760035 846781671 846715629 846701503 846722603 846585155 846377313 846315861
1998.8H46315861J0669r6500q9168J0788p1645j75595o0558R656j38104j60993l0994
2021.3H45523417r0599k02417p3731L7431o3121q5294K9504j7524j42574n0545L3260
2043.7H44897807r5606j01209Q5175M2558j57595q2850O1869o0141j04248R1672P3015
2066.2H44650447j35243q3863Q7678K0325m5120J03294J02282r2685m5240J32084N9187
2088.6H44753146j9014J17541J19269q8454n5790J54257P9751o5684P6771J46150m8339
2111H45169604n1856J25766N9783o5923O9261J26839o3122n5492J58191J16468m3989
2133.5H45545530P3552J56165n1380r3996J22309R1612r8884L1769J95205J4007q9466
2155.9H45896423R2983J05560n4717L6061J81079M232j00017J21176J55628m9889m232
$$ plain form
1998.8 846315861 846326530 846230030 846140862 846151650 846080005 845904410 845843852 845853508 845715404 845554411 845523417
2021.3 845523417 845432818 845230401 845156670 845194101 845130980 845045686 845075190 845057666 844915092 844864547 844897807
2043.7 844897807 844802201 844700992 844786167 844828725 844671130 844588280 844650149 844590008 844485760 844577432 844650447
2066.2 844650447 844515204 844431341 844519019 844539344 844494224 844597518 844699800 844607115 844561875 844693959 844753146
2088.6 844753146 844734132 844851673 844970942 844882488 844826698 844980955 845060706 844995022 845071793 845217943 845169604
2111 845169604 845117748 845243514 845303297 845237374 845306635 845433474 845370352 845314860 845473051 845589519 845545530
2133.5 845545530 845619082 845775247 845723867 845629871 845752180 845843792 845744908 845776677 845971882 845985889 845896423
2155.9 845896423 845989406 846094966 846040249 846076310 846257389 846261621 846161604 846282780 846438408 846388519 846384287
2178.3H46384287J45912J3292p5340J12474J29818n9247K3485K01046L3260j27197
2198.7H46781790N3525J34349l5763k682J48594P213j31727M8757J27673o6697o2109
2221.2H47002923J23978L2246j51455l6478O9439o6757o4254Q8454k265j58370l7730
2243.6H46799731P5758n6446j04070J4544n4419k23041j25527K6464p5638j30176M589
2266H46151769k9206j70052q4758M2439j9491l0637J03116O2466j73927k77757k79725
2288.5H45294237m09722m79818l50534l54171n54383n91755n34296p32243r67980r43064
2308.9H39376271q96096r30012q84652j023650j489878j642406j169562q05795j002372
2327.2H29531848j176655q07822m03046n03957o36518n44906l87848L68655J980782
$$ plain form
2178.3 846384287 846530199 846543491 846468151 846580625 846710443 846651196 846674681 846875727 846908987 846781790
2198.7 846781790 846835315 846969664 846933901 846931219 847079813 847087026 846955299 847004056 847131729 847065032 847002923
2221.2 847002923 847126901 847159147 847007692 846971214 847040653 846973896 846909642 846998096 846995831 846837461 846799731
2243.6 846799731 846875489 846819043 846714973 846729517 846675098 846452057 846326530 846352994 846277356 846147180 846151769
2266 846151769 846122563 845952511 845867753 845910192 845890701 845860064 845963180 846025646 845851719 845573962 845294237
2288.5 845294237 844884515 844404697 844054163 843699992 843145609 842553854 842019558 841287315 840319335 839376271
2308.9 839376271 838480175 837550163 836665511 835641861 834151983 832509577 831340015 830534220 829531848
2327.2 829531848 828355193 827547371 827144325 826640368 826003850 825458944 825071096 825439751 827420533
2345.6H27420533K335906L36468k206087l514826l262163k304017j099587J7524J020789
2363.9H18744540J894832K358675K473891K519488K539396K465844K353430K231479
2380.2H37581575J865268J203060N93781K80679R8943q7797j28389p1347j48952k40743
2400.6H40946078j66595r4890j43111j56641r2447j35660k43664j96516r3997j30176
2421H39492381j73629j22249j59502k57194j95146q9228j33693j91152j51038j53840
2441.4H37865710k26855k14398j48833j84536k22146j59979j53899k48790k53439j73628
2461.8H35879207j95682k45512j80721j51396k63274k95818j92463j76489k19703j83106
2482.2H33775043j87873k94805l10004k02417j86920k49863k01166j66356k79307l09825
$$ plain form
2345.6 827420533 829756439 830092907 827886820 824371994 821109831 818805814 817706227 817723751 818744540
2363.9 818744540 820639372 822998047 825471938 827991426 830530822 832996666 835350096 837581575
2380.2 837581575 839446843 840649903 841243684 841524363 841623306 841535509 841407120 841335773 841186821 840946078
2400.6 840946078 840779483 840684593 840541482 840384841 840292394 840156734 839913070 839716554 839622557 839492381
2421 839492381 839318752 839196503 839037001 838779807 838584661 838495433 838361740 838170588 838019550 837865710
2441.4 837865710 837638855 837424457 837275624 837091088 836868942 836708963 836555064 836306274 836052835 835879207
2461.8 835879207 835683525 835438013 835257292 835105896 834842622 834546804 834354341 834177852 833958149 833775043
2482.2 833775043 833587170 833292365 832982361 832779944 832593024 832343161 832141995 831975639 831696332 831386507
2502.6H31386507j88232j59562k30729k07722j51813k19941k82407j98841j44899k11299
2523H29391062k04503j36078k14576l09229k10703j20878j77383j82689j27792k05636
2543.4H27501595k83778j72674r6798j77741j95086j54496k15292k63094j86623j52289
2563.8H25603724k28048k07722j05083j73509k99513k43545j64568k26558k48909j74284
2584.2H23531985k24292l36647k57790j30713j83344k56836k19524k41757l35753k94029
2604.6H21051300j95682k47479l02732k29597k42949l59773l22879k34305k96176l16083
2625H18303645k27988k72751m09603l71397k36809k60889l28899k79069k84433l67940
2645.4H15263867l36647k60949k97487l43442l02672l14414m08292m02570k95341k80976
$$ plain form
2502.6 831386507 831198275 831038713 830807984 830600262 830448449 830228508 829946101 829747260 829602361 829391062
2523 829391062 829186559 829050481 828835905 828526676 828315973 828195095 828017712 827835023 827707231 827501595
2543.4 827501595 827217817 827045143 826948345 826770604 826575518 826421022 826205730 825942636 825756013 825603724
2563.8 825603724 825375676 825167954 825062871 824889362 824589849 824346304 824181736 823955178 823706269 823531985
2584.2 823531985 823307693 822971046 822713256 822582543 822399199 822142363 821922839 821681082 821345329 821051300
2604.6 821051300 820855618 820608139 820305407 820075810 819832861 819473088 819150209 818915904 818619728 818303645
2625 818303645 818075657 817802906 817393303 817021906 816785097 816524208 816195309 815916240 815631807 815263867
2645.4 815263867 814927220 814666271 814368784 814025342 813722670 813408256 812999964 812597394 812302053 812021077
2665.8H12021077l48389l14177k40922k77698k74837j75535j79887k50816k21968j91331
2686.2H09545517k48134k37703j45495j47641k15411k09987k05756l00109l45051k74957
2706.6H07215273k78771l75926m00841l78728m32790m74751m02867l63648m36187m69148
2727H03201616m29154m17888m01616l09884k46108k90394l33607l18587l09646l14415
2747.4G99830317l04937l32177m13298m26829l78609m11927m75884m53532m10735m29929
2767.8G95792460m53114m29511m52280n57900o15835o13689o51300o70195o12080o06179
2788.2G90130377p22408p84040p38323p64072q46684q68499r08315j017928j051665
2806.5G82428443j020431j129031j310826j389086j486480j711428j920522k088546
$$ plain form
2665.8 812021077 811672688 811358511 811117589 810839891 810565054 810389519 810209632 809958816 809736848 809545517
2686.2 809545517 809297383 809059680 808914185 808766544 808551133 808341146 808135390 807835281 807490230 807215273
2706.6 807215273 806936502 806560576 806159735 805781007 805348217 804873466 804470599 804106951 803670764 803201616
2727 803201616 802772462 802354574 801952958 801643074 801396966 801106572 800772965 800454378 800144732 799830317
2747.4 799830317 799525380 799193203 798779905 798353076 797974467 797562540 797086656 796633124 796222389 795792460
2767.8 795792460 795339346 794909835 794457555 793899655 793283820 792670131 792018831 791348636 790736556 790130377
2788.2 790130377 789407969 788623929 787885606 787121534 786274850 785406351 784498036 783480108 782428443
2806.5 782428443 781408012 780278981 778968155 777579069 776092589 774381161 772460639 770372093
2822.8G70372093k390504k809167l175259l539085m038692m693031n700827p529437
2839.1G36496091j0350227j3846338j7485976k0280600k0751834j7626047j0709167
2853.4F25445902j580655O828189J1956811J3125181J1365354Q084655M465162J865149
2869.7F81555748J333952K300382L126084K988398K090335P75040o69539j974583l088117
2888.1F88437700m069924m826069n308986n730390o216943o651283p112264p888437
2904.4F40633404q987367j0266840j1850179j3831317j5819848j7114877j7021478
2918.7E45741498j5001893j1042416n900323n51939M270911Q119822J1009454J3096571
2935E49741685J4268995J4390707J3543009J1846185R361208O251037L091693P05421
$$ plain form
2822.8 770372093 767981589 765172422 761997163 758458078 754419386 749726355 744025528 736496091
2839.1 736496091 726145864 712299526 694813550 674532950 653781116 636155069 625445902
2853.4 625445902 623865247 630693436 642650247 655775428 667140782 675225437 679690599 681555748
2869.7 681555748 682889700 685190082 688316166 691304564 693394899 694169939 693500400 691525817 688437700
2888.1 688437700 684367776 679541707 674232721 668502331 662285388 655634105 648521841 640633404
2904.4 640633404 631646037 621379197 609529018 595697701 579877853 562762976 545741498
2918.7 545741498 530739605 519697189 513796866 513244927 517515838 525635660 536645114 549741685
2935 549741685 564010680 578401387 591944396 603790581 613151789 619402826 622494519 623199940
2951.3F23199940m89891m36485P51615K643704M646719O376982P754564Q609056Q762896
2969.7F61819100Q460522P957399P253945O524265N947351N354881M647255M005850
2986G11970568L448009K767742J850128Q05020k08974j200497j956582k140462j852512
3004.4G13482440j204312r0540J274884K363145K968371L232181L112853K578139J938820
3022.7G29655981J385272Q63015M68910K70069J04725j70350l90589l96967m47095
3041.1G31342971o18994p03752p28190p71046q04424q13186q41141r02235q82626p54475
3061.5G23522902o34015n41449m53233m40717m43101l03567j28388j07407k09153k73526
3081.9G19988346k69532k65241j84893q4401j34468j87337j22845j03772j96040k80618
$$ plain form
2951.3 623199940 622710049 622273564 623025179 625668883 630315602 636692584 644447148 653056204 661819100
2969.7 661819100 670279622 678237021 685490966 692015231 697962582 703317463 707964718 711970568
2986 711970568 715418577 718186319 720036447 720841467 720632493 719431996 717475414 715334952 713482440
3004.4 713482440 712278128 712187588 713462472 715825617 718793988 722026169 725139022 727717161 729655981
3022.7 729655981 731041253 731904268 732373178 732643247 732747972 732577622 732187033 731790066 731342971
3041.1 731342971 730723977 730020225 729292035 728520989 727716565 726903379 726062238 725160003 724277377 723522902
3061.5 723522902 722888887 722347438 721894205 721453488 721010387 720706820 720578432 720471025 720261872 719988346
3081.9 719988346 719718814 719453573 719268680 719184279 719049811 718862474 718739629 718635857 718439817 718159199
3102.2G18159199k83659k56419k80261l64661m12226l86774l72589m60208o84201q63612
3122.6G13794589q34763p65204q04306q80777r22621r36508r30965r50217j081526
3141G05687702j242578j259506j186371j152456j184702j318872j492679j541018j458884
3159.4F93850636j411080j492560j581251j582861j591146j637400j644730j638889
3175.7F81270719j696945j754343j750589j741767j780509j800716j764119j781881
3192F67199850j829982j781702j731694j778543j782774j716197j691520j702011j703501
3210.3F51481926j709580j724601j697123j680374j745224j788855j762092j745104
3226.7F37628973j762748j753330j750052j887382k034366k000391j933515j957298
$$ plain form
3102.2 718159199 717875540 717619121 717338860 716974199 716561973 716175199 715802610 715342402 714658201 713794589
3122.6 713794589 712959826 712194622 711390316 710509539 709586918 708650410 707719445 706769228 705687702
3141 705687702 704445124 703185618 701999247 700846791 699662089 698343217 696850538 695309520 693850636
3159.4 693850636 692439556 690946996 689365745 687782884 686191738 684554338 682909608 681270719
3175.7 681270719 679573774 677819431 676068842 674327075 672546566 670745850 668981731 667199850
3192 667199850 665369868 663588166 661856472 660077929 658295155 656578958 654887438 653185427 651481926
3210.3 651481926 649772346 648047745 646350622 644670248 642925024 641136169 639374077 637628973
3226.7 637628973 635866225 634112895 632362843 630475461 628441095 626440704 624507189 622549891
3243F22549891k021491k116740k204895k210736k158821k135873k170205k196014k160430
3261.3F03174686k101063k046824j956463j857996j846969j828670j710058j584112
3277.7E88242531j480520j370728j271963j205266j130879r96947r01341r22144r23991
3296E78038752q54850p83145o79910n66960n78463p21633q19743p94589p28429o94632
3316.4E70816398p08640p33197p48574p67827q31783r23574r79066j013160j010775
3334.8E63099802j010478j107812j231015j292169j327753j320422j270174j365722
3351.1E53174257j573980j635015j572489j539469j560688j578987j516819j469075
3367.4E40727735j578331j745880j769781j623512j450359j343251j286447j210868
$$ plain form
3243 622549891 620528400 618411660 616206765 613996029 611837208 609701335 607531130 605335116 603174686
3261.3 603174686 601073623 599026799 597070336 595212340 593365371 591536701 589826643 588242531
3277.7 588242531 586762011 585391283 584119320 582914054 581783175 580786228 579884887 578962743 578038752
3296 578038752 577183902 576400757 575720847 575153887 574575424 573853791 573034048 572239459 571511030 570816398
3316.4 570816398 570107758 569374561 568625987 567858160 567026377 566102803 565123737 564110577 563099802
3334.8 563099802 562089324 560981512 559750497 558458328 557130575 555810153 554539979 553174257
3351.1 553174257 551600277 549965262 548392773 546853304 545292616 543713629 542196810 540727735
3367.4 540727735 539149404 537403524 535633743 534010231 532559872 531216621 529930174 528719306
3383.7E28719306j102924r60589p97331q31425j036287j007855p06732n63562p98285
3402.1E20914316r95159q01921n44250m78864m92811n22136m85063l14295j77265j37865
3422.5E15964687n0902J06871K69353L60966M75645O16133N36084L61324M32431O84917
3442.9E19757509Q70943R24528R27687R94384J079798J138687J245260J346111J311183
3461.2E29596090J319409J533329J657367J444876J188755J261473J510143J697660
3477.5E41209102J726687J618743J627266J779139J806557J709819J724541J839161
3493.8E55041015J913488J924694J944184J920700J797795J756370J877427J996160
3510.2E70171833K078414K107084K024472K007842K201557K408743K303183K106786
$$ plain form
3383.7 528719306 527616382 526655793 525858462 525027037 523990750 522982895 522276163 521712601 520914316
3402.1 520914316 519919157 519117236 518572986 518094122 517601311 517079175 516594112 516279817 516102552 515964687
3422.5 515964687 515913785 516020656 516290009 516650975 517126620 517742753 518278837 518640161 519072592 519757509
3442.9 519757509 520628452 521552980 522480667 523475051 524554849 525693536 526938796 528284907 529596090
3461.2 529596090 530915499 532448828 534106195 535551071 536739826 538001299 539511442 541209102
3477.5 541209102 542935789 544554532 546181798 547960937 549767494 551477313 553201854 555041015
3493.8 555041015 556954503 558879197 560823381 562744081 564541876 566298246 568175673 570171833
3510.2 570171833 572250247 574357331 576381803 578389645 580591202 582999945 585303128 587409914
3526.5E87409914K155303K280951K366483K470494K474725K391398K512097K753258
3542.8F06814623K747178K448440K300620K452016K555608K538622K602815K753496
3559.1F27213418K828956K836228K896487K970815K885163K784908K844572K965808
3575.4F50226355L104686L259540L330946L379643L397047L210426L030002L078520
3591.7F76017165L244817L325940L316938L308893L241777L179431L224135L316164
3608.1G02175260L269374L135622L039360K884507K739310K633095K454459K423346
3624.4G24754333K560199K631247K440095K163350K146781K145827K007425J973152
3640.7G42822409K073168K130330K103508J938223J465679J059234J092851J330793
$$ plain form
3526.5 587409914 589565217 591846168 594212651 596683145 599157870 601549268 604061365 606814623
3542.8 606814623 609561801 612010241 614310861 616762877 619318485 621857107 624459922 627213418
3559.1 627213418 630042374 632878602 635775089 638745904 641631067 644415975 647260547 650226355
3575.4 650226355 653331041 656590581 659921527 663301170 666698217 669908643 672938645 676017165
3591.7 676017165 679261982 682587922 685904860 689213753 692455530 695634961 698859096 702175260
3608.1 702175260 705444634 708580256 711619616 714504123 717243433 719876528 722330987 724754333
3624.4 724754333 727314532 729945779 732385874 734549224 736696005 738841832 740849257 742822409
3640.7 742822409 744895577 747025907 749129415 751067638 752533317 753592551 754685402 756016195
3657G56016195J286626R79483Q84831J103699J242757J107395R32812Q10862N21302
3675.4G64885962K92122M02391O03557Q77559J206696J304269Q52942L21568K72929
3693.7G71019995M11749N25773N58197M31955L62217N63562P50900O01768K90036J91629
3714.1G75707781J42038N5731N5313N2511m291R775K58207N89073P12335N19514J73390
3736.5G78271377O0260K48075L71158K65062K18749K09808k8848k13921k6763J14262
3756.9G79489219p868l3557J23441J89483J34945J5855o9082k4378J00791K19524J35780
3779.4G80274153j12176j80304n8651K7001K5153R6798J79410J17361J17779J42753
3799.8G80629277J6868l7193p2241j74701j38521N5373J57296J20223J96457R9480
$$ plain form
3657 756016195 757302821 758282304 759167135 760270834 761513591 762620986 763553798 764364660 764885962
3675.4 764885962 765178084 765580475 766184032 767061591 768268287 769572556 770425498 770747066 771019995
3693.7 771019995 771431744 771957517 772515714 772947669 773309886 773873448 774624348 775226116 775516152 775707781
3714.1 775707781 775849819 775905550 775960863 776013374 776009083 776018858 776277065 776866138 777578473 778097987 778271377
3736.5 778271377 778331637 778579712 778950870 779215932 779434681 779644489 779615641 779401720 779374957 779489219
3756.9 779489219 779481351 779447794 779571235 779760718 779895663 779911518 779842436 779818058 779918849 780138373 780274153
3779.4 780274153 780161977 779981673 779923022 779950023 779975176 780071974 780251384 780368745 780486524 780629277
3799.8 780629277 780646145 780608952 780536711 780362010 780223489 780278862 780436158 780556381 780752838 780852318
3820.2G80852318k30193k75016j42276k5332Q0347K01404L16441J65224j54257k16365
3840.6G80572295j63913k00748j52588J40309L55244j1980m54486k23875P749O0022
3861G79928029P2956N7339J1266r7573j48416j44362j47224l0577L3438P749Q047q2076
3885.4G79468596j42813j07288j21713r9540R835J08898J21176m2498k83837l27051
3905.8G78583765j77860n7340o020K4200k444q5771q9348l1709m6909o8367m3511l8445
3930.3G77960241o9380j21057j56879j19806n1915m0174n1200m5479o2585j07705j11640
3952.7G77022421n9068j7941k8372n8293o3002n5373n0962k6226k8789p9810r2507
3975.2G76462078o3717j7643L6180J6570p2122j25527j08540p6533n7756m1366k1875
$$ plain form
3820.2 780852318 780622125 780347109 780204833 780179501 780259848 780461252 780777693 780942917 780788660 780572295
3840.6 780572295 780408382 780207634 780055046 780195355 780550599 780538619 780084133 779860258 779868007 779928029
3861 779928029 780000985 780058324 780069590 779972017 779823601 779679239 779532015 779501438 779534876 779542625 779550672 779468596
3885.4 779468596 779325783 779218495 779096782 778997242 779007077 779115975 779237151 779194653 778910816 778583765
3905.8 778583765 778405905 778348565 778342545 778366745 778364301 778278530 778189182 778157473 778110564 778042197 777998686 777960241
3930.3 777960241 777890861 777769804 777612925 777493119 777441204 777401030 777349830 777304351 777241766 777134061 777022421
3952.7 777022421 776963353 776945412 776917040 776858747 776795745 776740372 776689410 776663184 776634395 776554585 776462078
3975.2 776462078 776398361 776380718 776416898 776433468 776361346 776235819 776127279 776050746 775992990 775951624 775929749
3997.6G75929749
$$ plain form
3997.6 775929749
##END=$$ End of the data block
