##TITLE=Controle 1p1 $$ Begin of the data block
##JCAMP-DX=5.00 $$ ACD/SpecManager v 10.08
##SPECTROMETER/DATA SYSTEM=Alpha
##DATE=03 Sep 2014 08:47:40
##DATA TYPE=INFRARED SPECTRUM
##DATA CLASS=XYDATA
##ORIGIN=
##OWNER=
##NPOINTS=1765
##FIRSTX=399.76428223
##LASTX=3997.64306641
##MAXX=3997.64306641
##MINX=399.76428223
##MAXY=0.81639755
##MINY=0.28903809
##XFACTOR=1.0000000000
##YFACTOR=1.000000000000000e-9
##FIRSTY=0.78850698
##DELTAX=2.03961372
##XUNITS=1/CM
##YUNITS=ARBITRARY UNITS
##XYDATA=(X++(Y..Y))
$$ plain form
399.8 788506985 787942827 786177874 785173416 784953415 783205152 781047881 781328022 782333255 781021416
418.1 781021416 779402375 779689491 779066920 776935816 776095748 776321113 774990141 773147404 773310244
436.5 773310244 773724854 772175252 770743489 770944417 770224690 767984390 767178953 767737508 766863406
454.8 766863406 765231073 765273869 765566111 763997614 762509823 763096094 763678074 762749553 762381911
473.2 762381911 763139427 762889683 761788666 761737585 762162387 761375666 760339081 760568023 760850132 759880185
493.6 759880185 759011924 759225249 759039342 757767022 756971359 757013321 756408453 755053937 754212439 753804922
514 753804922 752835393 751494050 750737607 750511467 749987841 749102116 748505414 748200476 747565150 746640980
534.4 746640980 746132195 745957553 745345116 744466186 744093716 743879855 742957652 741949260 741905451 741997123
$$ packed form
399.8G88506985n64158j764953j004458k20001j748263k157271K80141J005233j311839
418.1G81021416j619041K87116o22571k131104q40068K25365j330972j842737J62840
436.5G73310244M14610j549602j431763K00928p19727k240300q05437N58555q74102
454.8G66863406j632333M2796K92242j568497j487791N86271N81980r28521l67642
473.2G62381911P57516k49744j101017n1081M24802p86721j036585K28942K82109r69947
493.6G59880185q68261K13325j85907j272320p95663M1962o04868j354516q41498m07517
514G53804922r69529j341343p56443k26140n23626q85725n96702l04938o35326r24170
534.4G46640980n08785j74642o12437q78930l72470k13861r22203j008392m3809R1672
$$ plain form
554.8 741997123 741150796 740255415 740297198 740276873 739319205 738682687 738981068 738633394 737328291 736758411
575.2 736758411 737003505 736462355 735324323 735232294 735776305 735323608 734564483 734915793 735273063 734399557
595.6 734399557 733779728 734452546 734686852 733760595 733518541 734286964 734150410 733073711 732918680 733457923
616 733457923 733262360 733327091 735077262 737284005 738480628 739575028 741437376 742869437 743254900
634.3 743254900 743960083 745321155 745886385 745620191 746009767 746858358 746816754 746305525 746502340 746810198
654.7 746810198 746246099 745548606 745563984 745637655 745156169 744549930 744536698 744647026 744370341 744063795
675.1 744063795 743877470 743494451 742920280 742415011 741947532 741335392 740565956 739669323 738646746 737620771
695.5 737620771 736623824 735692024 735243857 735344529 735343695 734985292 734529257 733822048 732462764 730579376
$$ packed form
554.8G41997123q46327q95381M1783k0325r57668o36518K98381l47674j305103n69880
575.2G36758411K45094n41150j138032r2029N44011m52697p59125L51310L57270q73506
595.6G34399557o19829O72818K34306r26257k42054P68423j36554j076699j55031N39243
616G33457923j95563O4731J750171K206743J196623J094400J862348J432061L85463
634.3G43254900P05183J361072N65230k66194L89576Q48591m1604n11229J96815L07858
654.7G46810198n64099o97493J5378P3671m81486o06239j3232J10328k76685l06546
675.1G44063795j86325l83019n74171n05269m67479o12140p69436q96633j022577j025975
695.5G37620771r96947r31800m48167J00672q34l58403m56035p07209j359284j883388
$$ plain form
715.9 730579376 728528857 726520598 725508988 727017224 731198490 736353159 741051078 745559037
732.2 745559037 750202119 754221082 757361054 760580599 764136136 767126203 769624949 772682071
748.5 772682071 775925875 778074384 779438555 781104982 782626390 783137739 783493876 784654438 785723686
766.9 785723686 785981417 786574006 788106441 789340317 789837956 790881932 792714179 794000149 794700265
785.3 794700265 796063364 797876716 798959494 799676657 801101446 802666247 803319275 803723037 804773927
803.6 804773927 805721045 805996060 806556582 807895303 809123814 809873044 810932398 812455833 813505054
822 813505054 813867033 814316332 814835787 814672530 813986123 813575506 813409746 813021600 812728047 813067973
842.4 813067973 813774705 814337432 814766943 815224051 815604925 815810084 815998733 816277087 816397548 816074491
$$ packed form
715.9G30579376k050519k008259j011610J508236M181266N154669M697919M507959
732.2G45559037M643082M018963L139972L219545L555537K990067K498746L057122
748.5G72682071L243804K148509J364171J666427J521408N11349L56137J160562J069248
766.9G85723686K57731N92589J532435J233876M97639J043976J832247J285970P00116
785.3G94700265J363099J813352J082778P17163J424789J564801O53028M03762J050890
803.6H04773927R47118K75015N60522J338721J228511P49230J059354J523435J049221
822H13505054L61979M49299N19455j63257o86407m10617j65760l88146k93553L39926
842.4H13067973P06732N62727M29511M57108L80874K05159J88649K78354J20461l23057
$$ plain form
862.8 816074491 815415621 814759552 814114928 813097656 811604738 810037673 808709025 807688951 807256937
881.1 807256937 807742834 808723867 809347451 809594512 809992909 810338736 810087204 809584141 809480369 809429824
901.5 809429824 808881581 808342159 808368742 808411479 808000803 807794690 808201551 808428705 808038056 807803929
921.9 807803929 807972550 807603717 806527019 805723071 805228174 804108918 802555323 801481426 800539136
940.3 800539136 798826158 796795487 795313954 793811262 791472733 788892865 786711216 784203231
956.6 784203231 780782878 777256131 774187863 770955145 767417669 764449477 762190402 759698391
972.9 759698391 756739974 753981292 751321554 748061657 744500339 741467476 738756299 735654116
989.2 735654116 732425570 729687274 727039874 723855019 720478833 717371702 714076042 710125148
$$ packed form
862.8H16074491o58870o56069o44624j017272j492918j567065j328648j020074m32014
881.1H07256937M85897R81033O23584K47061L98397L45827k51532n03063j03772n0545
901.5H09429824n48243n39422K6583M2737m10676k06113M06861K27154l90649k34127
921.9H07803929J68621l68833j076698q03948m94897j119256j553595j073897r42290
940.3H00539136j712978k030671j481533j502692k338529k579868k181649k507985
956.6G84203231l420353l526747l068268l232718l537476k968192k259075k492011
972.9G59698391k958417k758682k659738l259897l561318l032863k711177l102183
989.2G35654116l228546k738296k647400l184855l376186l107131l295660l950894
$$ plain form
1005.5 710125148 705955088 702010274 697959304 693556905 689265192 685392261 681583405 677636862
1021.8 677636862 673934639 670649827 667459190 664339662 661722660 659690917 657862484 656058908
1038.2 656058908 654384375 652684391 650529504 647862494 645086527 642397761 639623284 636808753
1054.5 636808753 634314477 632188976 630145133 628213108 626699567 625520647 624269903 622892022
1070.8 622892022 621601462 620229065 618447602 616501868 614950716 613864183 612947702 612233818 611896873
1089.2 611896873 611749530 611762285 612567961 614727199 617983460 621808827 626087546 630534887 634164870
1107.5 634164870 636164427 636658072 636122644 634953260 634008586 634591460 637204528 640939772 644477904
1125.9 644477904 646812558 646942914 644102275 638689995 632072091 625375926 619288206 614492297
$$ packed form
1005.5G10125148m170060l944814m050970m402399m291713l872931l808856l946543
1021.8F77636862l702223l284812l190637l119528k617002k031743j828433j803576
1038.2F56058908j674533j699984k154887k667010k775967k688766k774477k814531
1054.5F36808753k494276k125501k043843j932025j513541j178920j250744j377881
1070.8F22892022j290560j372397j781463j945734j551152j086533r16481p13884l36945
1089.2F11896873j47343J2755Q05676K159238L256261L825367M278719M447341L629983
1107.5F34164870J999557M93645n35428j169384r44674N82874K613068L735244L538132
1125.9F44477904K334654J30356k840639n412280o617904o696165o087720m795909
$$ plain form
1142.2 614492297 611234128 608798742 606281102 603542447 600781858 597909987 594988644 592637956
1158.5 592637956 591466606 591536820 592798054 595424712 599399567 604407728 610290051 617116451 624637306
1176.9 624637306 632201970 639435112 646396339 653002679 658956409 664249063 669123292 673561156
1193.2 673561156 677327096 680442214 683070421 685056388 686125278 686422110 686345816 686021686 685361922
1211.5 685361922 684425950 683286488 681741774 679583371 676956177 674090505 670974791 667628288
1227.9 667628288 664319098 661319792 658636630 656216919 654315054 653322220 653355360 654332459 656260073
1246.2 656260073 659001887 661946714 664372087 666086733 667332709 668305874 669178724 670272112 671786010
1264.6 671786010 673532128 675249159 676854908 678157389 678854704 679079890 679452002 680495322 682273746
$$ packed form
1142.2F14492297l258169k435386k517640k738655k760589k871871k921343k350688
1158.5E92637956j171350P0214J261234K626658L974855N008161N882323O826400P520855
1176.9F24637306P564664P233142O961227O606340N953730N292654M874229M437864
1193.2F73561156L765940L115118K628207J985967J068890K96832p6294l24130o59764
1211.5F85361922r35972j139462j544714k158403k627194k865672l115714l346503
1227.9F67628288l309190k999306k683162k419711j901865r92834L3140R77099J927614
1246.2F56260073K741814K944827K425373J714646J245976R73165Q72850J093388J513898
1264.6F71786010J746118J717031J605749J302481O97315K25186L72112J043320J778424
$$ plain form
1282.9 682273746 684546649 686962008 688961267 690076530 690500736 690766037 690916240 690719008 690401793
1301.3 690401793 690358639 690456629 690330148 690055132 689896703 689817727 689825296 690285981 691410720 692979038
1321.7 692979038 694812357 696906090 698929310 700228751 700547993 700158417 699229240 697684884 695828497
1340 695828497 694350243 693384349 692555606 691783249 691224039 690813839 690355837 689780712 689051569 687903345
1360.4 687903345 685974240 683340192 680471182 677650452 674975455 671861708 667431653 662746310
1376.7 662746310 660213470 660331011 661447227 662505031 663601756 664481878 664770424 664438963 663508594
1395.1 663508594 662308872 661187410 660565138 661012948 662503064 664069057 664699793 664024174 662455976
1413.5 662455976 661099851 660939217 662162185 663804770 664929450 664885044 663188577 659806967 655477583
$$ packed form
1282.9F82273746K272903K415359J999259J115263M24206K65301J50203j97232l17215
1301.3F90401793m3154R7990j26481k75016j58429p8976P569M60685J124739J568318
1321.7F92979038J833319K093733K023220J299441L19242l89576r29177j544356j856387
1340F95828497j478254r65894q28743p72357n59210m10200m58002n75125p29143j148224
1360.4F87903345j929105k634048k869010k820730k674997l113747m430055m685343
1376.7F62746310k532840J17541J116216J057804J096725Q80122K88546l31461r30369
1395.1F63508594j199722j121462o22272M47810J490116J565993O30736o75619j568198
1413.5F62455976j356125j60634J222968J642585J124680m4406j696467l381610m329384
$$ plain form
1431.8 655477583 651170552 646609843 641898513 638225377 635452986 633091390 630882025 628193319
1448.1 628193319 624339283 619168997 613662124 609398544 607834458 608055949 608524024 609663785 614864051
1466.5 614864051 627762258 648530364 673061669 691685140 701875925 707496047 710233152 710634768
1482.8 710634768 709222972 706263125 701488853 695099771 688611746 682011902 674310386 666375101
1499.1 666375101 659447432 653600991 647298455 638820529 630971491 624681175 618952274 614075482
1515.4 614075482 610356510 607768655 605448604 603020847 600742757 598500192 596617460 595220149
1531.8 595220149 594033062 593251407 593234360 593885183 594749570 595847011 597472548 599721074 602587581
1550.1 602587581 605895340 609553635 613473654 618231654 623119056 626486361 629655480 633170307
$$ packed form
1431.8F55477583m307031m560709m711330l673136k772391k361596k209365k688706
1448.1F28193319l854036n170286n506873m263580j564086K21491M68075J139761N200266
1466.5F14864051J2898207K0768106K4531305J8623471J0190785N620122K737105M01616
1482.8G10634768j411796k959847m774272o389082o488025o599844p701516p935285
1499.1F66375101o927669n846441o302536q477926p849038o290316n728901m876792
1515.4F14075482l718972k587855k320051k427757k278090k242565j882732j397311
1531.8E95220149j187087p81655j7047O50823Q64387J097441J625537K248526K866507
1550.1F02587581L307759L658295L920019M758000M887402L367305L169119L514827
$$ plain form
1566.4 633170307 636776686 640245140 642975032 645359039 647681653 649287283 650282383 650926411 651244581
1584.8 651244581 651151896 650511801 649265885 647597313 645535648 643026292 640114963 636789620 632914901
1603.2 632914901 628316641 622979045 616772234 609843194 602587104 594262362 584002078 574193537
1619.5 574193537 564642787 553128421 540689528 528429925 517126441 508719504 502997756 498238504
1635.8 498238504 494480401 492016107 490405053 489480525 489154369 489313573 489819229 490940362 492754072
1654.1 492754072 494655520 496985137 500307739 504632175 509380996 513980925 519120574 524974108
1670.5 524974108 530493736 536293328 542541981 548349142 553906918 560070515 567395210 574077189
1686.8 574077189 580087364 586642504 593578398 602214098 612499893 622717619 633208811 641459882
$$ packed form
1566.4F33170307L606379L468454K729892K384007K322614J605630R95100O44028L18170
1584.8F51244581r2685o40095j245916j668572k061665k509356k911329l325343l874719
1603.2F32914901m598260n337596o206811o929040p256090q324742j0260284r808541
1619.5E74193537r550750j1514366j2438893j2259603j1303484q406937n721748m759252
1635.8D98238504l758103k464294j611054r24528l26156J59204N05656J121133J813710
1654.1D92754072J901448K329617L322602M324436M748821M599929N139649N853534
1670.5E24974108N519628N799592O248653N807161N557776O163597P324695O681979
1686.8E74077189O010175O555140O935894Q635700J0285795J0217726J0491192Q251071
$$ plain form
1703.1 641459882 647883177 653676569 658196330 661873162 665162444 668314517 671281636 673286617
1719.4 673286617 673659980 671957791 667441308 659553587 647873104 631662250 606366992 575064003
1735.7 575064003 546017706 515593827 486996204 467519790 459365100 464421630 484522671 517230093
1752 517230093 554290414 593274534 631531239 663924754 690676332 710358202 723877728 734151721
1768.4 734151721 741950631 747955382 752499938 755931914 758856535 761456370 763757646 765872717
1784.7 765872717 767665863 769249320 770842135 772385180 773532748 774493039 775571227 776637554
1801 776637554 777453601 778143346 778992474 779849231 780516982 781089187 781783581 782436967 782915413 783420026
1821.4 783420026 784084857 784693897 785105467 785524249 785950780 786282361 786531866 786876261 787322879 787728012
$$ packed form
1703.1F41459882O423295N793392M519761L676832L289282L152073K967119K004981
1719.4F73286617L73363j702189m516483p887721j1680483j6210854k5295258l1302989
1735.7E75064003k9046297l0423879k8597623j9476414q154690N056530K0101041L2707422
1752E17230093L7060321L8984120L8256705L2393515K6751578J9681870J3519526J0273993
1768.4G34151721P798910O004751M544556L431976K924621K599835K301276K115071
1784.7G65872717J793146J583457J592815J543045J147568R60291J078188J066327
1801G76637554Q16047O89745Q49128Q56757O67751N72205O94394O53386M78446N04613
1821.4G83420026O64831O09040M11570M18782M26531L31581K49505L44395M46618M05133
$$ plain form
1841.8 787728012 788016200 788253248 788458467 788560390 788691282 788949430 789208353 789324641 789429486 789625406
1862.2 789625406 789833903 789977491 790068269 790105581 790074646 790037811 790066421 790161729 790189922 790162921 790214837
1884.6 790214837 790345132 790384829 790325522 790340841 790398777 790358067 790262580 790253103 790267110 790226400 790197551
1907.1 790197551 790217698 790185988 790072322 790001035 790006936 789980888 789869666 789737165 789616883 789494991 789344132
1929.5 789344132 789212048 789143980 789076030 788964808 788865328 788790703 788662553 788479805 788313270 788205028
1949.9 788205028 788108885 787967026 787817001 787704051 787594378 787465751 787363350 787273765 787109137 786890268
1970.3 786890268 786738515 786635458 786477447 786274672 786113977 785989344 785800159 785591722 785496175 785426497
1990.7 785426497 785203516 784923911 784757614 784619391 784397066 784177005 784052789 783911407 783669412 783447742
$$ packed form
1841.8G87728012K88188K37048K05219J01923J30892K58148K58923J16288J04845J95920
1862.2G89625406K08497J43588R0778L7312l0935l6835K8610R5308K8193k7001N1916
1884.6G90214837J30295L9697n9307J5319N7936m0710r5487r477J4007m0710k8849
1907.1G90197551K0147l1710j13666p1287N901k6048j11222j32501j20282j21892j50859
1929.5G89344132j32084o8068o7950j11222r9480p4625j28150j82748j66535j08242
1949.9G88205028r6143j41859j50025j12950j09673j28627j02401q9585j64628k18869
1970.3G86890268j51753j03057j58011k02775j60695j24633j89185k08437r5547o9678
1990.7G85426497k22981k79605j66297j38223k22325k20061j24216j41382k41995k21670
$$ plain form
2011.1 783447742 783302724 783101618 782809198 782572508 782401085 782177150 781920791 781738698 781602442 781411231
2031.5 781411231 781199813 781075060 780994058 780832171 780647337 780552268 780458570 780274570 780095458 779988348
2051.9 779988348 779885709 779745698 779633343 779567599 779466927 779329181 779231250 779169440 779066145 778946996
2072.3 778946996 778875828 778801382 778678060 778582513 778567076 778542817 778455973 778388798 778384686 778355896 778284967
2094.7 778284967 778234839 778175533 778070211 777986169 777944863 777877092 777772844 777686656 777646601 777597487 777524471
2117.1 777524471 777480960 777436256 777339697 777247906 777213752 777168691 777071834 776994169 776953459 776872456 776766121
2139.6 776766121 776711464 776660562 776532710 776411295 776380241 776330948 776194751 776091814 776096344 776077509 775962472
2162 775962472 775877237 775867522 775796831 775660038 775624573 775656402 775570869 775427639 775414288 775435150 775324881
$$ packed form
2011.1G83447742j45018k01106k92420k36690j71423k23935k56359j82093j36256j91211
2031.5G81411231k11418j24753q1002j61887j84834r5069r3698j84000j79112j07110
2051.9G79988348j02639j40011j12355o5744j00672j37746r7931o1810j03295j19149
2072.3G78946996p1168p4446j23322r5547j5437k4259q6844o7175m112k8790p0929
2094.7G78284967n0128n9306j05322q4042m1306o7771j04248q6188m0055m9114p3016
2117.1G77524471m3511m4704r6559r1791l4154m5061r6857p7665m0710q1003j06335
2139.6G76766121n4657n0902j27852j21415l1054m9293j36197j02937M530j8835j15037
2162G75962472q5235r715p0691j36793l5465L1829q5533j43230j3351K0862j10269
$$ plain form
2184.5 775324881 775198877 775201559 775210202 775092661 774997354 775029242 775014162 774867356 774761915 774740458 774646640
2206.9 774646640 774497926 774441719 774422705 774273694 774072409 774003088 773976147 773840010 773708880 773688436
2227.3 773688436 773620903 773404181 773217857 773168504 773081839 772871256 772714019 772676408 772576749 772371054
2247.7 772371054 772238433 772189915 772050321 771832645 771705568 771625638 771426022 771189332 771079898 770999491
2268.1 770999491 770825148 770658672 770580828 770478845 770271480 770078361 769974768 769817650 769546092 769317567
2288.5 769317567 769164145 768948972 768700063 768553197 768452227 768234372 767939985 767728865 767583072 767362118
2308.9 767362118 767073393 766838133 766641915 766368270 766037941 765776813 765573442 765356898 765151680 764987707
2329.3 764987707 764808953 764539361 764249980 764055252 763895988 763677895 763453782 763364196 763421655 763388276
$$ packed form
2184.5G75324881j26004K682Q643j17541r5307L1888j5080j46806j05441k1457r3818
2206.9G74646640j48714n6207j9014j49011k01285o9321k6941j36137j31130k0444
2227.3G73688436o7533k16722j86324m9353q6665k10583j57237l7611r9659k05695
2247.7G72371054j32621m8518j39594k17676j27077p9930j99616k36690j09434q0407
2268.1G70999491j74343j66476p7844j01983k07365j93119j03593j57118k71558k28525
2288.5G69317567j53422k15173k48909j46866j00970k17855k94387k11120j45793k20954
2308.9G67362118k88725k35260j96218k73645l30329k61128k03371k16544k05218j63973
2329.3G64987707j78754k69592k89381j94728j59264k18093k24113q9586N7459l3379
$$ plain form
2349.7 763388276 763113022 762712061 762347281 761982381 761619508 761379182 761232436 761119962 761064649 761029840
2370.1 761029840 760953665 760874987 760871112 760905683 760890961 760807395 760704100 760596156 760424912 760189354 759986699
2392.5 759986699 759811223 759561539 759284854 759075284 758880973 758631349 758372903 758155704 757936656 757671952
2412.9 757671952 757402718 757168114 756919980 756636739 756389618 756184578 755933583 755630314 755364358 755160987
2433.3 755160987 754935026 754650772 754377782 754135132 753868699 753578186 753312409 753060162 752763927 752447426
2453.7 752447426 752176225 751900017 751574457 751272738 751011968 750720441 750389099 750089109 749824584 749508560
2474.1 749508560 749148309 748828113 748519301 748154879 747760177 747381985 747005105 746608615 746231437 745895326
2494.5 745895326 745578289 745261014 744947910 744656265 744363368 744044125 743728042 743427813 743126214 742825031
$$ packed form
2349.7G63388276k75254m00961l64780l64900l62873k40326j46746j12474n5313l4809
2370.1G61029840p6175p8678l875L4571j4722q3566j03295j07944j71244k35558k02655
2392.5G59986699j75476k49684k76685k09570j94311k49624k58446k17199k19048k64704
2412.9G57671952k69234k34604k48134k83241k47121k05040k50995l03269k65956k03371
2433.3G55160987k25961k84254k72990k42650k66433k90513k65777k52247k96235l16501
2453.7G52447426k71201k76208l25560l01719k60770k91527l31342k99990k64525l16024
2474.1G49508560l60251l20196l08812l64422l94702l78192l76880l96490l77178l36111
2494.5G45895326l17037l17275l13104k91645k92897l19243l16083l00229l01599l01183
$$ plain form
2514.9 742825031 742532670 742242515 741933227 741618156 741322279 741026819 740727901 740443945 740172684 739905238
2535.3 739905238 739650667 739410818 739148557 738854051 738578498 738346696 738105595 737830579 737573922 737329781
2555.6 737329781 737037599 736728251 736453891 736161172 735828996 735529065 735276580 734995127 734652638 734315872
2576 734315872 733992517 733636737 733289659 732981980 732653260 732296705 731973112 731680751 731368423 731011987
2596.4 731011987 730645299 730298519 729934156 729538679 729165137 728808880 728416622 728003263 727616429 727252066
2616.8 727252066 726870477 726478875 726108789 725719571 725271702 724813402 724400342 724005103 723594248 723186255
2637.2 723186255 722781122 722365439 721949816 721547425 721135974 720693767 720242143 719792068 719320536 718819976
2657.6 718819976 718319952 717830241 717334569 716854870 716428816 716037333 715633810 715238154 714892507 714560390
$$ packed form
2514.9G42825031k92361k90155l09288l15071k95877k95460k98918k83956k71261k67446
2535.3G39905238k54571k39849k62261k94506k75553k31802k41101k75016k56657k44141
2555.6G37329781k92182l09348k74360k92719l32176k99931k52485k81453l42489l36766
2576G34315872l23355l55780l47078l07679l28720l56555l23593k92361l12328l56436
2596.4G31011987l66688l46780l64363l95477l73542l56257l92258m13359l86834l64363
2616.8G27252066l81589l91602l70086l89218m47869m58300m13060l95239m10855m07993
2637.2G23186255m05133m15683m15623m02391m11451m42207m51624m50075m71532n00560
2657.6G18819976n00024m89711m95672m79699m26054l91483m03523l95656l45647l32117
$$ plain form
2678 714560390 714212358 713895261 713642061 713436723 713233054 713016927 712807775 712596178 712377489 712141216
2698.4 712141216 711862624 711544335 711201787 710824549 710380971 709890008 709397912 708902717 708397090 707874894
2718.8 707874894 707334578 706800044 706249654 705664933 705131650 704719722 704362869 704005361 703665257 703323245
2739.2 703323245 702959180 702607393 702281058 701932907 701520205 701055765 700582206 700109720 699617863 699127376
2759.6 699127376 698656917 698161542 697598875 697005212 696425080 695836127 695208788 694520056 693737149 692876101
2780 692876101 692006707 691154003 690270305 689341843 688380718 687383652 686356246 685298204 684186459
2798.4 684186459 682989895 681703210 680347383 678922772 677386343 675678551 673775196 671679378
2814.7 671679378 669356167 666749299 663817525 660466909 656570852 652042329 646843016 640974581
$$ packed form
2678G14560390l48032l17097k53200k05338k03669k16127k09152k11597k18689k36273
2698.4G12141216k78592l18289l42548l77238m43578m90963m92096m95195n05627n22196
2718.8G07874894n40316n34534n50390n84721n33283m11928l56853l57508l40104l42012
2739.2G03323245l64065l51787l26335l48151m12702m64440m73559m72486m91857m90487
2759.6F99127376m70459m95375n62667n93663n80132n88953o27339o88732p82907q61048
2780F92876101q69394q52704q83698r28462r61125r97066j027406j058042j111745
2798.4F84186459j196564j286685j355827j424611j536429j707792j903355k095818
2814.7F71679378k323211k606868k931774l350616l896057m528523n199313n868435
$$ plain form
2831 640974581 634362757 626672685 617153585 604503691 587130964 563861728 534701884 501540661
2847.3 501540661 468423188 441048145 425155282 423819721 435675859 455869675 478583932
2861.6 478583932 499039143 514308870 523592174 528449416 532132387 537188590 543513358 549253583
2877.9 549253583 552841783 553759456 552171946 548453808 543000042 536176324 528310120 519697726
2894.2 519697726 510539174 500850022 490513176 479353338 467137635 453537613 438088983 420321792
2910.5 420321792 399957836 377188534 353125036 329907447 310153306 296132922 289075941
2924.8 289075941 289038092 295239538 306568205 322055876 340743333 361327201 382312834 402310461
2941.1 402310461 420048505 434313297 444146544 449383736 451018006 450933993 451291651 453769714
$$ packed form
2831F40974581o611824p690072r519100j2649894j7372727k3269236k9159844l3161223
2847.3E01540661l3117473k7375043j5892863j335561J1856138K0193816K2714257
2861.6D78583932K0455211J5269727R283304M857242L682971N056203O324768N740225
2877.9E49253583L588200R17673j587510l718138n453766o823718p866204q612394
2894.2E19697726r158552r689152j0336846j1159838j2215703j3600022j5448630j7767191
2910.5D20321792k0363956k2769302k4063498k3217589j9754141j4020384p056981
2924.8B89075941l7849O201446J1328667J5487671J8687457K0583868K0985633J9997627
2941.1D02310461J7738044J4264792R833247N237192J634270q4013L57658K478063
$$ plain form
2957.4 453769714 459160209 467572331 478629619 491601139 505558491 519500256 532624006 544499457
2973.8 544499457 555039048 564400375 572694659 579889238 586026967 591158390 595199406 598040223
2990.1 598040223 599486589 599235594 597233951 593778312 589373171 584737480 580711186 578186750
3006.4 578186750 577917635 580147266 584548473 590434015 596952140 603254378 608708620 613062143
3022.7 613062143 616316497 618572474 620081544 621133387 621850252 622198522 622226059 622124016 621934593
3041.1 621934593 621576309 621093392 620561182 619952023 619237304 618478537 617724419 616935194 616107702 615338326
3061.5 615338326 614697874 614147842 613642812 613246918 613007605 612850070 612714767 612611115 612513840 612362087
3081.9 612362087 612135947 611906826 611746252 611596406 611411929 611247063 611108541 610950530 610734224 610451043
$$ packed form
2957.4D53769714N390495Q412122J1057288J2971520J3957352J3941765J3123750J1875451
2973.8E44499457J0539591R361327Q294284P194579O137729N131423M041016K840817
2990.1E98040223J446366k50995k001643l455639m405141m635691m026294k524436
3006.4E78186750k69115K229631M401207N885542O518125O302238N454242M353523
3022.7F13062143L254354K255977J509070J051843P16865L48270K7537j02043j89423
3041.1F21934593l58284m82917n32210o09159p14719p58767p54118p89225q27492p69376
3061.5F15338326o40452n50032n05030l95894k39313j57535j35303j03652r7275j51753
3081.9F12362087k26140k29121j60574j49846j84477j64866j38522j58011k16306k83181
$$ plain form
3102.2 610451043 610151470 609865367 609546483 609159172 608740926 608313620 607851386 607334197 606675744 605836689
3122.6 605836689 604982257 604225636 603459001 602581561 601648748 600726664 599783659 598778546 597689986
3141 597689986 596508682 595274389 594063222 592928946 591777921 590445042 588988483 587571740 586171150
3159.4 586171150 584695518 583162189 581650078 580156267 578597069 576973617 575355887 573729038
3175.7 573729038 572031856 570316672 568645358 566972435 565251708 563505232 561789811 560074568
3192 560074568 558302224 556529522 554797053 553095520 551448464 549817204 548146725 546460986 544798791
3210.3 544798791 543162525 541513443 539839268 538176894 536539376 534876227 533142328 531391263
3226.7 531391263 529678524 527985275 526264369 524437904 522500932 520537853 518584430 516628504
$$ packed form
3102.2F10451043k99573k86103l18884l87311m18246m27306m62234n17189o58453q39055
3122.6F05836689q54432p56621p66635q77440r32813r22084r43005j005113j088560
3141E97689986j181304j234293j211167j134276j151025j332879j456559j416743j400590
3159.4E86171150j475632j533329j512111j493811j559198j623452j617730j626849
3175.7E73729038j697182j715184j671314j672923j720727j746476j715421j715243
3192E60074568j772344j772702j732469j701533j647056j631260j670479j685739j662195
3210.3E44798791j636266j649082j674175j662374j637518j663149j733899j751065
3226.7E31391263j712739j693249j720906j826465j936972j963079j953423j955926
$$ plain form
3243 516628504 514648259 512607813 510502875 508380592 506257236 504116416 501965463 499800235 497630805
3261.3 497630805 495504498 493440628 491450459 489571452 487791002 486072421 484425455 482890993
3277.7 482890993 481482625 480153382 478873909 477695823 476682603 475780368 474894136 474013180 473174393
3296 473174393 472428083 471776396 471174031 470604628 470036268 469425082 468805283 468214422 467635572 467082977
3316.4 467082977 466551036 465982199 465395421 464792132 464109391 463372201 462618679 461851954 461092591 460299104
3336.8 460299104 459388912 458402276 457443684 456480592 455464959 454445630 453386337 452203542 450960815
3355.2 450960815 449762136 448591888 447388589 446167350 444984227 443801075 442528367 441175431
3371.5 441175431 439848095 438619703 437492222 436450124 435469985 434547454 433674037 432901114 432278603
$$ packed form
3243E16628504j980245k040446k104938k122283k123356k140820k150953k165228k169430
3261.3D97630805k126307k063870j990169j879007j780450j718581j646966j534462
3277.7D82890993j408368j329243j279473j178086j013220r02235q86232q80956q38787
3296D73174393p46310o51687o02365n69403n68360o11186o19799n90861n78850n52595
3316.4D67082977n31941n68837n86778o03289o82741p37190p53522p66725p59363p93487
3336.8D60299104r10192r86636r58592r63092j015633j019329j059293j182795j242727
3355.2D50960815j198679j170248j203299j221239j183123j183152j272708j352936
3371.5D41175431j327336j228392j127481j042098r80139r22531q73417p72923o22511
$$ plain form
3389.8 432278603 431628019 430807054 430001915 429405868 428909034 428295761 427592993 427015752 426611573 426279426
3410.2 426279426 425956994 425603181 425265223 425075382 425022483 425001413 425045997 425232798 425523847 425852329
3430.6 425852329 426283658 426857948 427394509 427792430 428257465 428941518 429758191 430603743 431423187 432267517
3451 432267517 433223099 434244782 435282588 436395854 437545121 438674629 439906538 441273659 442582041
3469.4 442582041 443750978 444959790 446319222 447800308 449336767 450879484 452455968 454084307
3485.7 454084307 455712467 457315534 458918542 460526139 462163001 463835120 465526253 467213482
3502 467213482 468871891 470519245 472224653 474007905 475788057 477535009 479292780 481091529 482954919
3520.4 482954919 484919637 486864626 488694221 490552753 492528349 494605273 496781677 498923182
$$ packed form
3389.8D32278603o50584q20965q05139n96047m96834o13273p02768n77241m04179l32147
3410.2D26279426l22432l53813l37958j89841n2899k1070M4584J86801K91049L28482
3430.6D25852329M31329N74290N36561L97921M65035O84053Q16673Q45552Q19444Q44330
3451D32267517R55582J021683J037806J113266J149267J129508J231909J367121J308382
3469.4D42582041J168937J208812J359432J481086J536459J542717J576484J628339
3485.7D54084307J628160J603067J603008J607597J636862J672119J691133J687229
3502D67213482J658409J647354J705408J783252J780152J746952J757771J798749J863390
3520.4D82954919J964718J944989J829595J858532J975596K076924K176404K141505
$$ plain form
3536.7 498923182 500948608 503061235 505358994 507637382 509706378 511700809 513806939 516000986
3553 516000986 518206179 520419836 522688210 524988830 527275443 529647470 532223105 534785807 537159979
3571.3 537159979 539518118 541990578 544575930 547298312 550091267 552850306 555594206 558355331
3587.7 558355331 561054945 563648343 566302061 569078565 571866453 574582338 577202260 579726279
3604 579726279 582190156 584747195 587379098 589928389 592370868 594707131 597078443 599517941 601716042
3622.3 601716042 603661299 605600893 607708693 609757245 611478209 613110840 614717841 616257012
3638.7 616257012 617825568 619370520 620807409 622257888 623773396 625019610 625908673 626795650 627874792
3657 627874792 628921032 629729152 630395889 631093621 631847501 632605314 633276463 633737981 634090841 634478927
$$ packed form
3536.7D98923182K025426K112627K297759K278388K068996J994431K106130K194047
3553E16000986K205193K213657K268374K300620K286613K372027K575635K562702K374172
3571.3E37159979K358139K472460K585352K722382K792955K759039K743900K761125
3587.7E58355331K699614K593398K653718K776504K787888K715885K619922K524019
3604E79726279K463877K557039K631903K549291K442479K336263K371312K439498K198101
3622.3F01716042J945257J939594K107800K048552J720964J632631J607001J539171
3638.7F16257012J568556J544952J436889J450479J515508J246214Q89063Q86977J079142
3657F27874792J046240Q08120O66737O97732P53880P57813O71149M61518L52860L88086
$$ plain form
3677.4 634478927 634890020 635369897 636000276 636810780 637736976 638428748 638738453 639026403 639401674 639760494
3697.8 639760494 640111327 640482426 640813470 641083777 641335309 641536891 641647160 641707599 641740918 641737878
3718.2 641737878 641704977 641670763 641636133 641589880 641591370 641697407 641879380 642004251 642008841 642009616 642056108 642086685
3742.7 642086685 642137825 642249644 642285228 642236710 642220557 642261744 642297328 642276347 642258763 642300129 642349243
3765.1 642349243 642337739 642277539 642202795 642127335 642122209 642211676 642254412 642119586 641903520 641737461 641613662
3787.5 641613662 641515255 641454577 641406476 641377151 641355753 641283095 641205192 641153097 641042173 640886426 640768886
3810 640768886 640689850 640608847 640536249 640485108 640395105 640258729 640086174 639886975 639719069 639598131 639566720
3832.4 639566720 639643610 639666975 639511108 639301360 639138937 638951242 638743162 638629377 638549387 638311327
$$ packed form
3677.4F34478927M11093M79877O30379Q10504R26196O91772L09705K87950L75271L58820
3697.8F39760494L50833L71099L31044K70307K51532K01582J10269O0439L3319l040
3718.2F41737878l2901l4214l4630m6253J490J06037J81973J24871M590P75M6492L0577
3742.7F42086685N1140J11819L5584m8518j6153M1187L5584k0981j7584M1366M9114
3765.1F42349243j1504o0200p4744p5460n126Q9467M2736j34826k16066j66059j23799
3787.5F41613662r8407o0678m8101k9325k1398p2658p7903n2095j10924j55747j17540
3810F40768886p9036q1003p2598n1141r0003j36376j72555j99199j67906j20938l1411
3832.4F39566720P6890K3365j55867k09748j62423j87695k08080j13785p9990k38060
$$ plain form
3852.8 638311327 638024926 637879133 637821853 637827694 637808681 637695372 637546003 637385488 637180626 636971116
3873.2 636971116 636841834 636730671 636570454 636479914 636455953 636344433 636139452 635931432 635736406 635550082
3893.6 635550082 635417283 635352314 635291636 635129631 634890914 634709954 634533286 634293318 634103119 634001970
3914 634001970 633882463 633710802 633566678 633467793 633364618 633236766 633085907 632946849 632804811 632613182
3934.4 632613182 632424951 632277787 632114887 631908357 631716788 631581306 631453514 631296754 631153047 631011069
3954.8 631011069 630838990 630718350 630678713 630580664 630346835 630086780 629917026 629819214 629706681 629572332
3975.2 629572332 629448056 629317224 629186690 629077196 628940046 628748119 628587306 628522694 628472030 628337264
3995.6 628337264 628142059
$$ packed form
3852.8F38311327k86401j45793n7280N841j9013j13309j49369j60515k04862k09510
3873.2F36971116j29282j11163j60217r0540k3961j11520k04981k08020j95026j86324
3893.6F35550082j32799o4969o0678j62005k38717j80960j76668k39968j90199j01149
3914F34001970j19507j71661j44124r8885j03175j27852j50859j39058j42038j91629
3934.4F32613182j88231j47164j62900k06530j91569j35482j27792j56760j43707j41978
3954.8F31011069j72079j20640l9637r8049k33829k60055j69754r7812j12533j34349
3975.2F29572332j24276j30832j30534j09494j37150j91927j60813o4612n0664j34766
3995.6F28337264j95205
$$ plain form
3997.6 628142059
$$ packed form
3997.6F28142059
##END=$$ End of the data block
