##TITLE=$$ Begin of the data block
##JCAMP-DX=5.00 $$ ACD/SpecManager v 10.08
##SPECTROMETER/DATA SYSTEM=Varian
##DATE=15 Jan 2013 10:39:22
##DATA TYPE=INFRARED SPECTRUM
##DATA CLASS=XYDATA
##ORIGIN=
##OWNER=
##NPOINTS=3735
##FIRSTX=399.26403809
##LASTX=4000.35498047
##MAXX=4000.35498047
##MINX=399.26403809
##MAXY=66.48238373
##MINY=20.01447868
##XFACTOR=1.0000000000
##YFACTOR=0.000000100000000
##FIRSTY=36.69965363
##DELTAX=0.96440572
##XUNITS=1/CM
##YUNITS=TRANSMITTANCE
##XYDATA=(X++(Y..Y))
399.3C66996536O325150J426163p47033p175445k897911Q642349J0334549m288750
407C78615608p768898K820702M633522j984l967781k404899j432076N84335J069336
415.7C72147865K836342M46854o260033Q784065n98564j913261l471413o448517l519821
424.3C62003517l8185N764351j147842J949081J089096j262474P016716K255669k768479
433C74861450l478088N36308J42365k486763K692184J284599j09596k415199j356583
441.7C69670677J250038n50193j45951J252938K590103k021218o24313J407318j650543
450.4C71178856k528954p22656J781654j139602Q87031K081795m448891o634636J348572
459.1C61803169p69958r88770M330406Q4992j095085R73358n31464L63159k285461
$$ plain form
399.3 366996536 373321686 374747849 374000816 366825371 363927460 372569809 382904358 378615608
407 378615608 370846710 373667412 378300934 378298950 374331169 371926270 370494194 371078529 372147865
415.7 372147865 374984207 375431061 369171028 377955093 377356529 375443268 371971855 365523338 362003517
424.3 362003517 361965332 367729683 366581841 368530922 369620018 368357544 375374260 377629929 374861450
433 374861450 371383362 371919670 372062035 369575272 372267456 373552055 373442459 371027260 369670677
441.7 369670677 370920715 370370522 370224571 371477509 374067612 372046394 371422081 372829399 371178856
450.4 371178856 368649902 367927246 369708900 368569298 369456329 371538124 367089233 360454597 361803169
459.1 361803169 361033211 360044441 364374847 364459839 363364754 364338112 363806648 364169807 361884346
467.7C61884346j362762j018830k145996J78642k12478J757354j11770k284241J391716
476.4C58075981J167183k122269q53767J399498j138992k682457J847229L172493r00765
485.1C57964134j270866j77040j544876m589119l208161K728234M524955j675796l235283
493.8C49516182Q48503K851677J715317j857186j431617O90307R842k365303k895698
502.5C47082024K682876K079354J580963L58429j163712Q13370m064331k577019J901054
511.1C48693008K26403O4964l021736k087555J274071k23198k168389j340675n01633
519.8C40915260r41505K74925J425705O90842o93169k72789P04193j404495k965736
528.5C37733231q71849J090507J47095J133117J502114J07460j389923j794396L98255
$$ plain form
467.7 361884346 360521584 359502754 357356758 357535400 357322922 359080276 358968506 356684265 358075981
476.4 358075981 359243164 357120895 356267128 357666626 356527634 353845177 355692406 358864899 357964134
485.1 357964134 356693268 356516228 354971352 350382233 347174072 349902306 354427261 352751465 349516182
493.8 349516182 350364685 353216362 354931679 353074493 351642876 352333183 352343025 349977722 347082024
502.5 347082024 349764900 351844254 353425217 353783646 352619934 353433304 349368973 346791954 348693008
511.1 348693008 348919411 348984375 345962639 343875084 345149155 344925957 342757568 341416893 340915260
519.8 340915260 339973755 340248680 341674385 342365227 341672058 341399269 342103462 340698967 337733231
528.5 337733231 336861382 337951889 338098984 339232101 340734215 340841675 339451752 337657356 338055611
537.2C38055611Q89892M26903j180954k608643j568603J40991J525993J2589q40416
545.9C34853363J79863m25110j443481j087876k97317N91278J724090M84887j448212
554.5C33131485j678047k58980q98094j909447J542015K196312j274261k146950L70026
563.2C29074059J48658J02082K155456j725807k466850J535606R13696n38940m81682
571.9C28716278N1346j93672q13027o52694N15365K36511j358833j629219l10669J237717
581.5C25799103J175957J549491K23809j002999L929m17442L84903J05286j350975
590.2C26471062J56707K092896J601105K50702N20858J272087O39382j225815k136040
598.9C29642944l22036J276817R49669N87692P63016k2965j486969r23729M36631r8687
$$ plain form
537.2 338055611 338945503 339372406 338191452 335582809 334014206 334155197 335681190 335693779 334853363
545.9 334853363 335033226 334608116 333164635 332076759 331779442 332370720 334094810 334579697 333131485
554.5 333131485 331453438 331194458 330296364 328386917 329928932 332125244 330850983 328704033 329074059
563.2 329074059 329222717 329324799 331480255 329754448 327287598 328823204 329736900 329197960 328716278
571.9 328716278 328767624 328573952 327760925 327108231 327623596 327860107 326501274 324872055 324561386 325799103
581.5 325799103 326975060 328524551 328748360 327745361 327749290 327331848 327716751 327822037 326471062
590.2 326471062 326627769 328720665 330321770 330572472 331093330 332365417 333004799 331778984 329642944
598.9 329642944 329320908 330597725 331547394 332135086 332898102 332875137 331388168 330464439 330901070 330802383
608.5C30802383j277084j901817j087303J113319Q39539l16468j137314j506729P58324
617.2C26286850P81822m98199j67084k34680K08702P70264Q87641Q25196J54915l65296
626.9C28650131l1433J341744K881240K271042R92585J341934J327247P82700N75180
635.5C40132370M85268L84521l7079J506424K937203J685676J240235Q21762j78566
644.2C48977814L89213J649132J035347o07643J88789J416436J252594J642189J663970
652.9C57607841o41937j241569J90811n1537O24924l53127j009216Q79059L29285l11699
662.5C56022835j70632m40216l9482Q77381o44112l297196L383713J105232J268425
671.2C58065948J732865J62735k67525J76964Q21953R80949J155510N21546L33862
$$ plain form
608.5 330802383 329525299 327623482 326536179 327649498 328489037 328172569 327035255 325528526 326286850
617.2 326286850 327068672 326570473 326403389 326168709 326377411 327147675 328035316 328860512 329015427 328650131
626.9 328650131 328618698 329960442 332841682 335112724 336105309 337447243 338774490 339557190 340132370
635.5 340132370 340617638 341002159 340965080 342471504 345408707 347094383 348334618 349156380 348977814
644.2 348977814 349367027 351016159 352051506 351443863 351632652 353049088 354301682 355943871 357607841
652.9 357607841 356965904 355724335 355915146 355863609 356488533 356135406 355126190 356005249 356334534 356022835
662.5 356022835 355852203 355411987 355372505 356249886 355605774 352308578 355692291 356797523 358065948
671.2 358065948 359798813 359961548 359694023 359870987 360692940 361673889 362829399 363350945 363684807
679.9C63684807J047172J086274K023468J421585M20684J407090J885071J109542K79732
688.6C74365425J64185K56118J46485k34604L93829J416550J122818R7580L8528R78089
698.2C78745003Q08792L57323k7466L36342J657829J031990L6774R73205J213494O77757
707.9C85811043J405906R51119J97182Q22792O13517k098J07918O73065J52855N65529
717.5C91298828J680527Q56628K63291j80054j02959O54221P75947N27916P49283J330528
727.2C97854156R87282J051560J507148Q43125P19910J101264q4762o06575k76260
735.8D03096848P286J148376R76448J321907Q88596l71933M84771L70904k78473o51398
745.5D06993332K30408N02662M98772K160072J648636K59400o45752L62167J149788
$$ plain form
679.9 363684807 364731979 365818253 367841721 369263306 369683990 371091080 372976151 374085693 374365425
688.6 374365425 374529610 374785728 374932213 374697609 375091438 376507988 377630806 377728386 377766914 378745003
698.2 378745003 379553795 379911118 379883652 380219994 381877823 382909813 382946587 383919792 385133286 385811043
707.9 385811043 387216949 388168068 388365250 389188042 389801559 389799461 389907379 390580444 390733299 391298828
717.5 391298828 392979355 393835983 394099274 393919220 393816261 394470482 395246429 395774345 396523628 397854156
727.2 397854156 398841438 399892998 401400146 402243271 402963181 404064445 403979683 403373108 403096848
735.8 403096848 403104134 404252510 405228958 406550865 407439461 407067528 407552299 407923203 407644730 406993332
745.5 406993332 407223740 407726402 408225174 410385246 412033882 412293282 411647530 412009697 413159485
754.2D13159485m25186l17307Q24585J516571J641541K540359K372399J092834J007958
762.8D23413239J7471M1275M51240K09198Q08754J152611P91245L61251K59934P46231
772.5D28252449P47261m81033o03943j15509O08024P91321N7755m94538k40058J261177
782.1D29782906J19972m71497l4141l40653J112137R18694P24754R05151O30646J3771
791.8D33361740j276283j083679K23541Q75397n89562j3122N25512j034546j513710
800.5D29475288j252861q55293j299019j78566o85272j735344o19354n88722j232949
809.1D21027908k375145j670265j407013j798248j745567j822701o57043M5623M94614
817.8D10092163l34587m21257k5444K99454J777229Q93936P19566J284256J964570
$$ plain form
754.2 413159485 412734299 412416992 413241577 414758148 416399689 418940048 421312447 422405281 423413239
762.8 423413239 423430710 423471985 423923225 424132423 424941177 426093788 426885033 427246284 427506218 428252449
772.5 428252449 428999710 428518677 427914734 427799225 428407249 429198570 429256325 428761787 428521729 429782906
782.1 429782906 429902878 429431381 429397240 429056587 430168724 431087418 431812172 432717323 433347969 433361740
791.8 433361740 432085457 431001778 431225319 432100716 431511154 431498032 432023544 430988998 429475288
800.5 429475288 428222427 427367134 426068115 425889549 425204277 423468933 422849579 422260857 421027908
809.1 421027908 418652763 416982498 415575485 413777237 412031670 410208969 409551926 409597549 410092163
817.8 410092163 409757576 409336319 409310875 409610329 411387558 412281494 413001060 414285316 416249886
826.5D16249886L344230L143082K775116K754326K596893Q72803P18651J986618K109527
835.2D36551132K131272K477722L366737K800598J904068Q95462J036530J540489J373291
843.9D54077301J513100J005554J681480J352883J744804J885719J169129J523132
851.6D65953102N07889M42696M56199J435890J970902K179146K019119Q28018J886864
860.3D77679825J208649J67274r70726j14937J639214Q10013L64418l84026j26762
868.9D80272942j785546j700668n18990j421814r20715q36334l99094j393852n13268
877.6D70782661k25257j954918j256981j708336j349144q72421k91596M38461J63117
886.3D63725586l83606o14014j28898p04499m69970o83289o6604P73048P25403J245422
$$ plain form
826.5 416249886 419594116 422737198 425512314 428266640 430863533 431736336 432454987 434441605 436551132
835.2 436551132 438682404 441160126 444526863 447327461 449231529 450126991 451163521 452704010 454077301
843.9 454077301 455590401 456595955 458277435 459630318 461375122 463260841 464429970 465953102
851.6 465953102 466460991 466903687 467359886 468795776 470766678 472945824 474964943 475792961 477679825
860.3 477679825 478888474 479055748 478085022 477970085 479609299 480419312 480783730 480399704 480272942
868.9 480272942 478487396 476786728 476267738 474845924 473925209 473088875 472689781 471295929 470782661
877.6 470782661 470557404 468602486 467345505 465637169 464288025 463415604 463124008 463562469 463725586
886.3 463725586 463341980 462727966 462599068 461894569 461424599 460741310 460674706 461447754 462173157 463418579
895.9D63418579R27353J471863O44836K6398n80101j633415j100006J6708J720161
904.6D64912376J619683K745666L295632K377929J642151L24822J58577q01964o00968
913.3D75673904j447296j285171K38380m06914j275215k766456k486878l429107l960228
922D58855019k877617l439484m014969k812729j572799l174095k566109k560120l552894
930.7D32284203k692872l082313k432213j792450m23584O67496j51100l97263j1291
939.3D21968613n2872j499825j670036j627388j820106j200753J90812Q34617n21774
948D14601288l60184l97758m89617n41839j182747k26174Q7319p51724j716347k010880
957.7D07011337k638550k569770j832619j711884j910095k765732j893043j301842
$$ plain form
895.9 463418579 464345932 465817795 466462631 466489029 465908928 464275513 463175507 463192215 464912376
904.6 464912376 466532059 469277725 472573357 474951286 476593437 476918259 477076836 476274872 475673904
913.3 475673904 474226608 472941437 473179817 472772903 471497688 468731232 466244354 462815247 458855019
922 458855019 455977402 452537918 448522949 445710220 444137421 440963326 438397217 435837097 432284203
930.7 432284203 429591331 426509018 424076805 422284355 421860771 422528267 422377167 421979904 421968613
939.3 421968613 421915741 420415916 418745880 417118492 415298386 414097633 414288445 415123062 414601288
948 414601288 414241104 413843346 413353729 412811890 411629143 411402969 411490288 410738564 409022217 407011337
957.7 407011337 404372787 401803017 399970398 398258514 396348419 393582687 391689644 390387802
965.4C90387802j165085r51767j831817k138176k409554j990738k250175k520104k525749
974.1C72604637l737450l538398k919159k936630l569451m391212m249535m785461
981.8C42477341n357933m969368m422226l193398l190002l853207l623772l290958
989.5C10576477l498115m223938l623562l314228k906056k635708k481041j796875
997.2B86096954k579269k640324l425502l592988k598362k138919j442967j748905
1004.9B65929718j159611r21459q46214j143799j518402r75342j461163k075424k542648
1013.6B53285656j295643q11806j508369j700192j776161j549396k460156k424049
1021.3B39759884k055912j130905j270237k079983j063499o77319q75092j789302o49987
$$ plain form
965.4 390387802 389222717 388270950 386439133 384300957 381891403 379900665 377650490 375130386 372604637
974.1 372604637 368867187 365328789 362409630 359473000 355903549 351512337 347262802 342477341
981.8 342477341 337119408 332150040 327727814 324534416 321344414 317491207 313867435 310576477
989.5 310576477 307078362 302854424 299230862 295916634 293010578 290374870 287893829 286096954
997.2 286096954 283517685 280877361 277451859 273858871 271260509 269121590 267678623 265929718
1004.9 265929718 264770107 263848648 263002434 261858635 260340233 259364891 257903728 255828304 253285656
1013.6 253285656 251990013 251178207 249669838 247969646 246193485 244644089 242183933 239759884
1021.3 239759884 237703972 236573067 235302830 233222847 232159348 231482029 230606937 228817635 228167648
1030B28167648m64115j075039q22239j463356k9144M45728J151333J696320J271629
1038.7B28878765P64275N98144J328507M28047P79667M48780n25208p59086p04842
1047.4B31237049L69701l22475q15315o56948o25248j603585j613712m52576o15520
1056B24901371m91581j29681Q96855N42793N92518J021976J537133J638393J316814
1064.7B31826591K751065J346741J303215J526985R92298R84573k50168L39070j09978
1073.4B40710392R54018Q47530n3806J043262K04163J111755J376228L81680L43552
1082.1B46918774Q63762M19254M99210J217556K61402J076680J703891K149449J543464
1090.7B56653442J127625J503162P20902J601887J425304J619244J992797J873856
$$ plain form
1030 228167648 227703533 226628494 225806255 224342899 224313755 224759483 225910816 227607136 228878765
1038.7 228878765 229643040 230241184 231569691 231997738 232777405 233226185 232700977 231941891 231237049
1047.4 231237049 231606750 231284275 230468960 229812012 229186764 227583179 225969467 225516891 224901371
1056 224901371 224409790 224280109 225176964 225719757 226312275 227334251 228871384 230509777 231826591
1064.7 231826591 234577656 235924397 237227612 238754597 239746895 240731468 240481300 240820370 240710392
1073.4 240710392 241664410 242511940 242458134 243501396 243705559 244817314 246193542 246575222 246918774
1082.1 246918774 247782536 248201790 248701000 249918556 250179958 251256638 252960529 255109978 256653442
1090.7 256653442 257781067 259284229 260005131 261607018 263032322 264651566 266644363 268518219
1098.5B68518219R51385L70026J978550J054459J126346J653614J305619J360950P63397
1107.1B79082565J217995J394711J329269P86438J021919Q81100L7899N72681Q38375
1115.8B87162952Q85449M26559O28014J87492o02131k84423k32449l84426n49450N90343
1125.5B87827930P58286J393909K013226J251202J293144Q57239J725902J904621J675015
1134.1C00700474J605568J249523K175999K295341K724686J990699R91078J177349
1141.9C14910717N60970N09892M05750M61273Q05378P76139P19509M96864O51093L09028
1151.5C20606613l89252k29301J4763j64871O5822K7142o35262n32512k97223o21337
1161.1C17844582p83253k85359J40133O86493J382256J585750K148743K045784K006416
$$ plain form
1098.5 268518219 269469604 269839630 271818180 272872639 273998985 275652599 276958218 278319168 279082565
1107.1 279082565 280300560 281695271 283024540 283810978 284832897 285713997 285751896 286324577 287162952
1115.8 287162952 288048401 288474960 289102974 289290466 288688335 288403912 288171463 287787037 287237587 287827930
1125.5 287827930 288586216 289980125 291993351 293244553 294537697 295394936 297120838 299025459 300700474
1134.1 300700474 302306042 303555565 305731564 308026905 310751591 312742290 313733368 314910717
1141.9 314910717 315471687 315981579 316387329 316848602 317653980 318430119 319149628 319646492 320297585 320606613
1151.5 320606613 320217361 319988060 320002823 319837952 319903774 319930916 319295654 318763142 318465919 317844582
1161.1 317844582 317061329 316775970 316916103 317602596 318984852 320570602 322719345 324765129 326771545
1169.8C26771545K538224J954651J804466K635956K617569K644004K475319K357140
1177.5C45798874K610779K056541J696854J357422J604194J506653J417236J639901
1185.3C59688454P26700P84339J392517Q73185k64206k33269o00510j274185o65092
1193.9C60427933m61006j54381m23165q40225q07075j196366j578483j662789j132354
1202.6C52172089j303711j402970o29234r75113j191406j89972J8654m02069n69420
1211.3C45526848q15659o06804n71556p49092j97792K72255L87154p0572n03464m66804
1220.9C42204514n67055n58663p00149m10767l89480j069756p76977l37868o17523
1229.6C36776276r95789q44459p66411r06296n05600k93350N2452q6975m69704k19002
$$ plain form
1169.8 326771545 329309769 331264420 333068886 335704842 338322411 340966415 343441734 345798874
1177.5 345798874 348409653 350466194 352163048 353520470 355124664 356631317 358048553 359688454
1185.3 359688454 360415154 361199493 362592010 363465195 363200989 362967720 362367210 361093025 360427933
1193.9 360427933 359966927 359812546 359389381 358549156 357742081 356545715 354967232 353304443 352172089
1202.6 352172089 350868378 349465408 348836174 347861061 346669655 346479683 346498337 346096268 345526848
1211.3 345526848 344711189 344104385 343532829 342783737 342585945 342858200 343245354 343174782 342671318 342204514
1220.9 342204514 341637459 341078796 340378647 339967880 339578400 338508644 337731667 337393799 336776276
1229.6 336776276 335780487 334936028 334169617 333263321 332757721 332464371 332516823 332429848 331960144 331741142
1239.3C31741142m54712o70776m97360o11j79023n65911l19671n29785m67873j21918
1248.9C27933502j0719o38046o88935J10283j16157k64244k64512q7242M24309M51088
1258.5C26849327j42441l83224m4403k37656J56441O84166N80368O74019Q44650O29616
1268.2C29610863O70738R41887L56712K30026O90613R36203Q18901Q34542J433105
1276.9C36523590J509895J220894J155205J254845Q26835P83654J061935J047554J574211
1285.5C46958618J969948J928673J512108J289787J194649J167717R29107M86718L64456
1294.2C57801781O05888J274948J374130J066208N24025J82534L03344O36788N88569
1302.9C64358215K5635K78854J03951J04332M92096Q6517m09775n17807m66842p69043
$$ plain form
1239.3 331741142 331286430 330615654 330118294 330117683 329938660 329372749 329053078 328523293 328055420 327933502
1248.9 327933502 327922783 327284737 326595802 326706085 326589928 326325684 326061172 325973930 326398239 326849327
1258.5 326849327 326706886 326323662 326279259 326041603 326198044 326882210 327462578 328136597 328981247 329610863
1268.2 329610863 330281601 331223488 331580200 331810226 332500839 333437042 334255943 335090485 336523590
1276.9 336523590 338033485 339254379 340409584 341664429 342491264 343274918 344336853 345384407 346958618
1285.5 346958618 348928566 350857239 352369347 353659134 354853783 356021500 356950607 357437325 357801781
1294.2 357801781 358407669 359682617 361056747 362122955 362646980 362829514 363132858 363769646 364358215
1302.9 364358215 364383850 364662704 364766655 364870987 365363083 365449600 365039825 364522018 364055176 363286133
1312.5C63286133m44756m71916n00488j32332J36909R86710J074448M60662J2017O57463
1322.2C65064850R65881K81830N19180O36444R43604O61507k78855p19757l59726P6409
1331.8C67791367l91617m26560l27606k20451j15929n3863J22413K71797L95317L03689
1341.5C67348557P04269L53355L29514Q68873Q66585N10292k06451J79481l8490N5161
1351.1C70971146R0561o18973l31307k31781L3760K5330J74484m71267r09043o72912
1360.8C68059998p66678q6060o36978r6283j04675l84789O9962o28586p07970o37321
1370.4C64080620m54369k96478m5891o7215m53224J52321J47667N94787P4692l65410
1380.1C63367500o81305j085014j244240j810150r01489p30171j004715j371842o52923
$$ plain form
1312.5 363286133 362841377 362369461 361868973 361736641 361873550 362860260 363934708 364395370 364407387 365064850
1322.2 365064850 366030731 366312561 366831741 367468185 368411789 369073296 368794441 368074684 367714958 367791367
1331.8 367791367 367399750 366973190 366645584 366425133 366309204 366255341 366377754 366649551 367044868 367348557
1341.5 367348557 368052826 368406181 368735695 369604568 370471153 370981445 370774994 370954475 370915985 370971146
1351.1 370971146 371061707 370442734 370111427 369879646 369913406 369938736 370113220 369641953 368732910 368059998
1360.8 368059998 367293320 367207260 366570282 366473999 366369324 365984535 366054497 365425911 364717941 364080620
1370.4 364080620 363626251 363329773 363283882 363216667 362763443 362915764 363063431 363658218 363732910 363367500
1380.1 363367500 362686195 361601181 360356941 358546791 357645302 356915131 355910416 354538574 353885651
1388.7C53885651k17247j287308j594238j736908j033974k008133l315506j388855
1396.4C41303482q10547n16014k652092k451935j483764j957665j503639j195068j734276
1405.1C26998482k323571j216316j168060j430092r06277j172924j147499j029606
1412.8C16604137n80196o96011r25808n77068o02188N18780j542931n64594J091137
1421.5C12725258L56216O40965j92566O63490Q81520M48169J071854P46841Q12741
1430.2C18154488N55038J543732J291618R62029J435203L15170Q00171K214661K601242
1438.9C29873352J662216J111756J072502O69937J245651P95212J530800J317978J132698
1447.6C40412102L89709N64575J589852N14259P47185N59540J368446J206856L87459
$$ plain form
1388.7 353885651 353668404 352381096 350786858 349049950 348015976 346007843 342692337 341303482
1396.4 341303482 340492935 339976921 337324829 334872894 333389130 331431465 329927826 328732758 326998482
1405.1 326998482 324674911 323458595 322290535 320860443 319954166 318781242 317633743 316604137
1412.8 316604137 316023941 315327930 314402122 313825054 313222866 313741646 312198715 311634121 312725258
1421.5 312725258 313081474 313722439 313529873 314193363 315074883 315523052 316594906 317341747 318154488
1430.2 318154488 318709526 320253258 321544876 322506905 323942108 324257278 325057449 327272110 329873352
1438.9 329873352 331535568 332647324 333719826 334389763 335635414 336430626 337961426 339279404 340412102
1447.6 340412102 340801811 341366386 342956238 343470497 344217682 344777222 346145668 347352524 347739983
1456.2C47739983J752243O47316L089904Q85430J584472J613923J316185J884841M75312
1464.9C60989609K328033K173538K779580K401542J902008K122460J385688L733101
1472.6C79815559K469712K505035K677116K562371K826423K738953K224808J735229
1480.3C99555206K327118J320687J105346J388512J202698J482429R58290O87332J541672
1489D11569290R69200m11033n85556m30527o09703o29349p98111l592491p9231j229172
1498.7D04173317k910805o59103j124649j209984j469727p5950r2316k888946k694626
1507.3C91047211j56594R28383r77630M55169o42357j618576o7787p07474o39953j390114
1517C86230278j955338M21792J307220j151810k042198J317024J166649J452103r82246
$$ plain form
1456.2 347739983 349492226 350139542 353229446 354114876 355699348 357313271 358629456 360514297 360989609
1464.9 360989609 363317642 365491180 368270760 370672302 372574310 374696770 376082458 379815559
1472.6 379815559 382285271 384790306 387467422 390029793 392856216 395595169 397819977 399555206
1480.3 399555206 401882324 403203011 404308357 405696869 406899567 408381996 409340286 410027618 411569290
1489 411569290 412538490 412127457 411541901 411111374 410501671 409872322 409074211 405481720 405402489 404173317
1498.7 404173317 401262512 400603409 399478760 398268776 396799049 396723099 396630783 393741837 391047211
1507.3 391047211 390890617 391819000 390841370 391296539 390654182 389035606 388967819 388260345 387620392 386230278
1517 386230278 384274940 384696732 386003952 384852142 382809944 384126968 385293617 386745720 385763474
1525.7C85763474P14988J186600j30348K24495M41169Q35114N65567P56798q30498
1534.3C89527359J140480J327705P41768J538315n89409j465683k14653Q52928L59917
1543C93218727Q95615J214637j17034J622390O65284P20977J9188p25441O36101J17760
1552.7C98268204J202850p53593L42369J011696N61218q57544n830841K135048q82645
1561.4C95196762J53618j180496j019745j970978k579384j188087j787071K45018n752106
1570C80117531l003884k082481l127708k183419k160072n43251j1476707j896439j908302
1578.7C51735268l434296l572540m934197l461761m823227k788811m743233m129581
1586.4C19847622l749199m406071k755909n160904k980613n011616l107853l411427
$$ plain form
1525.7 385763474 386478462 387665062 387534714 387759209 388200378 389035492 389601059 390357857 389527359
1534.3 389527359 390667839 391995544 392737312 394275627 393686218 392220535 392005882 392858810 393218727
1543 393218727 394114342 395328979 395211945 396834335 397499619 398220596 398239784 397514343 398150444 398268204
1552.7 398268204 399471054 398717461 399059830 400071526 400632744 399775200 393944359 396079407 395196762
1561.4 395196762 395350380 394169884 393150139 391179161 388599777 387411690 385624619 385869637 380117531
1570 380117531 377113647 375031166 371903458 369720039 367559967 367016716 355540009 353643570 351735268
1578.7 351735268 348300972 344728432 339794235 336332474 331509247 328720436 323977203 319847622
1586.4 319847622 316098423 311692352 308936443 303775539 300794926 295783310 292675457 289264030
1594.1B89264030m153461k200661m040107j703530m282741k201615l035679k966671
1601.9B64679565j798534l594685q60691l052272m70200k098351j504478j046982k128715
1610.5B48124657L44658k515755j36967j782341J80836N13534m003562J674041j078567
1619.2B41320534R05704j339702O11438M02546j195354J260605q7357J929741o71673
1627.9B43136482J736622M59843O60591J046944J24664K255401o6928K737484r50337
1636.6B51140766K289696J260605L95488J948891L18909K351017Q0032J622696J941490
1645.3B63349590J41182J707649j353530K934303O64177K409630K065105k84195j011219
1653.9B70622692o16817L250293O30818J550865Q01811J632042J324654Q14590K504311
$$ plain form
1594.1 289264030 285110569 282909908 278869801 277166271 272883530 270681915 267646236 264679565
1601.9 264679565 262881031 259286346 258425655 255373383 254903183 252804832 251300354 250253372 248124657
1610.5 248124657 248469315 245953560 245816593 244034252 244215088 244728622 240725060 242399101 241320534
1619.2 241320534 242226238 240886536 241497974 241900520 240705166 241965771 241878414 243808155 243136482
1627.9 243136482 244873104 245332947 245993538 247040482 247165146 249420547 249353619 252091103 251140766
1636.6 251140766 253430462 254691067 255086555 257035446 257354355 259705372 259785404 261408100 263349590
1645.3 263349590 263490772 265198421 263844891 266779194 267443371 269853001 271918106 271633911 270622692
1653.9 270622692 270005875 273256168 273886986 275437851 276239662 277871704 279196358 280010948 282515259
1662.6B82515259O6376K782115J331444K448750K771644K357388L208313P47719L750419
1671.3C01979427J255989L434849L297291K838058L625279K806797M000454K634888
1679C25873032M215583K497712M011535N439530L737640O137886P9269M909478M006805
1687.7C60908470M316063M495964L909073N076523M570618N313224M553833M697457
1695.4C97841225L117027N004005N762520N753136O312523j750069O464691N460053
1703.1D33965111M370575L435211L577156L521538L122215L950043K806129K465363
1710.8D61213341K529983K427483K724571J664162J869659L858605M170189k497139
1718.5D77960854J687164K844086J867523J912727J439896J055565J548538K189293
$$ plain form
1662.6 282515259 282581635 285363750 286695194 289143944 291915588 294272976 297481289 298229008 301979427
1671.3 301979427 303235416 306670265 309967556 312805614 316430893 319237690 323238144 325873032
1679 325873032 330088615 332586327 336597862 342037392 345775032 351912918 351992187 356901665 360908470
1687.7 360908470 365224533 369720497 373629570 378706093 383276711 388589935 393143768 397841225
1695.4 397841225 400958252 405962257 411724777 417477913 423790436 422040367 428505058 433965111
1703.1 433965111 438335686 441770897 445348053 448869591 451991806 455941849 458747978 461213341
1710.8 461213341 463743324 466170807 468895378 470559540 472429199 476287804 480457993 477960854
1718.5 477960854 479648018 482492104 484359627 486272354 487712250 488767815 490316353 492505646
1726.3D92505646J734047J419639J906853K56042N53971L264923L622780L27492l210869
1734.9E02380524L296127L852005K182007K441482J286621k17933L563537L173409
1742.7E21957779J813507K019539L240662L264694K586746L244896K418442M402008
1750.4E44948273K843857J246109M220809L100205L282623L524208J486473K354088
1758.1E67006645K935372K561798L358001M72870J62583K974167K116394J992797K120591
1766.8E85701218K073021p82700J841774L818245O25725n62363n75829L600083K633209
1775.4E98372383M58183K178345P29485J448517P94715m51393J290245J868019J507493
1784.1F08195992j45112O98128J477928J249009R19456J492577P59239P40547k50244
$$ plain form
1726.3 492505646 494239693 495659332 497566185 497822227 498376198 501641121 505263901 505591393 502380524
1734.9 502380524 505676651 509528656 511710663 514152145 515438766 515220833 518784370 521957779
1742.7 521957779 523771286 525790825 529031487 532296181 534882927 538127823 540546265 544948273
1750.4 544948273 547792130 549038239 553259048 556359253 559641876 563166084 564652557 567006645
1758.1 567006645 569942017 572503815 575861816 576334686 576497269 579471436 581587830 583580627 585701218
1766.8 585701218 587774239 586991539 588833313 592651558 593277283 592714920 592139091 595739174 598372383
1775.4 598372383 598830566 601008911 601738396 603186913 603981628 603530235 604820480 606688499 608195992
1784.1 608195992 608050880 608749008 610226936 611475945 612395401 613887978 614647217 615387764 615137520
1792.8F15137520p43141K984581J477584k517J014175K044907P80144j185570J949119
1801.5F23456802K02790Q31451J661072P31430J249428L61824L79982P55119J464462
1810.2F31094360l66706J30805J180344P42989J445007L30315J024513K14844M40635
1818.8F36237106J054497L662P47605k45362J101341J401673j361962N1613J973648
1827.5F40963821J994324Q087j866226J82266J724015N28030N57632O88324P43485
1836.2F45523758R78775o31790O79855J67618P9040J99204R15832J331940l042526
1844.9F46201706J912384J788483J53198j52741J51596J102295p5607J50070j79443
1853.6F51051941M55322N33447K83661O28586j97143N03540R1934N14679K29568K00119
$$ plain form
1792.8 615137520 614394379 617378960 618856544 618854027 619868202 621913109 622693253 621507683 623456802
1801.5 623456802 623659592 624491043 626152115 626883545 628132973 628494797 628874779 629629898 631094360
1810.2 631094360 630727654 630858459 632038803 632781792 634226799 634557114 635581627 635796471 636237106
1818.8 636237106 637291603 637295265 638042870 637797508 638898849 640300522 638938560 638990173 640963821
1827.5 640963821 642958145 642966232 641100006 641282272 643006287 643534317 644091949 644780273 645523758
1836.2 645523758 646502533 645870743 646550598 646718216 646797256 646996460 647912292 649244232 646201706
1844.9 646201706 648114090 649902573 650055771 649903030 650054626 651156921 651081314 651231384 651051941
1853.6 651051941 651507263 652040710 652324371 652952957 652755814 653259354 653351288 653865967 654095535 654295654
1863.2F54295654N53665J29776R40552N0507K49862j147155q83942J295548Q91494
1871.9F56375961M59137l98788L22037K70843L48663L10822L13339K64130k18048P20520
1881.5F58768616M196L74451J31836r4147O80008n4093K92206m60815p96891N10865
1891.2F59356232R73434J69296K65961L20511p41882O08215J31912P2327m3640l73764
1900.8F60738602M18548L93982O34308p8812N72434K00958n27878K0066o2180j79443
1910.4F62130585l53928P52258J40839N48630L23334l08915J086045j144638q09403
1919.1F62364807M42810L70941M60205k28958j4877L04718R73511J50680m22134m37241
1928.8F63964462n4931j60447m35028L40882k1363N54734P1029J32218K94876l50113
$$ plain form
1863.2 654295654 654849319 654979095 655919647 655970154 656220016 655072861 654188919 655484467 656375961
1871.9 656375961 656835098 656436310 656758347 657029190 657377853 657688675 658002014 658266144 658048096 658768616
1881.5 658768616 658772812 659147263 659279099 659184952 659864960 659810867 660103073 659642258 658845367 659356232
1891.2 659356232 660329666 660498962 660764923 661085434 660343552 660951767 661083679 661156006 661112366 660738602
1900.8 660738602 661157150 661551132 662185440 662106628 662679062 662880020 662352142 662372208 662310028 662130585
1910.4 662130585 661776657 662528915 662669754 663218384 663541718 663232803 664318848 663174210 662364807
1919.1 662364807 662807617 663178558 663638763 663409805 663394928 663699646 664673157 664823837 664401703 663964462
1928.8 663964462 663909531 663749084 663314056 663654938 663633575 664188309 664259338 664391556 664686432 664336319
1938.4F64336319q0566p25937O41250J48926j084595M29993N03540J2283j80359O03943
1948.1F64604797j57547l96804m07181l26996N5695m197N53131j31836K95029J29242
1957.7F64213333q8730j6937m35867q0414o19354J29852j0300L20969O94885l35693
1967.3F63771744l8605l05939J18637l21731m11682P0495J11008L41797k01187m5624
1977F63088913j679K88926l19290k55662L76587j62887k44904m37546J81656j94244
1986.6F62319870q6823R7275j87225N37186J831l35846n77240M348P6218j59225j49079
1997.2F61541290l15704L61328k91290L5400j56555l55759M6845k57645K87476j79520
2006.9F60715866L7613l35007j30386M88892j87684k38418m01764K32010k60086m67758
$$ plain form
1938.4 664336319 664255753 663529816 664171066 664319992 663235397 663665390 664168930 664181213 664000854 664604797
1948.1 664604797 664447250 664050446 663643265 663316269 663371964 663367767 663920898 663789062 664084091 664213333
1957.7 664213333 664124603 664107666 663671799 663591385 662972031 663101883 663091583 663412552 664107437 663771744
1967.3 663771744 663733139 663427200 663545837 663224106 662812424 662882919 662993927 663335724 663134537 663088913
1977 663088913 663087234 663376160 663056870 662801208 663177795 663014908 662770004 662332458 662514114 662319870
1986.6 662319870 662233047 662330322 662143097 662680283 662682114 662346268 661769028 661773376 661849594 661690369 661541290
1997.2 661541290 661225586 661586914 661295624 661331024 661174469 660818710 660865555 660607910 660895386 660715866
2006.9 660715866 660753479 660418472 660288086 660776978 660589294 660350876 659949112 660181122 659921036 659453278
2016.5F59453278n03617k05383M61731l03040J98746j96915J00708P0496p41806k60468
2026.2F58073730k87857K23389r0561R92j57394l52631Q7662n2109M5319n22995l77274
2036.8F56590271k65045J55105J2665n99975m82865l03116N79758N1956J35651O9046
2046.4F55943451j52435N9280o03180m32510m41742N10559P3318l95126J55640m9591
2056.1F54667664J46102n02166l8452j88828j7013K1133n17273L08151k30179J63498
2065.7F53812637O2485j22528j0223l24555L4714k49176J00326k47192k00958N493
2075.4F52861023J70441K60086k83814p6065l65829M70810m3717o35071J7701j50452
2085F52225113k4033n73425j6327o7825j90354K2202j34735K61154k52151k09733n77392
$$ plain form
2016.5 659453278 658949661 658744278 659206009 658902969 659101715 658904800 659005508 659076004 658334198 658073730
2026.2 658073730 657785873 658009262 657918701 657919693 657762299 657409668 657497330 657445221 657490540 656967545 656590271
2036.8 656590271 656325226 656480331 656492996 655893021 655410156 655107040 655686798 655738754 655874405 655943451
2046.4 655943451 655791016 655850296 655247116 654814606 654372864 654883423 654956741 654561615 654717255 654667664
2056.1 654667664 654813766 654311600 654273148 654084320 654067307 654088440 653571167 653879318 653649139 653812637
2065.7 653812637 653875122 653752594 653742371 653417816 653452530 653203354 653303680 653056488 652855530 652861023
2075.4 652861023 653031464 653291550 653007736 652931671 652565842 653036652 652992935 652357864 652375565 652225113
2085 652225113 652201080 651627655 651611328 651543503 651353149 651375351 651240616 651501770 651249619 651039886 650462494
2095.6F50462494k59628j15662j93710L19671q3236J28173k81982j13144k62451k37656
2105.2F49362869Q1253n13153n4474k58407k14691k89612K31323K96173l44009J42288
2114.9F48439560n54352l04947q7127k39106j80435K14234M98504l48739m6006k82287
2124.5F47109299j88980L9596J06583j35117o57577K14081l434Q2550m1885K40860
2134.2F46765976L58581p16781l03574k24380J29318O6071l6698R9335K26669K76642
2143.8F46641159k17743N59235J1902m61502m63791j83487L65982k06146j7777j24893
2153.5F45902939O28738M28467k22702o6071n38177k1973j79672j09940J64032M01841
2163.1F46387482J39084Q6746M31900m52194N2719j28479m34800l05938N34M02374
$$ plain form
2095.6 650462494 650202866 650087204 649893494 650213165 650129929 650258102 649976120 649862976 649600525 649362869
2105.2 649362869 649444122 648930969 648876495 648618088 648403397 648113785 648345108 648641281 648297272 648439560
2114.9 648439560 647885208 647580261 647493134 647254028 647073593 647287827 647786331 647437592 647391586 647109299
2124.5 647109299 646920319 646959915 647066498 646931381 646273804 646487885 646484451 646567001 646525116 646765976
2134.2 646765976 647124557 646407776 646104202 645879822 646009140 646075211 646038513 646137848 646364517 646641159
2143.8 646641159 646423416 646982651 646994553 646533051 646069260 645885773 646251755 646045609 646027832 645902939
2153.5 645902939 646531677 646960144 646737442 646671371 646133194 646111221 645931549 645821609 645985641 646387482
2163.1 646387482 646526566 646613312 647045212 646593018 646645737 646517258 646082458 645776520 645777054 646179428
2172.8F46179428k65503K64282M2038J00251J35421K4262K36587l33938J04065K594
2182.4F46489487L13797K07672O2103J20545k36817J72196l41263K8686m5013j13754
2192F46657639K54058L9215K31705m8904J34048k82211j32217P1868L4256q9645l41110
2202.6F46528702O60934J47476N7679k39411k09503M57001k92587o4393k15911K83584
2212.3F47113571N10559K11716Q2092j19095K22397m82406k77863k82440j83945J29700
2221.9F46924286K53219M80271k01721J34124k05154n3406M6463l48358L0899j53274
2231.6F46907349J91879l586L39661K92358j29623J8310j60751j68228o28586j1597
2241.2F46647186p6599p6065K14996r2239L43247J54876K44751l5019j60446m93164
$$ plain form
2172.8 646179428 645913925 646178207 646220245 646320496 646455917 646480179 646716766 646382828 646486893 646489487
2182.4 646489487 646803284 647010956 647073059 647193604 646956787 647128983 646787720 646816406 646771393 646657639
2192 646657639 646911697 646950912 647182617 647133713 647267761 646985550 646853333 646925201 646959457 646869812 646528702
2202.6 646528702 647189636 647337112 647394791 647155380 646945877 647402878 647110291 647045898 646829987 647113571
2212.3 647113571 647624130 647835846 647917938 647798843 648021240 647538834 647260971 646978531 646794586 646924286
2221.9 646924286 647177505 647657776 647456055 647590179 647385025 647331619 647378082 647029724 647060623 646907349
2231.6 646907349 647099228 647095642 647435303 647727661 647598038 647616348 647455597 647287369 646658783 646647186
2241.2 646647186 646570587 646494522 646709518 646617279 646960526 647115402 647360153 647325134 647164688 646671524
2250.9F46671524m35638P9574q2626O54907K65427K24914j14517m87823N2642l19900
2260.5F46508484j74179m00391K3804K74963J69068J38015K81067L94669p36389k98996
2270.2F46180115k32010k21405p2785j06353L17306j88141K33307o86J67236O2256
2279.8F46138840n79911m74700o65436K57263J44043J00784O9657N2337K90604m01154
2289.4F44932327l86352o11878k6092k09351k97851J87072m7149L8910m90418O1112
2299.1F43150330j46027O5918K81219k65884M7684q82645k51312R9411r8419j20011
2308.7F41880264l35235J53351l04184J12381m8447J50375o0119p69501n77850o42701
2318.4F39558334M01917j99700l42483l27492J05438Q71048o64062m60243k42577l09563
$$ plain form
2250.9 646671524 646235886 646315460 646232834 646887741 647153168 647378082 647263565 646775742 646828384 646508484
2260.5 646508484 646334305 645933914 645957718 646232681 646401749 646539764 646820831 647215500 646479111 646180115
2270.2 646180115 645948105 645726700 645653915 645547562 645864868 645676727 645910034 645909348 646076584 646138840
2279.8 646138840 645558929 645084229 644418793 644676056 644820099 644920883 644990540 645042877 645333481 644932327
2289.4 644932327 644545975 643934097 643908005 643698654 643400803 643587875 643540726 643579636 643089218 643150330
2299.1 643150330 643004303 643070221 643351440 643085556 643133240 642250595 641999283 642098694 642000275 641880264
2308.7 641880264 641545029 641698380 641394196 641506577 641458130 641608505 641548386 640778885 640201035 639558334
2318.4 639558334 639960251 639760551 639418068 639090576 639196014 640067062 639403000 638942757 638700180 638390617
2328F38390617l63426K02370J47858j96000p9383r03740N84488L91197p30133p71141
2337.7F36672707j13984J55602n12543P7286r3384K67487l93296K2088k20490q17108
2347.3F35044365Q58650O50597l02048j268349k76756q5716n26734q0490j012573J063957
2356.9F34064903M88549k04850o87103j491318q33358p01714Q57010K24647M50211
2365.6F32166977n9891J088257J170959o74819j94130j347695n00679N87197L54385
2374.3F32590561o45828o17638K00691l73115l90168m72030L55949K92244l42598l14293
2383.9F30283775m14581j24588l86887n4473l52669l84941j18828l36876L7041n18303
2393.6F27628670n0736k4681n23948l36037k62871l1166n03006k82936j41411K632
$$ plain form
2328 638390617 638027191 638229561 638377419 638181419 638102036 637198296 637782784 638173981 637443848 636672707
2337.7 636672707 636558723 636714325 636201782 636279068 636185684 636453171 636059875 636081963 635861473 635044365
2347.3 635044365 635903015 636553612 636251564 634983215 634706459 634620743 634094009 634013519 633000946 634064903
2356.9 634064903 634553452 634348602 633661499 632170181 631336823 630635109 631492119 631716766 632166977
2365.6 632166977 632107086 633195343 634366302 633691483 633497353 632149658 631648979 632236176 632590561
2374.3 632590561 631944733 631327095 631527786 631154671 630764503 630292473 630648422 630940666 630598068 630283775
2383.9 630283775 629869194 629744606 629357719 629303246 628950577 628565636 628446808 628109932 628146973 627628670
2393.6 627628670 627577934 627553253 627029305 626693268 626430397 626399231 625896225 625613289 625471878 625474510
2403.2F25474510o3286l37791l17841n83877k78931m75426k96096l38669k87972n0850
2412.9F22443771j92413R3613n49698m31862m31671m26674k48756n56489k11715l41301
2422.5F19146805j56212k73247k36931m82826p03125j32828j25770r9335o95000l67469
2432.2F15874062l07579k69814O2599l47442Q1825o94351p02210k35634l12805m75731
2441.8F12672920p38525Q0566l18222l45001n2147k82555o51054o33316j62697o09741
2451.5F08960228l25851n16701k09770n7373n04609l7040j01433j9341q13141m53071
2461.1F05921898j26801q69255o11000n08957J82991k31399n92118k95066k61422l26652
2470.7F02282219o43120l80897p93000m30145j90582m49677m71153o32706j48620m41933
$$ plain form
2403.2 625474510 625411224 625073433 624755592 624171715 623892784 623417358 623121262 622782593 622494621 622443771
2412.9 622443771 622251358 622344971 621795273 621363411 620931740 620505066 620256310 619699821 619488106 619146805
2422.5 619146805 618990593 618717346 618480415 617997589 617294464 617161636 617035866 616936531 616241531 615874062
2432.2 615874062 615566483 615296669 615359268 615011826 615093651 614399300 613697090 613461456 613148651 612672920
2441.8 612672920 611934395 612014961 611696739 611351738 611299591 611017036 610365982 609732666 609569969 608960228
2451.5 608960228 608634377 608117676 607907906 607850533 607345924 607308884 607207451 607188110 606374969 605921898
2461.1 605921898 605795097 604925842 604314842 603805885 603988876 603757477 603165359 602870293 602608871 602282219
2470.7 602282219 601639099 601258202 600465202 600035057 599844475 599394798 598923645 598290939 598142319 597700386
2480.4E97700386n23682n10978n49736m42505k29454j76583o52656l30658o59409m03862
2490E93220863j11160o31676m57534l81318j57051n45921n48058l02505m91982o35376
2499.7E88958282q01010n91812m76913K4070n8403n94368o26831j35154l13835j065140
2509.3E84318886o23436n18227l83224j92337n4856k29606o58112n38177p82853j48429
2519E80189629l26081p49130n62515n87311q0414m04930k41394j35384j77497m76799
2528.6E76448174j012459m67110o90613p60612k95410K16713N1384k86255l22152n74455
2538.2E72307205k70042p21016o91719n43366m56428n1689m27170k96173m03519m08211
2547.9E68037872l64341m64936o01158n57022k73209p54623o29578k52418K174k63557
$$ plain form
2480.4 597700386 597176704 596665726 596115990 595673485 595444031 595267448 594614792 594284134 593624725 593220863
2490 593220863 593109703 592478027 592020493 591639175 591482124 590936203 590388145 590085640 589593658 588958282
2499.7 588958282 588157272 587565460 587088547 587112617 587054214 586459846 585833015 585697861 585384026 584318886
2509.3 584318886 583695450 583177223 582793999 582601662 582546806 582317200 581659088 581120911 580338058 580189629
2519 580189629 579863548 579114418 578551903 577964592 577884178 577479248 577237854 577102470 576924973 576448174
2528.6 576448174 575435715 574968605 574277992 573517380 573221970 573438683 573490067 573203812 572881660 572307205
2538.2 572307205 572037163 571316147 570624428 570081062 569624634 569572945 569145775 568849602 568446083 568037872
2547.9 568037872 567673531 567208595 566607437 566050415 565777206 565022583 564393005 564140587 564142761 563879204
2557.5E63879204k58599k29072p25937m45099r66949m56314J53617l11546l35922l45726
2567.2E59957657l31764j000748m05312N913l48739l47634n83687n42831q05512p9422
2576.8E55517921K7619m02565m35829m64135k93693q67920l81775k21443j93138R0751
2586.5E52375793l03039m85115q75435n57213m73709k65007k54364n56335m60053o22978
2596.1E47522545j92413k70691k81754n86510j117859q62579k80914R9678n37911k88353
2605.7E43203239k83660o67954o55250n24407k11983o80847l80516m61998n67627l97339
2615.4E38371658n41687r9334m80004p64007j003075q17413m04320n67093j64108k10839
2625E33319778o54563o00625l84330m04969k00729o80656r30748l98789o41060m28924
$$ plain form
2557.5 563879204 563620605 563391533 562665596 562220497 561253548 560797234 560950851 560639305 560303383 559957657
2567.2 559957657 559625893 558625145 558219833 558225746 557877007 557529373 556945686 556402855 555597343 555517921
2576.8 555517921 555545540 555142975 554707146 554243011 553949318 553081398 552699623 552478180 552285042 552375793
2586.5 552375793 552072754 551587639 550712204 550154991 549681282 549416275 549161911 548605576 548145523 547522545
2596.1 547522545 547330132 547059441 546777687 546191177 545073318 544210739 543929825 544029503 543491592 543203239
2605.7 543203239 542919579 542251625 541596375 541071968 540859985 540179138 539798622 539336624 538768997 538371658
2615.4 538371658 537829971 537730637 537250633 536486626 535483551 534666138 534261818 533694725 533530617 533319778
2625 533319778 532665215 532064590 531680260 531275291 531074562 530393906 529463158 529064369 528423309 527994385
2634.7E27994385l76244k85148k37885m62227n51796r16328n62744n61333l62129l67241
2644.3E23311310o47469l95584o41136m40712k73895j98059m45214n83954m51774o87943
2654E18545570n18188m55856l70408o49528n02243j89362n0010j04180r02977k59323
2663.6E14543495j14708o58836m15535k47650l02391q00896n70068l44010r1095m1465
2673.3E10956841n04685l56140l32565l64533k97317l87230n74761j94320k82135o43235
2682.9E07019920k31819m32968o22292m00238n3978k51426m92287m10004m21714M3373
2692.5E03746567k32239n71404n02662k28462j46332m12522j78070m52537o76308l73230
2702.2D99972801J40190r6016l40271j13220m36058l31077o74477o64711o33698o25305
$$ plain form
2634.7 527994385 527618141 527332993 527095108 526632881 526081085 525164757 524602013 524040680 523678551 523311310
2644.3 523311310 522663841 522268257 521627121 521186409 520912514 520714455 520269241 519685287 519233513 518545570
2654 518545570 518027382 517571526 517201118 516551590 516049347 515859985 515809975 515705795 514802818 514543495
2663.6 514543495 514428787 513769951 513354416 513106766 512804375 512003479 511433411 511089401 510998306 510956841
2673.3 510956841 510452156 510096016 509763451 509398918 509101601 508714371 508139610 507945290 507663155 507019920
2682.9 507019920 506788101 506355133 505732841 505332603 505278625 505027199 504534912 504124908 503703194 503746567
2692.5 503746567 503514328 502942924 502440262 502211800 502065468 501652946 501474876 501022339 500346031 499972801
2702.2 499972801 500112991 500016975 499676704 499563484 499127426 498796349 498121872 497457161 496823463 496198158
2711.8D96198158O6872j89972j24779J3619j44158n52826m97055J1216j34926l19481
2721.5D94326668r73740o91757n2795j870j97181k24648O7063k31553j19247n93910
2731.1D91307030o10695l18070k60772L17077l57284m18740j89399r9449j98555o14434
2740.8D88556709l02162l14560n0812j22528q4266p8812k31132L4370j97830k24839
2750.4D86984138m07485k35939l98980m30908p7667l24707m3984j95999j28288j80817
2760D84559364n38253n38369k81944o2790o62804k09655j59493p03392l59459j27754
2769.7D80915451j62239k79427P8926q0604n41267q86231n94520j95275n69954n08575
2779.3D77176285l67432J63651m7226n90363l60451l38935n56107q09059l18680n10178
$$ plain form
2711.8 496198158 496265030 496075058 495950279 495963898 495819740 495266914 494769859 494781075 494646149 494326668
2721.5 494326668 493352928 492661171 492608376 492606506 492409325 492184677 492251740 492020187 491900940 491307030
2731.1 491307030 490696335 490378265 490117493 490434570 490077286 489658546 489469147 489369698 489171143 488556709
2740.8 488556709 488254547 487939987 487889175 487766647 487682381 487603569 487372437 487406807 487208977 486984138
2750.4 486984138 486576653 486340714 485941734 485510826 485433159 485108452 485064468 484868469 484740181 484559364
2760 484559364 484021111 483482742 483200798 483138008 482475204 482265549 482106056 481402664 481043205 480915451
2769.7 480915451 480753212 480473785 480552711 480472107 479930840 479044609 478450089 478254814 477684860 477176285
2779.3 477176285 476808853 476972504 476925278 476334915 475974464 475635529 475079422 474270363 473951683 473441505
2789D73441505o80198k68517l41759n59043p04880l93105m95300k23846n61371j060791
2798.6D68152695n71366m41360j89667p72285q26187m64859o01159m08783n57518o92558
2808.3D62626953o68754m54712r67751p50275m74472r80491m47083o07071o36978n87387
2817.9D56051979r11446r19685q53348p18078q07076l92532n34401p49588q41751j101418
2827.6D48222656j056633o09932j02386j041489j136207q77686q09135m05198q90426
2836.2D41293564j043434j463433j319275j234817j401825j075668j697617j941070
2843.9D30116425j829682j355171j097107j756554k058830j704979j329269j316300
2851.7D17668533j248665r58175k69089l76968k36512l7307m35868o3324m29802l90319
$$ plain form
2789 473441505 472761307 472492790 472151031 471591988 470887108 470494003 469998703 469774857 469213486 468152695
2798.6 468152695 467581329 467139969 466950302 466178017 465351830 464886971 464285812 463877029 463319511 462626953
2808.3 462626953 461958199 461503487 460535736 459785461 459310989 458330498 457883415 457276344 456639366 456051979
2817.9 456051979 455140533 454220848 453367500 452649422 451842346 451449814 450915413 450165825 449324074 448222656
2827.6 448222656 447166023 446556091 446453705 445412216 444276009 443398323 442589188 442183990 441293564
2836.2 441293564 440250130 438786697 437467422 436232605 434830780 433755112 432057495 430116425
2843.9 430116425 428286743 426931572 425834465 424077911 422019081 420314102 418984833 417668533
2851.7 417668533 416419868 415461693 415192604 414815636 414579124 414541817 414105949 414042625 413612823 413222504
2861.3D13222504m60968o26679k25525n62324n31159j059723j095543m64057n12200
2870D07684326j017189j154976m51698n51491n28297o79741p70302l56293m83627l74641
2879.6D01316071q08068j069183n06325m49295q83293q33168j020966r19380l29742
2888.3C94496651j140900j019363n51949r32045p92313o78062m95644n42717n30128
2897C87813530j045151j211090p50580o02035k24610n45044p60879q88672q39996n71823
2906.6C80373650l36304p9613r30900j038857q75816j326447j533623j576042j118431
2915.3C71557617q74519r96704j197510j252708j327782j014938p58324q35457n91126
2924C62708549n97229j23825L14980L38478J1749k82211k88010n89256k54059K28424
$$ plain form
2861.3 413222504 412761536 412134857 411909332 411347008 410815849 409756126 408660583 408196526 407684326
2870 407684326 406667137 405512161 405060463 404508972 403980675 403300934 402530632 402174339 401690712 401316071
2879.6 401316071 400508003 399438820 398932495 398483200 397599907 396766739 395745773 394826393 394496651
2888.3 394496651 393355751 392336388 391784439 390852394 390060081 389382019 388886375 388343658 387813530
2897 387813530 386768379 385557289 384806709 384204674 383980064 383435020 382674141 381785469 380945473 380373650
2906.6 380373650 380037346 379957733 379026833 377987976 377112160 375785713 374252090 372676048 371557617
2915.3 371557617 370683098 369686394 368488884 367236176 365908394 364893456 364135132 363299675 362708549
2924 362708549 362111320 361987495 362302475 362640953 362652702 362370491 362082481 361493225 361239166 361467590
2933.6C61467590N51071J18485J50604R23081N70030L50838M72107J150512J157494
2942.3C66911812L39088O9924K38723P21703M66919O24199N69382L32870O84319P29675
2952C71688614M53110l96538L75404J195336N91850J75285P9651M98009M11186M64363
2961.6C75536270O78558O11535P07016Q19892N40390N32151J159782P17163M08783
2970.3C81711540L14255L06091P14226P05681Q98323L47786P9269L93219L99971M64592
2979.9C86334953J85776O9199L18718L52974k55547j32332L76778L10898K08931J80320
2989.6C87950668M22058M4175l64304l05786K44064L38097j66702j80092n78728l08380
2999.2C87095070m13361l96957L51410n15557j035881p42416m56886l17230l52517
$$ plain form
2933.6 361467590 362018661 362137146 362287750 363210831 363780861 364131699 364603806 365754318 366911812
2942.3 366911812 367250900 367320824 367559547 368281250 368748169 369372368 369941750 370274620 370958939 371688614
2952 371688614 372141724 371745186 372120590 373315926 373907776 374083061 374162712 374660721 375071907 375536270
2961.6 375536270 376214828 376826363 377533379 378353271 378893661 379425812 380585594 381302757 381711540
2970.3 381711540 382025795 382331886 383046112 383751793 384650116 384997902 385077171 385470390 385870361 386334953
2979.9 386334953 386520729 386589928 386908646 387261620 387006073 386873741 387250519 387561417 387770348 387950668
2989.6 387950668 388372726 388416901 388052597 387746811 387990875 388328972 388162270 387982178 387403450 387095070
2999.2 387095070 386681709 386284752 386636162 386120605 385084724 384342308 383885422 383568192 383215675
3007.9C83215675m55703p58057p07855l81546k35710p29485n06096m18854n90820k24228
3017.5C78207321o89277q60978j073494q28132r4986k15035n34744j034279r93080
3026.2C71883316q96568p55158l56254l07999k06337l80669j107940j321907o96564
3034.9C65853920p17621n33905m98009j041717m73900k95639r52835j247177o75278
3043.6C59417839l86085p70112j018905j162110n13000l02239r03892j103439o46973
3052.2C52611084m04129p28836p01065p81632q08029j036873j042366n88112l29322
3060.9C46190720j34964p80259j133079q05397n05180m70162n02472n09033j043701
3069.6C40306473q22296m61693m22325m79584q10280m67529l51372n58777m64706m30870
$$ plain form
3007.9 383215675 382759972 382001915 381294060 380912514 380676804 379947319 379441223 379022369 378431549 378207321
3017.5 378207321 377518044 376657066 375583572 374755440 374660454 374445419 373910675 372876396 371883316
3026.2 371883316 370986748 370231590 369875336 369567337 369361000 368980331 367872391 366550484 365853920
3034.9 365853920 365136299 364602394 364104385 363062668 362588768 362293129 361340294 360093117 359417839
3043.6 359417839 359031754 358261642 357242737 356080627 355567627 355265388 354361496 353258057 352611084
3052.2 352611084 352206955 351478119 350777054 349995422 349187393 348150520 347108154 346520042 346190720
3060.9 346190720 346055756 345275497 344142418 343337021 342831841 342361679 341859207 341350174 340306473
3069.6 340306473 339484177 339022484 338600159 338120575 337310295 336842766 336491394 335932617 335467911 335037041
3079.2C35037041q32939j035004q13828m33731p1983m80423o27289q53309q41179j35765
3088.9C28911591m02222p11365r18159r43795m99191n84755q19359m75311l9482m30718
3098.5C23087234q58383q11386q10852p07092o01196p00894l10020j16883o59236m89350
3108.2C17021942n04951r19991q68244p16038p72629q84838j98307j73359n70583k43549
3117.8C11169453m96178j044064j144714p23114n38940n49088m81243p97329q55236
3126.5C04539547m59309m30851o81514n43843o63166n98602p05071j195564n61409
3135.2B98700218j98669m89941o08883n35679q43238j298161q64716l83777l79067
3143.9B93098087q37688n91049k97718p33509o11058p03754n52063n35755r56269p59143
$$ plain form
3079.2 335037041 334204102 333169098 332355270 331921539 331849556 331369133 330741844 329888535 329047356 328911591
3088.9 328911591 328509369 327798004 326879845 325936050 325436859 324852104 324032745 323557434 323517952 323087234
3098.5 323087234 322228851 321417465 320606613 319899521 319298325 318597431 318287411 318170528 317511292 317021942
3108.2 317021942 316516991 315597000 314728756 314012718 313240089 312355251 312156944 311983585 311413002 311169453
3117.8 311169453 310673275 309629211 308484497 307761383 307222443 306673355 306192112 305394783 304539547
3126.5 304539547 304080238 303649387 302967873 302424030 301760864 301162262 300457191 299261627 298700218
3135.2 298700218 298501549 298011608 297402725 296867046 296023808 294725647 293860931 293477154 293098087
3143.9 293098087 292260399 291669350 291371632 290638123 290027065 289323311 288771248 288235493 287279224 286520081
3153.5B86520081n83115p01599q96721n04208k12345m81357p82566p08657l68118p66850
3163.1B80514545j044769p39021l40042o37818j223220m78878k25392r32827n26657
3171.8B74365921j77135n58835n93242r29756o13613R5768n26047q29296r42459j071396
3181.5B68219910m66690k91996p18613q24719m11109l43171l95317n56221p99293o53038
3191.1B62759743o41232n60932k86179k88105o44130p69348o95668l10306k15435q56953
3200.8B57491455n83591m14715o91700m61483m43421m91886l46298j73912m97360n49431
3210.4B52837658n65243p36980l28179m69055l89843J8158k57702q09841r87377n68504
3220B47743092p9308l2921r00211q85964p3833l17764m75979m26274n09834m12311
$$ plain form
3153.5 286520081 285936966 285235367 284338646 283834438 283622093 283140736 282358170 281649513 281281395 280514545
3163.1 280514545 279469776 278730755 278390713 277752895 276529675 276050797 275825405 274892578 274365921
3171.8 274365921 274188786 273629951 273036709 272106953 271493340 271589108 271063061 270233765 269291306 268219910
3181.5 268219910 267753220 267461224 266742611 265917892 265506783 265163612 264768295 264212074 263412781 262759743
3191.1 262759743 262118511 261557579 261271400 260983295 260339165 259569817 258874149 258563843 258348408 257491455
3200.8 257491455 256907864 256493149 255801449 255339966 254896545 254404659 254058361 253884449 253387089 252837658
3210.4 252837658 252272415 251535435 251207256 250738201 250348358 250366516 250108814 249298973 248311596 247743092
3220 247743092 247663784 247630863 246730652 245844688 245770855 245453091 244977112 244550838 244041004 243628693
3229.7B43628693j95141l02029o91566m94347k88620n64976o59275m39300l66974m20056
3239.3B39206409k83889r5997l41091n74093m7760j17073r82285n72567J59779l42388
3249B36009045n45712l41759l30677j83754o52103m79851R0943k26155o91318j011734
3258.6B31636925k65847K06509k95067m16965o16131m92649J18332N5370m30794l54614
3268.3B29145069k87838j95618l20129p20215l55205l56922q1997J57585n58129m60796
3277.9B25965805j44482p1830o01502q11882J8768l39069o00872J55640J45015k60276
3287.5B23455315k50836m7455j53560m11263j49345k8191l15342l29456m41589k05918
3297.2B21122360K40288P7457l12156o23932l84140j73340k24895k09427j52111r709
$$ plain form
3229.7 243628693 243433552 243131523 242439957 241945610 241656990 241092014 240432739 239993439 239626465 239206409
3239.3 239206409 238922520 238826523 238485432 237911339 237863579 237746506 236764221 236191654 236351433 236009045
3249 236009045 235463333 235121574 234790897 234607143 233955040 233475189 233566132 233339977 232648659 231636925
3258.6 231636925 231371078 231577587 231282520 230865555 230249424 229756775 229875107 229930477 229499683 229145069
3268.3 229145069 228857231 228661613 228341484 227621269 227266064 226909142 226827145 226984730 226426601 225965805
3277.9 225965805 225821323 225749493 225147991 224336109 224354877 224015808 223414936 223570576 223715591 223455315
3287.5 223455315 223204479 223157024 223003464 222592201 222442856 222414665 222099323 221769867 221328278 221122360
3297.2 221122360 221362648 221440105 221127949 220504017 220119877 219946537 219721642 219512215 219360104 219350395
3306.8B19350395l18584l86086l17611m40522l40767l27720k7161L6030k03152l79963
3316.5B16644859k49195j86176r12266n67283j72425m92554l9196j97696m25587q9092
3326.1B13313389P9632l28923p67746l2520j24874p34139j51329n2242p68413p80697
3335.8B09652138l68729n99937k22378j25008r65690m51374L44619J55526m16203o94714
3345.4B06308250l11431O2217Q5411k39372l90282k14576j90506m29211k57473M4537
3355.1B04467564k00367j95732j53370J76887L48759m66080n86433j38493k08149l64704
3364.7B02679882j34773K27566N3196m74034j29948J81828m76475l39756j93062j38454
3374.3B01255970P5245k78664L4867o2390j66836K17514J8483o4831l5935J5336l88012
$$ plain form
3306.8 219350395 219031811 218645725 218328114 217887592 217546825 217219105 217191944 217227974 217024822 216644859
3316.5 216644859 216395664 216209488 215297222 214729939 214557514 214064960 214025764 213828068 213402481 213313389
3326.1 213313389 213393021 213064098 212296352 212263832 212138958 211404819 211253490 211201248 210432835 209652138
3335.8 209652138 209283409 208683472 208461094 208336086 207370396 206919022 207263641 207419167 207002964 206308250
3345.4 206308250 205996819 206059036 206144447 205905075 205514793 205300217 205109711 204680500 204423027 204467564
3355.1 204467564 204267197 204071465 203918095 204094982 204443741 203977661 203391228 203252735 203044586 202679882
3364.7 202679882 202545109 202772675 202825871 202351837 202221889 202403717 201927242 201587486 201394424 201255970
3374.3 201255970 201331215 201052551 201087418 201025028 200858192 201075706 201094189 201029358 200993423 201008759 200620747
3384.9B00620747m74682j278L71399O29291J87607k03838m30622l79010o6299L37505
3394.6B00590820M58489k98386l98102J13392M44432L21579J60408j36166p86114o7367
3404.2B00402985L78036M1752m997J52855M00848m4422R7961K41814r975r9411j46695
3414.8B01410751M25549l1929n28298L84255R22432M19369j60885K3155K30522L73078
3424.5B03467999J11236l6564N28488N43480K80075r1457n245O07204K64130O0577
3434.1B05729923K66075N6496p820K29473M44889K01225M77353Q23421J8616J5926
3443.8B08255577M46453M05255N44929J71032J4343M91810Q67252P45736K26688k11620
3453.4B11957455J65672R80282P34062M46377Q00476P00016L43246Q23708R68285J21383
$$ plain form
3384.9 200620747 200146065 200144787 200516186 201145477 201333084 201129246 200698624 200319614 200253315 200590820
3394.6 200590820 201049309 200750923 200352821 200466213 200910645 201232224 201392632 201256466 200470352 200402985
3404.2 200402985 200781021 200822773 200817776 200970631 201371479 201327057 201425018 201666832 201656857 201557446 201410751
3414.8 201410751 201836300 201804371 201276073 201660328 202582760 203002129 202841244 202864399 203094921 203467999
3424.5 203467999 203579235 203542671 204071159 204614639 204894714 204803257 204798012 205405216 205669346 205729923
3434.1 205729923 205995998 206052494 206044674 206274147 206719036 206920261 207397614 208221035 208239651 208255577
3443.8 208255577 208702030 209107285 209652214 209823246 209837589 210329399 211196651 211942387 212169075 211957455
3453.4 211957455 212123127 213103409 213837471 214283848 215084324 215784340 216127586 216951294 217919579 218040962
3463.1B18040962L91274N02586M02908N66540K01893L71037N4473K26689J001606P75795
3472.7B22535763N16605O26850O88057M59175P07455O01311Q30173J119595J96743
3481.4B28281727N39322P02209M60129O28490M02966M48093M65680Q43143Q68130P98492
3491B34438381P53250N78614Q67252Q01754P34882M85020N61790R76925P47509N99022
3500.7B41544399P89433Q30040N67283N95284R14364J380558R43489N23987R64622
3509.4B49053459N38559N90267R86119Q18824M04625M42963R29413J281338J541099
3518B56586666N82028K69794Q26893J065483J280594P16667Q36086Q02594O39419J417809
3527.7B65024033J253089M18072J072674P63779R2106J460876J349335J381340J299495
$$ plain form
3463.1 218040962 218432236 218934822 219337730 219904270 220106163 220477200 220531673 220758362 221759968 222535763
3472.7 222535763 223052368 223679218 224367275 224826450 225533905 226135216 226965389 228084984 228281727
3481.4 228281727 228821049 229523258 229983387 230611877 231014843 231462936 231928616 232771759 233639889 234438381
3491 234438381 235191631 235770245 236637497 237439251 238174133 238659153 239220943 240197868 240945377 241544399
3500.7 241544399 242333832 243163872 243731155 244326439 245240803 246621361 247564850 248088837 249053459
3509.4 249053459 249592018 250182285 251168404 251987228 252391853 252834816 253764229 255045567 256586666
3518 256586666 257168694 257438488 258265381 259330864 260611458 261328125 262164211 262966805 263606224 265024033
3527.7 265024033 266277122 266695194 267767868 268531647 268623753 270084629 271433964 272815304 274114799
3536.4B74114799N14374R57527N45617J504726J482449R27867R56841R50394J805000
3545B83759594O51894J039943Q36544J057377J900368J537132J736450R289J245461
3553.7B93774052J939430J419010J736546O21624J257991J545868J695176P32288J152954
3562.4C05874939J580620N84793L143749J441536m8084R16996J156959K921696J132126
3571.1C18705330J596908K138520J762237J485863J489220K072067P12585J949463
3578.8C31912193J871682J305694J918640J391907J290932J082382L560448K501525
3586.5C46835403j12838K210235N43289J911431K489700K836342J784859J204948K525330
3595.2C62228699p27997K139091L565560J453552K647095J276932J376647K764931
$$ plain form
3536.4 274114799 274629173 275586700 276132317 277637043 279119492 280047359 281004200 281954594 283759594
3545 283759594 284411488 285451431 286287975 287345352 289245720 290782852 292519302 292528591 293774052
3553.7 293774052 295713482 297132492 298869038 299490662 300748653 302294521 303989697 304721985 305874939
3562.4 305874939 307455559 308040352 311184101 312625637 312577553 313494549 314651508 317573204 318705330
3571.1 318705330 320302238 322440758 324202995 325688858 327178078 329250145 329962730 331912193
3578.8 331912193 333783875 335089569 337008209 338400116 339691048 340773430 344333878 346835403
3586.5 346835403 346722565 348932800 349476089 351387520 353877220 356713562 358498421 359703369 362228699
3595.2 362228699 361500702 363639793 367205353 368658905 371306000 372582932 373959579 376724510
3602.9C76724510K582894J987991J939506K298012M36630L153573J231079N2147N859375
3611.6C96265717K527656J98479M394188N12008K488251L705254J504287K462769J264458
3620.3D15323067J418571K733078L356514K696953K162704K174569K542190N601807
3628D38009453R55620n489197M378433M093895N220985L442498n69306K341996L998222
3636.6D56382599L375816J651039K172165L117295K998466K198181J385308K583923
3644.4D75864792L484344N492745J626167j023712O124611J853981p48596p61910M013100
3653D95925522M883690M458122N243492n434341K210083N889473J791572J862183R68284
3661.7E17798080K553597J859741K011299K458802P29179M143524L138962J369324
$$ plain form
3602.9 376724510 379307404 381295395 383234901 385532913 385969543 389123116 390354195 390406342 396265717
3611.6 396265717 398793373 398991852 403386040 403898048 406386299 410091553 411595840 414058609 415323067
3620.3 415323067 416741638 419474716 422831230 425528183 427690887 429865456 432407646 438009453
3628 438009453 438965073 433475876 437854309 441948204 447169189 450611687 450042381 452384377 456382599
3636.6 456382599 459758415 461409454 463581619 466698914 469697380 471895561 473280869 475864792
3644.4 475864792 479349136 484841881 486468048 485444336 491568947 493422928 492674332 491912422 495925522
3653 495925522 500809212 505267334 510510826 505076485 507286568 513176041 514967613 516829796 517798080
3661.7 517798080 520351677 522211418 524222717 526681519 527410698 531554222 534693184 536062508
3669.4E36062508K454605o395798J279373Q047333R185600K019348j3960914M07257
3677.1E39099312O967048N583687j222992j88408K187119J338921J617355J257515
3684.9E56639557M20074L100205N878448n903892k683983Q493767k883072j720581
3692.6E61340523M242630J077614J584739O56472J0528J268158M64706K480584L162117
3701.3E76288071k956734k192612L087693J487426O28472O66237K143821M319916n818558
3709.9E77653732K277947N612106j1798248K854919M406624M15192O33201K098351
3717.7E84153824J900406k843437J19209N160408j239472m553032L628159K280731
3725.4E88606796O11382k515679j876678L203621J407509M703865q09784p793694P463799
$$ plain form
3669.4 536062508 538517113 532121315 533400688 541448021 550633621 552652969 538692055 539099312
3677.1 539099312 546066360 551650047 550427055 550238647 552425766 553764687 555382042 556639557
3684.9 556639557 557059631 560159836 566038284 560134392 557450409 565944176 563061104 561340523
3692.6 561340523 565583153 566660767 568245506 568901978 568912506 570180664 570645370 573125954 576288071
3701.3 576288071 573331337 571138725 574226418 575713844 576342316 577008553 579152374 583472290 577653732
3709.9 577653732 579931679 585543785 573745537 576600456 581007080 581422272 582055473 584153824
3717.7 584153824 586054230 583210793 583330002 588490410 587250938 582697906 586326065 588606796
3725.4 588606796 589218178 586702499 584825821 588029442 589436951 594140816 593331032 585537338 593001137
3734E93001137K869110q216744j201057J766968R56230J706238L217087k661095J268234
3742.7E92706108R761696p908325j5125275R468575N862426N955162M64364r363556
3750.4E91821175Q686752n020599q300286N893326M325752L283120m034081J951942
3758.2E98607101N517312p733384k610206L568840J352997J59111L562545o05774m749565
3766.8E97068977K105027M593505J418763p743416Q88557K829895k98500J179657K77443
3775.5F02319908N13230o8436K497444J697845p168273J168518K421035L20893J238708
3784.2F04940872k131653p32956J395607J004487K37541n88684L73840L32985L26729
3792.9F05158768k91100P65991K977600k526588l469925J759873L679618O229248l860702
$$ plain form
3734 593001137 595870247 587653503 586452446 588219414 589175644 590881882 594098969 591437874 592706108
3742.7 592706108 602467804 594559479 579434204 588902779 594765205 600720367 601184731 591821175
3750.4 591821175 600507927 595487328 587187042 593080368 597406120 600689240 596655159 598607101
3758.2 598607101 604124413 596391029 593780823 597349663 598702660 598861771 602424316 601818542 597068977
3766.8 597068977 599174004 603767509 605186272 597442856 598331413 601161308 600862808 602042465 602319908
3775.5 602319908 602833138 602764702 605262146 606959991 599791718 600960236 603381271 603702164 604940872
3784.2 604940872 602809219 602076263 603471870 604476357 604713898 604125214 604499054 604832039 605158768
3792.9 605158768 604867668 605633659 608611259 606084671 602614746 604374619 608054237 614283485 610422783
3801.5F10422783j0455780K130966J925011M111671N927544q017540n575409M134712
3809.3F04603958K123146L24516Q01163M7684K85797M779472J227913j2407493K503967
3817.9F04290123M163322L937035M318810j4860611k70768M493409J438942K598495
3825.7F10108757M37202l775901j63765J689491K688713K208862p033157Q41217O893044
3834.3F13894463m422989j582947P602196o803971n420341P658348l284721j838723
3842.1F05801315N717583j535683l501358K309494J391335j61438J064987p74803J232262
3850.7F11543694N228996l412857J523094j1615372k437858Q458442k79922j927910
3858.4F07080307K020988J851159K416458l666687r46808N175094l601264m753991
$$ plain form
3801.5 610422783 599967003 602097969 604022980 608134651 614062195 606044655 600469246 604603958
3809.3 604603958 606727104 607051620 607852783 607900467 608186264 612965736 614193649 601786156 604290123
3817.9 604290123 608453445 612390480 616709290 601848679 601577911 606071320 607510262 610108757
3825.7 610108757 610545959 606770058 606606293 608295784 610984497 613193359 606160202 607001419 613894463
3834.3 613894463 609471474 607888527 615490723 608686752 603266411 610924759 607640038 605801315
3842.1 605801315 611518898 609983215 606481857 608791351 610182686 610021248 611086235 610311432 611543694
3850.7 611543694 616772690 613359833 614882927 603267555 600829697 609288139 609008217 607080307
3858.4 607080307 609101295 610952454 613368912 609702225 608755417 613930511 610329247 605575256
3866.2F05575256K380982L377838N876160m150696r015541K614059N609131M599266
3873.9F16866455q575630j028786L103790m26483K017746M636002l301506q570481
3881.6F04721107M346123K046623J040230N309105j1182823l73116L623810M19884
3889.3F09950943L625183O31905n840798k62756K885971j367493J09406P53212J488495
3898F11974068L310165p821541K767029J581612n669136N337524j209679k380256n760
3906.7F07884026j30387J540833L86047L40080k21061L01246m158m00238J177140K168464
3916.3F13041992k891350m134750M071808M82292l919029K108002K118530J152382
3924F12029877j160813k761116K35062O85043O97670p21855K4986J963387k206345
$$ plain form
3866.2 605575256 607956238 611334076 617210236 613059540 604043999 606658058 612267189 616866455
3873.9 616866455 608290825 607262039 610365829 609939346 611957092 616593094 613291588 604721107
3881.6 604721107 609067230 611113853 612154083 617463188 606280365 605907249 609531059 609950943
3889.3 609950943 613576126 614208031 608367233 608104477 610990448 609622955 609732361 610485573 611974068
3898 611974068 615284233 607462692 610229721 611811333 606142197 611479721 610270042 607889786 607884026
3906.7 607884026 607753639 609294472 609680519 610020599 609799538 610100784 610096626 609696388 610873528 613041992
3916.3 613041992 610150642 606015892 610087700 610569992 606650963 608758965 610877495 612029877
3924 612029877 610869064 608107948 608343010 609028053 609725723 609003868 609028854 610992241 608785896
3932.7F08785896j172714J570473m69856J16577M91447p53975o52733J70632J870613
3941.4F09956360J247902k529488p85866Q31452K96440N69572j324920N71022L35273
3950.1F09167747k493705J299705P54814n61523P48634K70081l4409n78994K13928
3958.7F08786278l39165k25487K18544j395759O8283J062965J30539k90947M63867
3967.4F08479118R17817p42875j324501M23012J174431j34735q20275k4414J24474
3976.1F08072052n59425r54k24762n77087L10402L46984O06881J69258L31039R8801
3985.7F08573189r85871k96897j16578N56794M02946N341J97715k88772M74510k3575
3995.4F08498802m85191J11580j62087l08494J74141
$$ plain form
3932.7 608785896 607613182 609183655 608713799 608830376 609321823 608567848 607915115 608085747 609956360
3941.4 609956360 611204262 608674774 607888908 608720360 609016800 609586372 608261452 608832474 609167747
3950.1 609167747 606674042 607973747 608728561 608167038 608915672 609185753 609151344 608572350 608786278
3958.7 608786278 608447113 608221626 608440170 607044411 607112694 608175659 608306198 608015251 608479118
3967.4 608479118 609396935 608654060 607329559 607752571 608927002 608792267 607971992 607947578 608072052
3976.1 608072052 607512627 607511673 607286911 606709824 607020226 607367210 607974091 608143349 608474388 608573189
3985.7 608573189 607587318 607290421 607173843 607730637 608133583 608138924 608336639 608047867 608522377 608498802
3995.4 608498802 608013611 608125191 607963104 607654610 607828751
4000.2F07828751
$$ plain form
4000.2 607828751
##END=$$ End of the data block
