##TITLE=$$ Begin of the data block
##JCAMP-DX=5.00 $$ ACD/SpecManager v 10.08
##SPECTROMETER/DATA SYSTEM=Varian
##DATE=15 Jan 2013 10:39:18
##DATA TYPE=INFRARED SPECTRUM
##DATA CLASS=XYDATA
##ORIGIN=
##OWNER=
##NPOINTS=3735
##FIRSTX=399.26403809
##LASTX=4000.35498047
##MAXX=4000.35498047
##MINX=399.26403809
##MAXY=66.58679962
##MINY=20.02112389
##XFACTOR=1.0000000000
##YFACTOR=0.000000100000000
##FIRSTY=38.83800125
##DELTAX=0.96440572
##XUNITS=1/CM
##YUNITS=TRANSMITTANCE
##XYDATA=(X++(Y..Y))
399.3C88380013m959145m864502n010529J90659n081863o903420J330261P023812L456802
407.9C73562088M12979n86738l45917p00875j913566K02103r8076j543312q90160J231422
417.6C69329948O35949L04603M601135l982544p065925n527802J03913Q763275O711464
426.3C73874016k58904k53410j150780j228447m77371J757622K049713p57294k425461
434.9C71129684k614364K26898Q99010j157227K378693L848305l221856m917450Q32940
443.6C67404633j1406r50623J359749J008148k280655k003250J199493L211365K938919
452.3C71876373j06773k096939j88217P26051o617966j0793609L307266J847916J641502
461C59595604K976532K139587L579560L69377k441597L12004J820946j259652m979362
$$ plain form
399.3 388380013 383420868 378556366 373545837 373736496 368654633 361751213 363081474 370105286 373562088
407.9 373562088 373975067 373388329 373042412 372341537 370427971 370630074 370531998 368988686 368098526 369329948
417.6 369329948 369965897 370270500 374871635 370889091 363823166 358295364 358399277 367162552 373874016
426.3 373874016 373615112 373361702 372210922 370982475 370505104 372262726 374312439 373555145 371129684
434.9 371129684 368515320 368742218 369641228 368484001 370862694 374710999 371489143 366571693 367404633
443.6 367404633 367393227 366442604 367802353 368810501 366529846 364526596 365726089 368937454 371876373
452.3 371876373 371769600 369672661 369484444 370210495 363592529 352798920 356106186 357954102 359595604
461 359595604 362572136 364711723 368291283 368660660 366219063 366531067 368352013 367092361 362112999
469.7C62112999l88374K990074o468163j891174O307030j159516m553451j705704K66914
478.3C55510635O50292r1095J842003P08122n95627k247772k337837K261581L734093
487C59434395j592941n078698r58252k365722j725579L187142j171761r36928L628006
495.7C52419662K255593l175850m04282O56548n340195j749878J475182k13852l73612
504.4C45549316R73549L529778K502098J565399J100426l016968n418243k884407q27713
513.1C43073235N9013K472572K351189O59599r68895k079048j568718m09279k700195
521.7C40889473k205772K224044O02799o04286J553497J59874k509041j286011J233750
530.4C40058327j527787j641426J250649J494827J223602L0251k287750m68979K555122
$$ plain form
469.7 362112999 361724625 364714699 358246536 356355362 362662392 361502876 356949425 355243721 355510635
478.3 355510635 356160927 356069832 357911835 358619957 358024330 355776558 353438721 355700302 359434395
487 359434395 357841454 352762756 351804504 349438782 347713203 350900345 349728584 348791656 352419662
495.7 352419662 354675255 351499405 351095123 351751671 346411476 344661598 346136780 345922928 345549316
504.4 345549316 346522865 350052643 352554741 354120140 355220566 352203598 346785355 343900948 343073235
513.1 343073235 343132248 345604820 347956009 348615608 347646713 345567665 343998947 343589668 340889473
521.7 340889473 338683701 340907745 341510544 340906258 342459755 342619629 340110588 338824577 340058327
530.4 340058327 338530540 336889114 338139763 339634590 340858192 340888443 338600693 338131714 340686836
539.1C40686836J65482k282944j870193k27242N44052L1662n99632j952896m55399
547.8C34039726K10991r29451j286468J13563P94640j034432J02082o47278j322785
556.5C30040588q16803j335411J339760Q78983j188813j230468Q34732K139702J030731
565.1C31693001K8000k542916j171837R54361j43013j196632n02968K360192J427421
573.8C30905609j18065m32167j151733l90969o78634l41797r041k64168p77092j83258
583.5C26558685K138672O73828q84666J17493j193734r72480N89485N32989J075859
592.1C28636131M56162N90782J839561J407128k54936j142312j007881q99925O96220
600.8C30320930P09839J007386J518745p51038j18751m9248j612701j760979j020050
$$ plain form
539.1 340686836 340852318 338569374 336699181 336471939 337015991 337047653 336448021 334495125 334039726
547.8 334039726 334250717 333321266 332034798 332148361 332943001 331908569 332010651 331363373 330040588
556.5 330040588 329223785 327888374 329228134 330107117 328918304 327687836 328522568 330662270 331693001
565.1 331693001 331721001 329178085 328006248 328960609 328817596 327620964 327117996 329478188 330905609
573.8 330905609 330787544 330355377 329203644 328812675 328134041 327792244 327783203 327519035 326741943 326558685
583.5 326558685 328697357 329371185 328486519 328604012 327410278 326437798 327027283 327560272 328636131
592.1 328636131 329092293 329683075 331522636 332929764 332674828 331532516 330524635 329624710 330320930
600.8 330320930 331030769 332038155 333556900 332805862 332687111 332637863 331025162 329264183 328244133
609.5C28244133L85094M3525N29671K17209j123848j978645j065102J525993m44908
618.2C26333122j369514K01683N73540M99038Q71926J258087k53906j04294K29644
626.9C28239326J246682L180160J923409J077118J36337Q7013P05185L23525K018623
635.5C38937378K008095Q72879Q56781J984329K288437K31743J900634K381859o46438
644.2C50815697r24797O67915J247253L21961Q31184Q53348N24826J746407J704292
652.9C57788086O51665n76783q74443r50355n86777L6583L97415K66075l73497L03841
662.5C56081810J80855m08364n9089j11695j531295l133355L141900J654739J554718
671.2C57370224K082329J121673J69449L65029J509552J139412N35621M47083k47956
$$ plain form
609.5 328244133 328629227 328672752 329202423 329419632 328295784 326317139 325252037 326778030 326333122
618.2 326333122 324963608 325165291 325738831 326237869 327109795 328367882 328113976 328009682 328239326
626.9 328239326 329486008 332666168 334589577 335666695 335803032 335890045 336595230 336918755 338937378
635.5 338937378 340945473 341818352 342675133 344659462 346947899 347179642 349080276 351462135 350815697
644.2 350815697 349890900 350558815 351806068 352128029 352959213 353812561 354337387 356083794 357788086
652.9 357788086 358439751 357862968 356988525 356038170 355451393 355487976 355885391 356151466 355777969 356081810
662.5 356081810 356262665 355854301 355795212 355683517 354152222 351018867 354160767 355815506 357370224
671.2 357370224 359452553 360574226 360743675 361108704 362618256 363757668 364293289 364740372 364492416
679.9C64492416O55251K016754K005081Q47702M00543R69430O26029J46065N51110
688.6C72710381J245193Q55026P83654J894035K46353j183853Q43735R12895L62358
697.3C78669777Q30803L88298n4398N04303J746979R42040O62841Q22983K62032O53343
706.9C85429001r3041P16439J197891R09195J109466q6288J64757N15632J031838L71208
716.6C91266098L29285J949043P24068R04922O80809N5657M29382q63571M8752J015815
726.2C96540260O12755J107483J469231J466903J303063J613846J054763o56013l74069
734.9D04138222M12750k91138M18206J285286J108055R70764P2632n80788N9013j66015
744.5D07426987p73239N31158M69475O71234K053223J863594J074829j90583O9695
$$ plain form
679.9 364492416 365147667 367164421 369169502 370017204 370417747 371387177 372013206 372159271 372710381
688.6 372710381 373955574 374810600 375594254 377488289 377734642 376550789 377394524 378307419 378669777
697.3 378669777 379500580 379888878 379834480 380338783 382085762 383027802 383690643 384513626 384775658 385429001
706.9 385429001 385335960 386052399 387250290 388159485 389268951 389182663 389347420 389863052 390894890 391266098
716.6 391266098 391595383 393544426 394268494 395173416 395854225 395909882 396339264 395475693 395524445 396540260
726.2 396540260 397153015 398260498 399729729 401196632 402499695 404113541 405168304 404512291 404138222
734.9 404138222 404550972 404259834 404678040 405963326 407071381 408042145 408114777 407533989 407593002 407426987
744.5 407426987 406653748 407184906 407654381 408325615 410378838 412242432 413317261 413126678 413196373
753.2D13196373k94456J11618J819152P63398P19680J499443K213631J652947N47714
761.9D22229500J337013R79271K12784N12924P13654m00086N22003J421204J38283
770.6D27666550K22778m0321J32599J6899l44239p1640M80194J037293K42958j8501
780.2D29324570K24418J126747J79978o61965L81012K45743N46761P9536P51076O79855
789.9D32877731k22435N13954n00526o56547K4719J45836m71650m61578m7836j52016
799.5D31049652J09329j223106j841698j999016j967468j165962k72217J73989r47075
808.2D21916428r76601p02019j484909k564277j725731q51250j852303r91859m30985
816.9D10336494j80931L22152j28975Q5258P5493j61476M17824J871032J944962J939201
$$ plain form
753.2 413196373 412901917 413013535 414832687 415596085 416315765 417815208 420028839 421681786 422229500
761.9 422229500 423566513 424545784 424758568 425271492 425985146 425585060 426107063 427528267 427666550
770.6 427666550 427889328 427849007 427981606 427998505 427654266 427582626 428062820 429100113 429343071 429324570
780.2 429324570 429548988 430675735 430855713 430193748 430574760 430820503 431367264 431446800 432197876 432877731
789.9 432877731 432655296 433169250 432668724 432012177 432036896 432182732 431711082 431249504 431201668 431049652
799.5 431049652 431158981 429935875 428094177 426095161 424127693 422961731 422689514 422863503 421916428
808.2 421916428 420939827 420237808 418752899 416188622 414462891 413611641 411759338 410767479 410336494
816.9 410336494 410155563 410477715 410348740 410433998 410509491 410348015 410765839 412636871 414581833 416521034
826.5D16521034K856560K494125K262650K361336L086548K486953J224861J842347
834.2D35136414K093048K029228K653465K619362K417793L324356J813507L87230J272965
842.9D53747368J261101M88205N33866K095490J441078J381531K380638J499901Q48961
851.6D65678139M01458J049653J139144J009598J140328J933975K398720J453552J156120
860.3D77360687Q10433J168632K50740J70784K24266n36499K8649k2507P24678p71751
869.9D79408112j169587r90524k416496j699410j026725K26173k39601r36546j175766
878.6D69979630j544419q63952j083947j482582j483574J45798M5853l72010j29356
887.3D63211441p70569m23431r47991n86700m52652K05002J099586P44286J388321
$$ plain form
826.5 416521034 419377594 421871719 424134369 426495705 429582253 432069206 433294067 435136414
834.2 435136414 437229462 439258690 441912155 444531517 446949310 450273666 452087173 452474403 453747368
842.9 453747368 455008469 455496674 456030540 458126030 459567108 460948639 463329277 464829178 465678139
851.6 465678139 466079597 467129250 468268394 469277992 470418320 472352295 474751015 476204567 477360687
860.3 477360687 478171120 479339752 479590492 479761276 479985542 479449043 479477692 479455185 480179863 479408112
869.9 479408112 478238525 477248001 474831505 473132095 472105370 472331543 472091942 471155396 469979630
878.6 469979630 468435211 467571259 466487312 465004730 463521156 463666954 463712807 463340797 463211441
887.3 463211441 462440872 462017441 461069450 460482750 460030098 460235100 461334686 462078972 463467293
895.9D63467293J626472J283989Q4419n8250q11577j433334m82865q9378P74651J378936
905.6D65740356L082772L075218K793770K508812L13835j92413r37920o18553j259880
914.3D74505997j122093o17829j479492o51093j840553k434502k856712l592033l835984
922.9D56075706l805656l100929l585587k776642k146377k100945k490654l397865
930.7D32671051l316040k566452j823769j901550p32536M7912Q9760J45149p17048
939.3D21896477o88362q15812j721458j917801j014709j090813p58362p0648k68021
948D13550491P49932M63562o20156p64808r14421j323319j117134q88672j473312j400566
957.7D06261597k340432k090911j461449k145844j996269j880646j690559k026291
$$ plain form
895.9 463467293 465093765 466377754 466462173 466403923 465592346 464159012 463676147 463586769 464361420 465740356
905.6 465740356 468823128 471898346 474692116 477200928 477514763 477322350 476384430 475765877 474505997
914.3 474505997 473383904 472766075 471286583 470635490 468794937 466360435 463503723 459911690 456075706
922.9 456075706 452270050 449169121 445583534 442806892 440660515 438559570 436068916 432671051
930.7 432671051 429355011 426788559 424964790 423063240 422330704 422378616 422468376 422613525 421896477
939.3 421896477 421208115 420392303 418670845 416753044 415738335 414647522 413889160 413818512 413550491
948 413550491 414300423 414763985 414143829 413379021 412464600 411141281 410024147 409135475 407662163 406261597
957.7 406261597 403921165 401830254 400368805 398222961 396226692 394346046 392655487 390629196
965.4C90629196j233558r98993j940918j827813j903801k298431l215218k773628k641906
974.1C71794930k833710k514763l036614l437843m656296m550628l996697m770164
981.8C41998215n093193m760971m412308l762436k744675l121509l890801l860817
989.5C10351505l717365l801060l786754l213806k642193k945977k967071j939259
997.2B85338020j923065k962570l305378k769337k586326j929360j327762j549931
1004.9B66984291j608944j391487r13792j441803j049480j208649k083931j925525
1012.6B55360680j872349r23672j369171j586609k000790k215023j509647k276401
1020.3B41607018j516190j654549j955242k024574j384125m35505j720848j331062
$$ plain form
965.4 390629196 389395638 388396645 386455727 384627914 382724113 380425682 377210464 374436836 371794930
974.1 371794930 368961220 366446457 363409843 359972000 355315704 350765076 346768379 341998215
981.8 341998215 336905022 332144051 327731743 323969307 321224632 318103123 314212322 310351505
989.5 310351505 306634140 302833080 299046326 295832520 293190327 290244350 287277279 285338020
997.2 285338020 283414955 280452385 277147007 274377670 271791344 269861984 268534222 266984291
1004.9 266984291 265375347 263983860 263070068 261628265 260578785 259370136 257286205 255360680
1012.6 255360680 253488331 252564659 251195488 249608879 247608089 245393066 243883419 241607018
1020.3 241607018 240090828 238436279 236481037 234456463 233072338 232636833 230915985 229584923
1028.1B29584923r34601m82578j019020j310044n71670j49937O71864o77128r9507
1036.7B25012302J194706J901589J388092J038608J888543K40764j60656m33712L87211
1045.4B32457447N21545o61392q43487j222286J23425q05817q49628j015931j507911
1054.1B26195965n70965j598740P954Q24146O62365L66097K42595P82204J072731K349796
1063.7B30334148J690159J636219J673317J652489J323070J121369J252975k42824
1071.5B40440922M85191R24111L27205J59588N82008M03195P4711O17962J48544J282673
1081.1B45446110Q33397O40011O28604L1891J744633J824131J650696N04894J502018
1089.8B54806385K483368P35474J113605J255303J428947J546288J993656J570320
$$ plain form
1028.1 229584923 228650322 228167744 227148724 225838680 225267010 225117073 225788937 225111809 225012302
1036.7 225012302 226207008 228108597 229496689 230535297 232423840 232664604 232503948 232070236 232457447
1045.4 232457447 232978992 232317600 231474113 230251827 230375252 229569435 228719807 227703876 226195965
1054.1 226195965 225625000 224026260 224034214 224858360 225520725 225886822 226129417 226911621 227984352 230334148
1063.7 230334148 232024307 233660526 235333843 236986332 238309402 239430771 240683746 240440922
1071.5 240440922 240926113 241850224 242177429 242337017 242919025 243322220 243396931 244014893 244163437 245446110
1081.1 245446110 246279507 246919518 247548122 247580013 249324646 251148777 252799473 253304367 254806385
1089.8 254806385 257289753 258025227 259138832 260394135 261823082 263369370 265363026 266933346
1097.5B66933346Q27389J094036J289138J926613J069794J038799J349526J694259
1105.2B77222900J641426J099778J691131O10276N84945J007176O32705N55191k29396
1113.9B84816132j59398Q71315J591034P81346O38923O74801L6373m14886j097832
1122.6B87737808o27613J93787J043682P51018N07603J550140K035714J686077J025123
1131.2B95903339J820069J883392J383362J756115J855335K016296J872483J729297
1139C10219688J955510J918983J143570M15668K49615N92976O40468N19124Q99543
1147.6C18555145J031208O66333k61078K9754K96707n92632q5563L39927K11926n3101
1157.3C20138626n34134m49657m58756o52599q42857o9657N86891L17650Q51345J888066
$$ plain form
1097.5 266933346 267760735 268854771 270143909 272070522 273140316 274179115 275528641 277222900
1105.2 277222900 278864326 279964104 281655235 282265511 282850456 283857632 284490337 285045528 284816132
1113.9 284816132 284656734 285528049 287119083 287900429 288539352 289214153 289250526 288835640 287737808
1122.6 287737808 287110195 287303982 288347664 289098682 289606285 291156425 293192139 294878216 295903339
1131.2 295903339 297723408 299606800 300990162 302746277 304601612 306617908 308490391 310219688
1139 310219688 312175198 314094181 315237751 315653419 315903034 316496010 317136478 317655602 318555145
1147.6 318555145 319586353 320252686 319991608 320021362 320318069 319725437 319639874 319979801 320191727 320138626
1157.3 320138626 319604492 319154835 318696079 318043480 317200623 317130966 317717857 318035507 318886852 320774918
1166.9C20774918K502288K346535J858750J624565J743431K054100K800674K749405
1174.6C38454666K442856K329941K242355K713318K342415J970672J462174J381493
1182.4C55339890J310539J108284J728172J227913Q98476J175384P04804n4436k94724
1191C63144302q29200j274681r35402l79944K24418k20375q88748j093406r04389j397858
1200.7C55444717k258644j475334p57141p92084r80873q93974o22368n78346n10063
1209.4C46575890o91681m93431m84887n95665n61561n78461P973K25601K31247k84843
1219C43350182o58760n42374q76122m93126m42085m96101n82924r88884m58031k45476
1228.6C37566299l56521p13005q98590q14782r25560n35621m15611j92757l42712n83077
$$ plain form
1166.9 320774918 323277206 325623741 327482491 329107056 330850487 332904587 335705261 338454666
1174.6 338454666 340897522 343227463 345469818 348183136 350525551 352496223 353958397 355339890
1182.4 355339890 356650429 357758713 359486885 360714798 361613274 362788658 363493462 363439026 363144302
1191 363144302 362315102 361040421 360105019 359725075 359949493 359729118 358840370 357746964 356842575 355444717
1200.7 355444717 353186073 351710739 350953598 350161514 349180641 348286667 347664299 347085953 346575890
1209.4 346575890 345884209 345390778 344905891 344310226 343748665 343170204 343178177 343403778 343635025 343350182
1219 343350182 342691422 342149048 341272926 340779800 340337715 339841614 339258690 338269806 337811775 337566299
1228.6 337566299 337209778 336496773 335598183 334783401 333857841 333322220 332906609 332713852 332371140 331788063
1238.3C31788063k21062n9547k04468r78889n01442m6654n49927j77917j16501m12407
1247.9C28519249o01959l24326l09677m29268j14364j76468j9379M2305J56975K56386
1257.6C26999474P1907k03782k01454o6452m12941p7285M43611P37571Q42400P31468
1267.2C28864517P64618P06177O18362N93338R62983O28318K32697O73027J279983
1275.9C35324020J588211J387711J365891J255302Q15849L48854Q03681J494102J599999
1284.6C45983620J617088J772347J915245J332817J366615J459732R68246M30985M26865
1293.3C57273560O69174O69861J168098J237831J388283P59125N1269N69039L18184
1301.9C64104424J19552J96190L3569k2392K78854K02942R8534N4779m04091m42505
$$ plain form
1238.3 331788063 331567001 331507454 331302986 330324097 329822655 329776001 329226074 329048157 328931656 328519249
1247.9 328519249 327917290 327592964 327283287 326854019 326739655 326563187 326543808 326586113 326743088 326999474
1257.6 326999474 327071381 326867599 326666145 326599693 326186752 326109467 326553078 327290649 328133049 328864517
1267.2 328864517 329629135 330335312 330953674 331547012 332509995 333138313 333371010 334044037 335324020
1275.9 335324020 336912231 338299942 339665833 340921135 341736984 342085838 342889519 344383621 345983620
1284.6 345983620 347600708 349373055 351288300 352621117 353987732 355447464 356415710 356846695 357273560
1293.3 357273560 357942734 358612595 359780693 361018524 362406807 363165932 363217201 363786240 364104424
1301.9 364104424 364223976 364420166 364453735 364431343 364710197 364913139 365011673 365066452 364662361 364219856
1311.6C64219856p78122o68525m83895k36129L700j45951P94030P99026L08991P95211
1321.2C64608192R67446O82754M57001M04739L93830O90079J89132J2932l0632k23770
1330.9C68151703j21842l90434k50702l80668k63825k10571q354J21536k36893M37050
1340.5C66847000M07524P36580O71845M91523Q19779N39970O13556K41280K53715j51062
1350.2C71471710l67393k73781l05138q621n06973N417J60064j28402k69852j71776
1359.8C69605255m92897j079025l21503j188888j16616J00174m76990O6643m42695
1368.5C65653458m71115o54641m58412l92418k72445n6305m40140O28204K36969J46141
1378.1C63919296j59721m59709n71556j121598r87930j442032r51385q54569j063232
$$ plain form
1311.6 364219856 363441734 362773209 362289314 362053185 362056885 361910934 362704964 363503990 363812981 364608192
1321.2 364608192 365575638 366258392 366715393 367120132 367513962 368204041 368393173 368406105 368375473 368151703
1330.9 368151703 368029861 367639427 367388725 367008057 366744232 366533661 366525307 366646843 366409950 366847000
1340.5 366847000 367254524 367991104 368662949 369154472 369974251 370514221 371127777 371369057 371622772 371471710
1350.2 371471710 371104317 370830536 370525398 370516777 370009804 370015221 370175285 370046883 369777031 369605255
1359.8 369605255 369112358 368033333 367711830 366522942 366406326 366506500 366029510 366096153 365653458
1368.5 365653458 365182343 364527702 364069290 363676872 363404427 363348122 362907982 363536186 363773155 363919296
1378.1 363919296 363759575 363299866 362728310 361606712 360618782 359176750 358225365 357370796 356307564
1386.8C56307564r43604p08656o88438j774369j708297j388398j099128k729302l294105
1395.5C41973267n97039r23271r34563k105751k176933j389160j784439j599312j796188
1404.2C28666611k041092j544724r49478j304397j759758j359921j118450q57906j327286
1412.8C16403599r10874n18779q35629n65605p31640K52590q11386P515R03034n5618
1422.5C13137207R17187N5351J6747Q92849Q17737J073380O41441R33342N48744J333103
1432.1C20367088J261978J001511J518173J034012J783333J177902J960526J166191
1439.8C31270714O63490J475754J225891J202736P27463J676979J435165N71709J28441
1448.5C40378342J012153J542549O54259Q90236P05605J894455J137733k05383K130966
$$ plain form
1386.8 356307564 355363960 354655304 353966866 352192497 350484200 349095802 347996674 345267372 341973267
1395.5 341973267 341376228 340452957 339518394 337412643 335235710 333846550 332062111 330462799 328666611
1404.2 328666611 326625519 325080795 324131317 322826920 321067162 319707241 318588791 317730885 316403599
1412.8 316403599 315492725 314973946 314138317 313572712 312841072 313093662 312282276 312289791 313192825 313137207
1422.5 313137207 314054394 314109745 314126492 315019341 315837078 316910458 317551899 318485241 319033985 320367088
1432.1 320367088 321629066 322630577 324148750 325182762 326966095 328143997 330104523 331270714
1439.8 331270714 331934204 333409958 334635849 335838585 336566048 338243027 339678192 340249901 340378342
1448.5 340378342 341390495 342933044 343587303 344477539 345183144 347077599 348215332 348009949 350140915
1457.2C50140915O90422K255630Q83980J901894J472130J169815J825828J190987K895775
1465.9C64427376J526756K110901K266808K448387K435455J112976L515549K506447
1473.6C82350655K588348K250557K272682L057175K749634K818451J874046J524162
1481.3D01485710J550026J636391J248817J106034J569252R91363O35300J487808O15082
1490D12325783p25060j06010m4937q26836j045456k86751l240814o78482j055984k647019
1499.6D01668434m71916j438789j456681j211357n15976m85725l285828j978874J250763
1508.3C92074051N05829j233254k5139j229171r39751N80902r92317j126404j120872
1517C86493874j421738L87840O57196j531906j480484P30782Q58154J460953l23563
$$ plain form
1457.2 350140915 350831337 353086967 353970947 355872841 357344971 358514786 360340614 361531601 364427376
1465.9 364427376 365954132 368065033 370331841 372780228 375215683 376328659 379844208 382350655
1473.6 382350655 384939003 387189560 389462242 392519417 395269051 398087502 399961548 401485710
1481.3 401485710 403035736 404672127 405920944 407026978 408596230 409587593 410222893 411710701 412325783
1490 412325783 411600723 411494713 411449776 410622940 409577484 409290733 406049919 405371437 404315453 401668434
1499.6 401668434 401196518 399757729 398301048 397089691 396573715 396087990 392802162 390823288 392074051
1508.3 392074051 392579880 391346626 391321487 390092316 389152565 389733467 388741150 387614746 386493874
1517 386493874 385072136 385459976 386117172 384585266 383104782 383835564 384693718 386154671 385831108
1525.7C85831108P02973J265830Q8311L57704O90193N05142K62337J036491j69487
1534.3C90570602R29871R33571M86030J137658j20354j262398K42615P74765q16612
1543C92875748J418838J848564k81639J293793N63202P96890K21748o86721N05256
1551.7C98555679K96326J303406q17032R7732J245995R67522l867226l510361K419319
1560.4C96691360j415596N09530j103554r35173j701737k148094r17778k121887r11141
1569.1C85945930o589622k176437j710129k955666k292480k703820p73353j0013046
1576.8C56731377k216111k712745l508606l121033m706688l528213n417252l315620
1584.5C28205109m543457m068985l695240m034043k708816n102330k816848m900761
$$ plain form
1525.7 385831108 386534081 387799911 387888222 388245926 388936119 389441261 389703598 390740089 390570602
1534.3 390570602 391500473 392434044 392920074 394057732 393937378 392674980 392917595 393692360 392875748
1543 392875748 394294586 396143150 395861511 397155304 397718506 398515396 398737144 398050423 398555679
1551.7 398555679 398852005 400155411 399338379 399436111 400682106 401649628 397782402 394272041 396691360
1560.4 396691360 395275764 395785294 394681740 393746567 392044830 389896736 388978958 386857071 385945930
1569.1 385945930 379356308 377179871 375469742 372514076 370221596 367517776 366744423 356731377
1576.8 356731377 354515266 351802521 348293915 345172882 340466194 336937981 331520729 328205109
1584.5 328205109 323661652 319592667 315897427 311863384 309154568 304052238 301235390 296334629
1592.2B96334629l195267l504448l977356k315616m394818j968765m256439k286663
1599.9B70435257l291702k671643j405696l503418r25198l050156o56089k322884j182232
1608.6B51426239r54437k561798J59073k126866K15969j781311R7237j19419m190769
1617.3B40163918K014789q80756J150303j274472N04094o37608j076508K255192P6409
1626B42295361K083988j087532J494655O86951O57024J090107o8473K345314K16331
1634.6B49713726J668415j129036K430229J971493O64539J657219L16220K131118M10977
1643.3B59834900K166843J368809o38332J463241r83619L884544P04594K173080J918469
1652B71892529k80114j571808j99871L529663P73163J927929O46668J121235J447677
$$ plain form
1592.2 296334629 293139362 289634914 285657558 283341942 278947124 276978359 272721920 270435257
1599.9 270435257 267143555 264471912 263066216 259562798 258637600 255587444 254931355 252608471 251426239
1608.6 251426239 250471802 247910004 248069077 245942211 246158180 244376869 244474106 244354687 240163918
1617.3 240163918 242178707 241297951 242448254 241173782 241677876 241040268 239963760 242218952 242295361
1626 242295361 244379349 243291817 244786472 245473423 246130447 247220554 247152081 249497395 249713726
1634.6 249713726 251382141 250253105 252683334 254654827 255319366 256976585 257292805 259423923 259834900
1643.3 259834900 262001743 263370552 262732220 264195461 263211842 267096386 267800980 269974060 271892529
1652 271892529 271612415 270040607 269840736 273370399 274143562 276071491 276718159 277839394 279287071
1660.7B79287071J164265K527637J3791K950992J381950K142563K603131K749023L681469
1669.4B98501892N31902L644505J203155L290425L129253K612725L355579L124561
1677.1C19393997M502678K519989L780174K741776M121513M789009K081185O538353
1684.8C50468674J148109N391350M314957M632721M601516L476944N061608M566993
1692.5C83662872M999810M800605N346527K879677M601593N582428N432549P039528
1700.2D24345589l66974N359268M943924M170837L525544M235954L564491K970505
1707.9D52749138M031525K618331K181397K553444K835541K748680J136398K394714
1715.6D73249168M018288K758408l879395K478447L694687K649841K246285J162872
$$ plain form
1660.7 279287071 280451336 282978973 282992764 285943756 287325706 289468269 292071400 294820423 298501892
1669.4 298501892 299033794 302678299 303881454 307171879 310301132 312913857 316269436 319393997
1677.1 319393997 323896675 326416664 330196838 332938614 337060127 341849136 343930321 350468674
1684.8 350468674 351616783 357008133 361323090 365955811 370557327 374034271 379095879 383662872
1692.5 383662872 388662682 393463287 398809814 401689491 406291084 411873512 417306061 424345589
1700.2 424345589 423978615 429337883 434281807 438452644 441978188 446214142 449778633 452749138
1707.9 452749138 456780663 459398994 461580391 464133835 466969376 469718056 470854454 473249168
1715.6 473249168 477267456 480025864 476146469 478624916 482319603 484969444 487215729 488378601
1723.4D88378601Q77533J788025K163963J719475J574822J763191O637L72811L053932
1732E01698990L155899p84073k234001M417267M088516K251320K805023J072121p35550
1740.7E15735512L941841L212356J321793J901856L454170L626175K990150L309021
1748.4E39492874J871758M093780K912979J257630M137230L155479L283806L365250
1756.2E63570786J142997K293587L224678K588997L208427M49906P12204L666267J973267
1764.8E82831116J367340J966781K300568n67474J896934L771248N951q52928J08490
1773.5E92828026L966865K434311M463K137185Q05053J711769P43332m75959J304512
1782.2F05459557J680336J808433k0027N14870J291580J175270J192017J582679R69544
$$ plain form
1723.4 488378601 489256134 491044159 493208122 494927597 496502419 498265610 498272247 498645058 501698990
1732 501698990 504854889 504070816 501836815 506254082 510342598 512593918 515398941 516471062 515735512
1740.7 515735512 519677353 522889709 524211502 526113358 529567528 533193703 536183853 539492874
1748.4 539492874 541364632 545458412 548371391 549629021 553766251 556921730 560205536 563570786
1756.2 563570786 564713783 567007370 570232048 572821045 576029472 576479378 577191582 580857849 582831116
1764.8 582831116 584198456 586165237 588465805 587898331 589795265 593566513 593572464 592719536 592828026
1773.5 592828026 596794891 599229202 599233665 601370850 602175903 603887672 604631004 604155045 605459557
1782.2 605459557 607139893 608948326 608928299 609443169 610734749 611910019 613102036 614684715 615654259
1790.9F15654259Q14247o84548p59697L120842J530724K98080J127434J638413R95712
1799.5F23735466j144333J539459M37355P59354J596756P13577J185532N34210N14336
1808.2F29871712P50465J133423l53966O14510J296272M34685J136894L65219J201058
1816.9F36450272L43589L38250R11445j42212Q12073P3471J090889J202316j571159
1825.6F39508934J61972J981697K146073N64422k193374K39334J794586O9198M16108
1834.3F44688950O53381N29251Q04749l72849Q15888P1105K72065N48019J120224Q94165
1843.9F50024948l804855K126541K283020N28107j06736K1515Q28858K8763M29306
1852.6F52359467k6780L63083M91715P22198N03083n87769O00128R5596K40403o3935
$$ plain form
1790.9 615654259 616468506 615783958 615024261 618145103 619675827 619973907 621101341 622739754 623735466
1799.5 623735466 622591133 624130592 624567947 625327301 626924057 627637634 628823166 629357376 629871712
1808.2 629871712 630622177 631755600 631401634 632016144 633312416 633747101 634883995 635249214 636450272
1816.9 636450272 636793861 637132111 638043556 637901344 638713417 638786888 639877777 641080093 639508934
1825.6 639508934 639670906 641652603 643798676 644363098 642169724 642409058 644203644 644272842 644688950
1834.3 644688950 645342331 645871582 646676331 646303482 647119370 647190475 647462540 648010559 649130783 650024948
1843.9 650024948 646220093 648346634 650629654 651157761 651051025 651072540 651901398 651930161 652359467
1852.6 652359467 652332687 652695770 653187485 653909683 654412766 653824997 654425125 654520721 654761124 654697189
1862.2F54697189J44043N21164L88413J159134j68686M40139q35418j106110R91898
1870.9F56231766R57107Q64792j05514K29492P782N35126K43225j14823M54254k12783
1880.6F59090424K90756q4229M02527K08130K26975P02819k96707N55344j29700j189651
1890.2F59776688L47824Q74099O1493M75541L84216o28205O04249K4032P5455k56272
1899.8F61739120O943Q86002Q7433N40466r2316K61002L87115o8817l22723m40140
1909.5F62984085k7008l89481P96280J59455L24783L58124J90964J470794j477432
1918.2F64390564j111603N79987M74701L39813k53754K15531K47497N55573q4839r7046
1927.8F65256424l71475l87955N9509L8452K73056m60815L02658L4638K05230N13153
$$ plain form
1862.2 654697189 654841232 655362396 655750809 656909943 656741257 657181396 656345978 655239868 656231766
1870.9 656231766 657188873 658053665 657948151 658177643 658185425 658720551 658963776 658848953 659303207 659090424
1880.6 659090424 659381180 659296951 659699478 659907608 660134583 660837402 660540695 661096039 660966339 659776688
1890.2 659776688 660124512 660998611 661060104 661535645 661919861 661291656 661895905 661919937 661995392 661739120
1899.8 661739120 661746063 662632065 662719498 663259964 663167648 663428650 663815765 663746948 663424225 662984085
1909.5 662984085 662957077 662567596 663363876 663523331 663848114 664206238 664397202 665867996 664390564
1918.2 664390564 663278961 663858948 664333649 664673462 664419708 664635239 664882736 665438309 665353470 665256424
1927.8 665256424 664884949 664496994 664556503 664594955 664868011 664407196 664709854 664744492 664949722 665462875
1937.5F65462875j5945J66016q95615J63040j42517q94089M79965N51911L00751m1886
1947.1F65134506O44684j87836k70156l02811o15082o10m807K54212j59531M66919
1956.7F64959488K31628j831q3999p80182l30658l78876L19138k67563Q3847P17697
1966.4F64468689k43454J94778m5166k22396m32511L98102J24207n35813K53449J16577
1976F64076462K80990l0441L04260j08261m37240p8278l77731n3177l08991R1782m3488
1986.6F63315887J67160P6676l29743N04990o2332q39996q90427K44217R9640K0141
1996.3F62306213L80326l42713J41754k77938K06756J34812l23868q1406l00445Q8348
2005.9F61931839m73099K1668j72196j44577K32544j59302K36817k60086j40000n82580
$$ plain form
1937.5 665462875 665446930 665612946 664717331 664880371 664737854 663843765 664323730 664875641 665176392 665134506
1947.1 665134506 665779190 665591354 665321198 665018387 664403305 664402695 664397888 664652100 664492569 664959488
1956.7 664959488 665191116 665189285 665105286 664325104 663994446 663615570 663934708 663667145 663750992 664468689
1966.4 664468689 664225235 664420013 664374847 664152451 663719940 664118042 664242249 663706436 663959885 664076462
1976 664076462 664357452 664327011 664631271 664523010 664085770 664007492 663629761 663576584 663267593 663359375 663315887
1986.6 663315887 663483047 663559723 663229980 663734970 663672638 662832642 661942215 662186432 662286072 662306213
1996.3 662306213 662686539 662343826 662485580 662207642 662414398 662549210 662225342 662143936 661843491 661931839
2005.9 661931839 661458740 661480408 661308212 661163635 661396179 661236877 661473694 661213608 661073608 660491028
2015.6F60491028l69339j27487j87073L07846j29471L44010k85416k60239j62582k35672
2025.2F59385605P0648m79660j2741j92108P6370k23770j97296K6703k39106K54136
2034.9F58468781n09415l5935j63498k68096m5853m67987j41144j40839M38004k59323
2044.5F56874695p8430k4109m07639Q4686m94079k00501l25088M30450L85132n03540
2054.1F55741577k74200j39923K77710l44773k8839q2931l0823o9885m16489M01535
2063.8F55032959j85013N7755j64032j39237L42407j82342j99738l78189j26342m86145
2073.4F53572083j79673O5766L20434M81568k91977j79215l34778L56903l9978l26767
2083.1F53444366j983k90070L1967n73959j45340p2250J38092R2544l09677J21918
$$ plain form
2015.6 660491028 660121689 659994202 659807129 660114975 659985504 660329514 660044098 659783859 659621277 659385605
2025.2 659385605 659456253 658976593 658963852 658771744 658848114 658624344 658427048 658453751 658214645 658468781
2034.9 658468781 657959366 657923431 657759933 657491837 657445984 656977997 656836853 656696014 657134018 656874695
2044.5 656874695 656796265 656772156 656364517 656449203 655955124 655754623 655429535 655859985 656245117 655741577
2054.1 655741577 655467377 655327454 655605164 655260391 655231552 655148621 655117798 655047913 654631424 655032959
2063.8 655032959 654847946 654905701 654741669 654602432 654944839 654762497 654562759 654184570 654058228 653572083
2073.4 653572083 653392410 653458176 653778610 654260178 653968201 653788986 653454208 653811111 653771133 653444366
2083.1 653444366 653442383 653152313 653184280 652610321 652464981 652392731 652530823 652623367 652313690 652435608
2092.7F52435608m00391R3613k58484l18680k15912j76086L65143l09296O4850l11661
2102.4F50968704m80270k89993k27662k54821m19312M95072m5319k20718j87302j13831
2112F49224548o256j01471J75934l25394J48240r1172m63257n41458J30310N99137
2121.6F48749161m15344K6092k14996m2801O4544o2866k56805r46274J67465K96631
2131.3F47364807K43988j28631J49993L62244o70090j02233l7690N799l83454j12915
2140.9F46691818L25775P8888L82920J57013N28945j77001j68839p2174l95889J76620
2150.6F47528076k63595n0354p248K86712J67542O7978j6861o60095j8769j23977J71356
2161.2F47080765Q1482j32675J14440K64588N07889l71704k93885k24075P3395j09253
$$ plain form
2092.7 652435608 652035217 652128830 651870346 651551666 651335754 651159668 651524811 651215515 651280365 650968704
2102.4 650968704 650488434 650198441 649970779 649715958 649296646 649791718 649746399 649525681 649338379 649224548
2112 649224548 649218292 649116821 649292755 648967361 649115601 649024429 648561172 648019714 648150024 648749161
2121.6 648749161 648333817 648359909 648144913 648102112 648166656 648103790 647846985 646900711 647068176 647364807
2131.3 647364807 647608795 647480164 647630157 647992401 647322311 647220078 647182388 647188187 646804733 646691818
2140.9 646691818 647017593 647096481 647479401 647636414 648165359 647988358 647819519 647747345 647351456 647528076
2150.6 647528076 647264481 647214127 647206879 647493591 647661133 647729111 647712250 647052155 647033386 646909409 647080765
2161.2 647080765 647162247 647029572 647144012 647408600 647916489 647544785 647250900 647026825 647100220 646990967
2170.8F46990967j56250M09927j47095K09580P5760L57208J93558j01242Q9798l50876
2180.5F47571335K68783l1890q0567j54495J83105M46473j45951R8343m51202k10343
2190.1F47493591j67846J43509K49862j30844L53012N4856K73208k67868k51694J8921
2199.8F47768707L4027J76392j55945M80347j2589J23444j28937k72674L82766j8463
2209.4F48377075K55585k17133J47858P4158k70462M4937N7068N24673k68249l87116
2219F48338394l80478j02768J84479K08511M09775l17306p706j52054K33383L26310
2228.7F48740540l03727k44217l16772L24326J52282L40119J42669j23825j32446k65961
2238.3F48312988K04087m28467n8365j38779r9487K65961J10702L42255m31290k19116
$$ plain form
2170.8 646990967 646834717 647244644 647097549 647307129 647382889 647740097 647933655 647832413 647922211 647571335
2180.5 647571335 647840118 647808228 647727661 647573166 647756271 648202744 648056793 648155136 647703934 647493591
2190.1 647493591 647325745 647469254 647719116 647588272 647941284 647996140 648269348 648001480 647749786 647768707
2199.8 647768707 647802734 647979126 647823181 648303528 648290939 648414383 648285446 648012772 648395538 648377075
2209.4 648377075 648632660 648415527 648563385 648637543 648367081 648412018 648469086 648993759 648725510 648338394
2219 648338394 647957916 647855148 648039627 648248138 648657913 648340607 648332901 648180847 648414230 648740540
2228.7 648740540 648436813 648192596 647875824 648200150 648352432 648692551 648835220 648711395 648578949 648312988
2238.3 648312988 648517075 648088608 648030243 647891464 647791977 648057938 648168640 648510895 648079605 647860489
2248F47860489j56174o7367l02582j87988N47866J15738L07770j12533L13110j8692
2257.6F48299637n67169j24665m81949L1586l14178J12457K28500J09635M44717r8495
2267.3F47640076r2087n15976Q3771j00479k46811Q4381j35803J49612j77002M14429
2276.9F47104111j20850n37796k90985j64261K11105k71606J40228j36261k08206j52664
2286.5F45572815K92740N22995n20554l77731n87769R8648m6997l70025K84195J73263
2296.2F45041580K37122m17938k08664o50864j59073L20206m88816K7695m92935R5215
2305.8F43303528K38647j20392k73513l18375L77579l81241L0060k68250l52249m05350
2315.5F41830444o84738J83487q4305L42331n57098l63007K83127R6436M60128l18145
$$ plain form
2248 647860489 647704315 647636948 647334366 647146378 647694244 647809982 648117752 648005219 648318329 648299637
2257.6 648299637 647732468 647607803 647125854 647157440 646843262 646955719 647184219 647293854 647738571 647640076
2267.3 647640076 647547989 647032013 647115784 647015305 646768494 646852875 646717072 646866684 646689682 647104111
2276.9 647104111 646983261 646445465 646154480 645990219 646201324 645929718 646069946 645933685 645725479 645572815
2286.5 645572815 645865555 646388550 645867996 645490265 644902496 645001144 644954147 644584122 644868317 645041580
2296.2 645041580 645278702 644860764 644652100 644001236 643842163 644162369 643673553 643701248 643208313 643303528
2305.8 643303528 643542175 643421783 643148270 642829895 643207474 642826233 642856293 642588043 642235794 641830444
2315.5 641830444 641145706 641329193 641244888 641587219 641030121 640667114 640950241 641046677 641506805 641188660
2325.1F41188660o01960p40051R80530M4708j218109n83076j083565J75323K9755N72433
2334.8F38764648O7368j239624j74599R05686L64990o94885O48n94635j38664p2861
2344.4F37188072j14937L5401r85909J43509R25179L68805j351014q27522N50232l27186
2354.1F35604630o38047m50973K10724q56324o59942l02582J31493j84136k89268J156768
2363.7F33722343m31518N90553N12200k05689q62389k04963Q36105j221924j10359
2372.4F32624359j55220o6147K83737m13017o1188l28521P1640n40009l41377K86980
2382F31361237J43508k8610n49431J5679k94838l28636n0164m58030k71111k30369
2391.7F29309235l22113m83933j09787k01569n50231o28586j45760L41759k36511l24707
$$ plain form
2325.1 641188660 640586700 639846649 640827179 640871887 639653778 639070702 637987137 638162460 638192215 638764648
2334.8 638764648 638832016 637592392 637417793 638323479 638688469 637993584 637994232 637399597 637260933 637188072
2344.4 637188072 637073135 637108536 636122627 636266136 637191315 637560120 636209106 635381584 635931816 635604630
2354.1 635604630 634966583 634515610 634726334 633870010 633210068 632907486 633038979 632854843 632565575 633722343
2363.7 633722343 633290825 633881378 634393578 634187889 633325500 633120537 633956642 632734718 632624359
2372.4 632624359 632469139 632402992 632686729 632273712 632212524 631884003 631955643 631415634 631074257 631361237
2382 631361237 631504745 631476135 630926704 630942383 630647545 630318909 630268745 629810715 629539604 629309235
2391.7 629309235 628987122 628503189 628393402 628191833 627641602 627013016 626867256 627209015 626972504 626647797
2401.3F26647797m30680p0953j14021k97089j18370l85628j26114n69687n19142l10402
2410.9F23705711m4326P3089m61464k22664j38549o9581q03489m54445L0670m51126
2420.6F21163826k64778q06618n95856m74548j8959J16196m29879j38206n24406m56620
2430.2F17570152n71174l22152j36833m19197k53067K8038L17726o59637o53687l57742
2439.9F14542427k52457m37507p00302N9318m55360j78604k9908l49998n73349r17702
2449.5F10706558l02582m77447k50740l81851n86281n33829j09939N93452j57433l33595
2459.2F08166313p64541o62766n16281p95937m12979l99895J76087l77884q19283l47137
2468.8F03245697j62811j55449k73018l87573p71637k17247k83013l17688m74472q31146
$$ plain form
2401.3 626647797 626217117 626146164 626032143 625735054 625616684 625231056 625104942 624535255 624016113 623705711
2410.9 623705711 623661385 623734474 623273010 623050346 622911797 622842216 622038727 621584282 621614952 621163826
2420.6 621163826 620899048 620092430 619496574 619022026 619003067 619119263 618689384 618551178 618026772 617570152
2430.2 617570152 616998978 616676826 616539993 616120796 615867729 615895767 616213493 615553856 614900169 614542427
2439.9 614542427 614289970 613852463 613152161 613211479 612756119 612577515 612547607 612197609 611624260 610706558
2449.5 610706558 610403976 609926529 609675789 609293938 608707657 608173828 608063889 608657341 608499908 608166313
2459.2 608166313 607401772 606739006 606222725 605426788 605013809 604613914 604790001 604412117 603592834 603245697
2468.8 603245697 603082886 602927437 602654419 602266846 601495209 601277962 600994949 600677261 600202789 599371643
2478.5E99371643m19846o56929k21557m49524m45747l65601o76842j50604m03252m07180
2488.1E95174561o25382m69589m97971n67131k06146n84488j71509k41928k69279l80974
2497.7E91160164n31006m95605r00422m72335m06647k23160k84614k19956k50320p37419
2507.4E86638680m68903r34219j088601p13958k91672K8305K73857j53847q63151m27208
2517E81999283n93071k96974l17459r78203r13964j95694L36152m96254j93558k40746
2526.7E78109512k82249q0338j129303j133232q30154j19705J17378m3945k50779m73175
2536.3E73884010n4817l50037o04019j072654o73638j75972o17981p56798o38427P2555
2546E69012222L9139P8354k01759n64042m85191r40285o73294n05638k52609j80550
$$ plain form
2478.5 599371643 598951797 598294868 598073311 597623787 597178040 596812439 596135597 595984993 595581741 595174561
2488.1 595174561 594549179 594079590 593581619 593014488 592808342 592223854 592052345 591810417 591541138 591160164
2497.7 591160164 590629158 590133553 589233131 588760796 588354149 588130989 587846375 587626419 587376099 586638680
2507.4 586638680 586169777 585235558 584146957 583432999 583141327 583169632 583443489 583289642 582426491 581999283
2517 581999283 581406212 581109238 580791779 579813576 578899612 578703918 579040070 578543816 578350258 578109512
2526.7 578109512 577827263 577746925 576617622 575484390 574654236 574534531 574651909 574607964 574357185 573884010
2536.3 573884010 573829193 573479156 572875137 571802483 571128845 570952873 570334892 569578094 568939667 569012222
2546 569012222 569051361 569129715 568927956 568363914 567878723 566938438 566265144 565759506 565506897 565326347
2555.6E65326347k5634j13373o21796k61001l46451m85420r64165o94504j49460n49621
2565.2E61114922k86217l37677n00374m32167l2883j59225q12912n72472k97661n30128
2574.9E57153206k82326M21982m16946o89927m17328o73484k95983o97403m89349j51367
2584.5E53461075j97983k76718n08499k88277n83076n35927n41725l96195l13263m47845
2594.2E49371567r9869m14810n57175o34193o56357m68254l54843m70009m81262m1504
2603.8E45193291l52135n24406m33388n89600q79402p36542m62188n22118l22952o20423
2613.5E39750137l70979m05121m41398L7040m48150p57065r76677m82788n21393o03256
2623.1E34780350n5237n78995m82864n63469n14832j87683n22842p84416p82814m19884
$$ plain form
2555.6 565326347 565300713 565187340 564565544 564304543 563958092 563472672 562508507 561814003 561664543 561114922
2565.2 561114922 560828705 560491028 559990654 559558487 559525604 559366379 558553467 557980995 557683334 557153206
2574.9 557153206 556870880 557292862 556875916 556185989 555768661 555095177 554799194 554101791 553612442 553461075
2584.5 553461075 553263092 552986374 552477875 552189598 551606522 551070595 550528870 550132675 549819412 549371567
2594.2 549371567 549271698 548856888 548299713 547665520 547009163 546540909 546186066 545716057 545234795 545193291
2603.8 545193291 544841156 544316750 543883362 543293762 542414360 541677818 541215630 540693512 540370560 539750137
2613.5 539750137 539379158 538974037 538532639 538569679 538121529 537364464 536387787 535904999 535383606 534780350
2623.1 534780350 534725113 534146118 533663254 533099785 532584953 532397270 531874428 531090012 530307198 529887314
2632.8E29887314o44264n71404k61268k26212k43301n17464o18019o01998n00755q49800
2642.4E24852829r33113l99628l7956m75082o10161j81961m49181j87721m40140p81631
2652E20356255o32248q18978l88260l52707l61175k36092j45378l60946o05736l39661
2661.7E16115074n73730l39547J832l16697r22317n78041j0224m08706k69509n45044
2671.3E12153091o54373j64337j3504j53580n79834m55742k04353j90391n90592o45866
2681E08500519l49732l47023l31764m22783l67584l45383k48336n71061m52537j2245
2690.6E05052071l52555l59535j94321R270l54614o12641m18701k56042l33290p54319
2700.3E01425323l88679n77126l94783l6354k64701j8883m02413l72543r2621j04980
$$ plain form
2632.8 529887314 529243050 528671646 528410378 528184166 527940865 527423401 526805382 526203384 525702629 524852829
2642.4 524852829 523919716 523520088 523482132 523007050 522396889 522214928 521765747 521578026 521137886 520356255
2652 520356255 519724007 518905029 518516769 518164062 517802887 517566795 517421417 517060471 516454735 516115074
2661.7 516115074 515541344 515201797 515203629 514886932 513964615 513386574 513376350 512967644 512698135 512153091
2671.3 512153091 511498718 511334381 511320877 511167297 510587463 510131721 509927368 509736977 509146385 508500519
2681 508500519 508150787 507803764 507472000 507049217 506681633 506336250 506087914 505516853 505064316 505052071
2690.6 505052071 504699516 504339981 504145660 504154930 503800316 503187675 502768974 502512932 502179642 501425323
2700.3 501425323 501036644 500459518 500064735 500028381 499763680 499744797 499342384 498969841 498877220 498772240
2709.9D98772240o75011q28323k01378j87760k62298n23682K11220J80931m32472k60887
2719.5D95792580n92308l21732m31938k01187j31684k95524l9711n07241k44293k10571
2729.2D92816391j19324l81889q76846k31781j88599m05159k52419K78130J82076n28832
2738.8D90291748n92270N2147J09863p17811n03044K4032P1984l60527m37966j15204
2748.5D87822952k5825N0277n19104n24940n21164q9607L70407m37851l19977K1172
2758.1D85826340m4785l49731n78881o11229m58259l57628p39021k21405L7269k19230
2767.8D82283440k93198j04294j44577m96940l15705l60374N8861l13721p87888n79681
2777.4D78945923n68466J945l70979l08037k62260m97551k86026n89676k06566l01514
$$ plain form
2709.9 498772240 498097229 497268906 497067528 496879768 496617470 496093788 496305008 496485939 496053467 495792580
2719.5 495792580 495200272 494878540 494446602 494245415 494113731 493818207 493778496 493271255 493026962 492816391
2729.2 492816391 492697067 492315178 491438332 491206551 491017952 490612793 490360374 490638504 490820580 490291748
2738.8 490291748 489699478 489751625 489861488 489143677 488640633 488664665 488736649 488376122 487938156 487822952
2748.5 487822952 487797127 487847404 487328300 486803360 486282196 486192589 486562996 486125145 485805168 485826340
2758.1 485826340 485781555 485431824 484852943 484241714 483783455 483425827 482686806 482465401 482502670 482283440
2767.8 482283440 481990242 481885948 481741371 481244431 480928726 480568352 480627213 480313492 479525604 478945923
2777.4 478945923 478377457 478379402 478008423 477700386 477438126 476940575 476654549 476064873 475858307 475556793
2787D75556793l92570o34728q81309k87514n37758o27022n59768n60723k75497l53851
2796.7D70446053o13785n58129n64041o88133o86569o46019l11737o47125p31545o12411
2806.3D64386559r13964p84263m84963j16691p95823r53636o11152o58722m39225p65419
2816D57862701p62672q48808l60489l44773j213989j080131r77097m96292l20740n39856
2825.6D50917854r18808q39424l94440q74786q63647j002388j028748q75397p17544
2834.3D43402672p61528j246186o34918p94868j594811j621895j025466j166916j977387
2843D32578697j639862j334076j110458j577416j887855j749840k111511j803742j529846
2851.7D17834091p58705p18651j042480k20871o523j71700l53966k13356o7367k2202
$$ plain form
2787 475556793 475164223 474529495 473648186 473360672 472822914 472195892 471636124 471075401 470799904 470446053
2796.7 470446053 469832268 469274139 468710098 468021965 467335396 466689377 466377640 465730515 464998970 464386559
2806.3 464386559 463472595 462688332 462203369 462086678 461290855 460337219 459726067 459067345 458628120 457862701
2816 457862701 457100029 456251221 455890732 455545959 454331970 453251839 452274742 451778450 451457710 450917854
2825.6 450917854 449999046 449159622 448765182 447890396 447026749 446024361 444995613 444120216 443402672
2834.3 443402672 442641144 441394958 440760040 439965172 438370361 436748466 435723000 434556084 432578697
2843 432578697 430938835 429604759 428494301 426916885 425029030 423279190 421167679 419363937 417834091
2851.7 417834091 417075386 416356735 415314255 415093384 415086861 414915161 414561195 414347839 414280472 414258270
2861.3D14258270k53067n70030n23109p23076o50635j021156j083641o23475p66601
2870D08043480o22559n90439p33032o39877o47316p13806n28946n22003o77796p27653
2879.6D01640053r77745p29561l01552n77621j141205r36051n06248o61202p23648
2888.3C95085220r59739j162491j018372o98890l66440n41611p91283m83436m84810
2897C88578148j059799r86634q61244p50618n23033p19833o98281p32002n63164j37252
2906.6C81546288m52424j225700j026764o39534j081810j013336r77783j274414j377678
2915.3C72476845j269913j251564j424828j097335p77359r93348j316413n83878k11105
2924C63551102o45027m69399k76413J29128K06031J31379l19748k61727M26178N3253
$$ plain form
2861.3 414258270 414005203 413435173 412912064 412188988 411538353 410517197 409433556 408810081 408043480
2870 408043480 407420921 406830482 406097450 405457573 404810257 404096451 403567505 403045502 402367706 401640053
2879.6 401640053 400662308 399932747 399631195 399053574 397912369 396976318 396470070 395808868 395085220
2888.3 395085220 394125481 392962990 391944618 391245728 390879288 390337677 389546394 389062958 388578148
2897 388578148 387518349 386531715 385670471 384919853 384396820 383676987 382978706 382246704 381683540 381546288
2906.6 381546288 381093864 379868164 378841400 378201866 377120056 376106720 375128937 373854523 372476845
2915.3 372476845 371206932 369955368 368530540 367433205 366655846 365662498 364346085 363762207 363551102
2924 363551102 362906075 362436676 362160263 362289391 362495422 362626801 362307053 362045326 362471504 362524757
2933.6C62524757L75138M21524J56250M73861N01633K36550K38647R89761P08504P15714
2943.3C67342339Q77533K36511K68364O97403R29985K93998M40865M69818M20609O35109
2952.9C72612534O0424L86353K54478P05452P87888J16348N75600M22401O89965Q00552
2962.6C77411995Q58078P10564K22816M90608M46358N34096N55038O98929L15704K66877
2972.2C82511063J169357Q74596L79104L89023M82903L51905K44332J26762M52156
2980.9C86981201P36122J70937J52283J04103K43721K57797J64871n34j85203M94422
2990.5C89119720j51939l49350J04256j86310L0251J17492p4997o13518l51829k46430
3000.2C87397346n43708n65186p68394k08283l53966p44514n91164k30331O5346l70407
$$ plain form
2933.6 362524757 362899895 363321419 363477669 363951530 364453163 364689713 364928360 365918121 366626625 367342339
2943.3 367342339 368219872 368456383 368724747 369422150 370352135 370646133 371086998 371556816 371977425 372612534
2952.9 372612534 372672958 373059311 373313789 374019241 374807129 374923477 375499077 375921478 376611443 377411995
2962.6 377411995 378270073 378980637 379203453 379694061 380140419 380674515 381229553 381928482 382244186 382511063
2972.2 382511063 383680420 384555016 384934120 385323143 385806046 386157951 386402283 386529045 386981201
2980.9 386981201 387717323 387888260 388040543 388144646 388388367 388646164 388811035 388810501 388625298 389119720
2990.5 389119720 388967781 388618431 388722687 388536377 388566628 388684120 388609123 387995605 387643776 387397346
3000.2 387397346 386853638 386288452 385520058 385311775 384957809 384213295 383622131 383391800 383457146 383086739
3009.8C83086739n38521l81775n84831j107712m35143j80969q62274m82597m14811
3018.5C78098106m92363o13136q69217r20181p60346m65202l67164l17193q10127q56857
3028.1C71626320r01985q28400l96690n96123n26772j002884j025695n23453p88536
3036.8C65035782p14378n38903n27649o97059q80356j052361p44362m38003p04498
3045.5C58738213m22516n76859j144295j093711q69675o70014m74395m86794n90744
3054.2C52409210n07927q50906r61723o49262j022186j055985o80885q05283o34956
3062.9C45240097m62646n47867m29535o67153p97767p01409o05087o58417p32879l67546
3072.5C39269791n90477o61393n81321o86913l72696n75142n90667n63088o35986l50990
$$ plain form
3009.8 383086739 382548218 382166443 381581612 380473900 380038757 379857788 378995514 378512917 378098106
3018.5 378098106 377605743 376992607 376123390 375203209 374442863 373977661 373610497 373293304 372483177 371626320
3028.1 371626320 370724335 369895935 369499245 368903122 368376350 367373466 366347771 365824318 365035782
3036.8 365035782 364321404 363782501 363254852 362557793 361677437 360625076 359880714 359442711 358738213
3045.5 358738213 358315697 357738838 356594543 355500832 354631157 353961143 353486748 352999954 352409210
3054.2 352409210 351901283 351050377 350088654 349439392 348417206 347361221 346680336 345875053 345240097
3062.9 345240097 344777451 344229584 343800049 343132896 342335129 341633720 341028633 340370216 339637337 339269791
3072.5 339269791 338679314 338017921 337436600 336749687 336376991 335801849 335211182 334648094 334012108 333661118
3082.1C33661118l09983o99463j280632p42798k71339p94487n55191r0256m30412p36084
3091.8C27750473p84187p14760m74243o23436p40357q20732n59196k58103o07719n87578
3101.4C21580162q49419o48498j81732m16909o64711j094875n14221k10095o48937
3110.1C16350765m97761m70581o40544j124421j127548n87330j50490l78799r45072
3118.8C10428219n28374k48527o06919j193466j441441n48286k5215o29845p76520
3127.5C04429626m92649n55420o60934n64136j59398o43501j105385r10511r83276
3136.1B98354416m39739n56946p75795l19462n01804o28853o07319o72550p07722n79910
3145.8B92564316p68852o85444k40097p46365r37805l58982j46504q34465j100712
$$ plain form
3082.1 333661118 333351135 332651672 331371040 330628242 330356903 329562416 329007225 328916969 328486557 327750473
3091.8 327750473 326966286 326251526 325777283 325153847 324413490 323592758 323033562 322775459 322167740 321580162
3101.4 321580162 320730743 320082245 319900513 319483604 318818893 317724018 317209797 316999702 316350765
3110.1 316350765 315853004 315382423 314741879 313617458 312489910 311902580 311752090 311373291 310428219
3118.8 310428219 309899845 309651318 309044399 307850933 306409492 305861206 305835991 305206146 304429626
3127.5 304429626 303936977 303381557 302720623 302156487 301997089 301353588 300248203 299337692 298354416
3136.1 298354416 297914677 297357731 296581936 296262474 295760670 295131817 294524498 293851948 293144226 292564316
3145.8 292564316 291795464 291110020 290869923 290123558 289185753 288826771 288680267 287845802 286745090
3154.5B86745090n52253n86624o60477m91619n28736j005707p06863j63937p83653
3163.1B81265221q16212p20310q86631n65148l89499p15561j099396n96485j16482
3171.8B75359497k52037n77774q10814m84714l99495p75413r37901r04960p76234p14436
3181.5B68725719m97322j47133n96027q58345o14777p28130m55131k95849k99111m34112
3191.1B63799782p70188n73558m72279n46284p50065o57386k54975j22680l48645j124324
3200.8B58179398r50985n05467q18939m42791j12972l17116m55685k55031J6899n64480
3210.4B53772831q76904n23738o64330p51743l72429j18790l70750n91622m55742o32610
3220B48414173n70297j35880o7482l34549q03718r50451l35121M1523k01073l80783
$$ plain form
3154.5 286745090 286192837 285606213 284945736 284454117 283925381 282919674 282212811 282048874 281265221
3163.1 281265221 280449009 279728699 278842068 278276920 277887421 277171860 276072464 275475979 275359497
3171.8 275359497 275107460 274529686 273718872 273234158 272834663 272059250 271121349 270216389 269440155 268725719
3181.5 268725719 268228397 268081264 267485237 266626892 266012115 265283985 264828854 264533005 264233894 263799782
3191.1 263799782 263029594 262456036 261983757 261437473 260687408 260030022 259775047 259652367 259303722 258179398
3200.8 258179398 257228413 256722946 255904007 255461216 255348244 255031128 254575443 254320412 254337311 253772831
3210.4 253772831 252895927 252372189 251707859 250956116 250583687 250464897 250094147 249502525 249046783 248414173
3220 248414173 247843876 247707996 247640514 247305965 246502247 245551796 245216675 245258198 245057125 244676342
3229.7B44676342q98285p50294m1561J6918j84764q14228q42305n60245j96285j4325
3239.3B40390968p23629m65812m58374o00529j54915j62106k34508n70183m40273k52934
3249B36327705q4896l74412p85332m83036q40263m32587K0943k26670n32932o70834
3258.6B31917686O0692Q1082n9777l44658n55686k63234k97241l19099n19409k31457
3268.3B29468899l02029j63975K9011n95302l50152o00814p28970k38571j05324j87187
3277.9B26225586m89750r7980P6065k03019n27381n46742j78871k83070l97396k58713
3287.5B23318729j01280j27334R5176N2510k66552l53165n73483l8242L63655k71931
3297.2B22098083r75494o41155Q3122J83869K03838k41223k77442K6969k57167l49617
$$ plain form
3229.7 244676342 243778057 243027763 242986202 243003120 242818356 242004128 241161823 240601578 240405293 240390968
3239.3 240390968 239667339 239201527 238743153 238142624 237987709 237825603 237591095 237020912 236580639 236327705
3249 236327705 236242809 235868397 235083065 234600029 233759766 233327179 233348122 233121452 232588520 231917686
3258.6 231917686 231978378 232059460 231999683 231655025 231099339 230836105 230538864 230219765 229700356 229468899
3268.3 229468899 229166870 229002895 229031906 228436604 228086452 227485638 226756668 226518097 226412773 226225586
3277.9 226225586 225735836 225637856 225713921 225510902 224983521 224436779 224257908 223974838 223577442 223318729
3287.5 223318729 223217449 223090115 223185291 223237801 222971249 222618084 222044601 222006359 222370014 222098083
3297.2 222098083 221122589 220481434 220564556 220748425 220952263 220711040 220433598 220460567 220203400 219853783
3306.8B19853783j91803j01242n74170n61943k07824l93830k46982p4139l32298n64118
3316.5B16605434j22470P4901j80874k22912n27725m64840l60908k63405o5098n60779
3326.1B13911324p09324l18871n3444j74408m46415m54635o80695p52525m35410p5836
3335.8B09809761o1703m17404l26080m27532o95305j46904K17018k77290n59750j46675
3345.4B06968136L2520j20621n03807m69780l6258o66790m00944K30369k96993k44808
3355.1B04491024l58734M673K53658l88851q6594p0457l47118j26191J20430q3046
3364.7B03408794m66804j19686l6469k60410l30982k21176j03760j77231J17950K13910
3374.3B02024136j46695l37009J21002L29609J25580J99661o49757j144695l10593
$$ plain form
3306.8 219853783 219661980 219560738 218986568 218424625 218216801 217822971 217575989 217501850 217169552 216605434
3316.5 216605434 216482964 216557865 216376991 216154079 215626354 215161514 214800606 214537201 214472103 213911324
3326.1 213911324 213202000 212883129 212829685 212655277 212208862 211754227 211073532 210321007 209885597 209809761
3335.8 209809761 209748058 209330654 209004574 208577042 207881737 207734833 207951851 207674561 207114811 206968136
3345.4 206968136 207000656 206880035 206376228 205906448 205870190 205203400 204802456 205032825 204735832 204491024
3355.1 204491024 204132290 204136963 204390621 204001770 203915176 203844719 203497601 203371410 203491840 203408794
3364.7 203408794 202941990 202822304 202785835 202525425 202194443 201973267 201869507 201692276 201810226 202024136
3374.3 202024136 201877441 201540432 201661434 201991043 202116623 202316284 201666527 200521832 200211239
3383B00211239K49557L65239Q4610k03381J2455L77445J26534j91498P0343q9760j23215
3393.6B00889568J05477j54496L2368L56178J13259k18411k72998J83448R5463o16398
3403.3B00513458k30865L39718m1981j59531L7174J46237L81393O04439J91193k58389
3412.9B01522846K21043l4981j5545Q11348O0330n1823L45611j15680J31016P4920
3422.6B02949085J57948M26521J62411M1084L12805O86722L33843O3439j63384p2746
3432.2B04897728O05984P18307K06337o87179J09653J061974K52609k00806j4858Q15907
3441.8B07765656O92024J71909O56815P59468N83553m32911l06721O78368P97577O58417
3451.5B12024155K83775L22399N17101P71599L01857q1615P47223P72457N15652K67696
$$ plain form
3383 200211239 200460796 200826035 200910645 200707264 200719719 201097164 201223698 201032200 201102543 201012783 200889568
3393.6 200889568 200995045 200840549 200872917 201229095 201342354 201123943 200850945 201034393 201129856 200513458
3403.3 200513458 200282593 200622311 200580330 200420799 200457973 200604210 200985603 201590042 201781235 201522846
3412.9 201522846 201743889 201708908 201693363 202504711 202565041 202513218 202858829 202743149 202874165 202949085
3422.6 202949085 203107033 203533554 203695965 203737049 204049854 204736576 205070419 205133858 204970474 204897728
3432.2 204897728 205503712 206222019 206428356 205741177 205850830 206912804 207165413 206964607 206949749 207765656
3441.8 207765656 208457680 208629589 209286404 210045872 210629425 210196514 209889793 210568161 211365738 212024155
3451.5 212024155 212307930 212630329 213147430 213919029 214220886 214139271 214886494 215658951 216174603 216442299
3461.1B16442299K16045L74413M88968J060104Q09059N17731K75822M93011J035824
3469.8B21713276L05138M18796N27535L76377J063289M01306j8882O27346R81464J032276
3479.5B27427921O25859P64064L78743k74277Q59527J087018O54945R69067M38003
3488.1B32930870Q6803P99943J074275N17521O82049J300335R22756L43457L50017
3496.8B39008026Q82874M90608J46141J216106J600743J069622L92704K51217P45391
3505.5B45803432Q39921Q07437Q62046K83184L34396J441593R69620M67072J192169
3514.2B53000870J038952P93762J244144R82037M57954M68216P20387J540336Q88138
3522.9B61134796l54595J064625J564007R19532J045208J148758L49903N83401J231651
$$ plain form
3461.1 216442299 216658344 217032757 217521725 218581829 219390888 219908619 220184441 220677452 221713276
3469.8 221713276 222018414 222437210 222964745 223341122 224404411 224805717 224786835 225414181 226395645 227427921
3479.5 227427921 228053780 228817844 229196587 228922310 229781837 230868855 231523800 232492867 232930870
3488.1 232930870 233017673 233817616 234891891 235409412 236091461 237391796 238314552 238658009 239008026
3496.8 239008026 239890900 240381508 240527649 241743755 243344498 244414120 244806824 245058041 245803432
3505.5 245803432 246643353 247450790 248312836 248596020 248930416 250372009 251341629 251808701 253000870
3514.2 253000870 254039822 254833584 256077728 257059765 257517719 257985935 258706322 260246658 261134796
3522.9 261134796 260780201 261844826 263408833 264328365 265373573 266522331 266872234 267455635 268687286
3531.5B68687286R28326J101189J269531J802254J011753J23520J295375J255303R76066
3540.2B78450603J052475J552620Q99277J170635K160130N27820R07708N63125J111679
3548.9B88396072J578560J278420J782646O2771J182174J462784J597595K166043P06100
3557.6C00213165J285000J698570J671791K48642J360321K266827R17549L069058J639709
3566.2C14370632R92088L26272k87552K867870J687107J621456J479340J086082J253434
3574.9C25396729J979141K431373P80754K211838J991577J201477J957055K021141
3582.6C39971085J645431M16031L083115K598533k58865J448822L89213K535706K914391
3591.3C54743462K767791J600838J455689L660621j2398J463013L575173J253852K263832
$$ plain form
3531.5 268687286 269615612 270716801 271986332 273788586 274800339 274923859 276219234 277474537 278450603
3540.2 278450603 279503078 281055698 281954975 283125610 285285740 285813560 286721268 287284393 288396072
3548.9 288396072 289974632 291253052 293035698 293098469 294280643 295743427 297341022 299507065 300213165
3557.6 300213165 301498165 303196735 304868526 305117168 306477489 308744316 309661865 312730923 314370632
3566.2 314370632 315362720 315688992 315401440 318269310 319956417 321577873 323057213 324143295 325396729
3574.9 325396729 327375870 329807243 330587997 332799835 334791412 335992889 337949944 339971085
3582.6 339971085 341616516 342032547 345115662 347714195 347455330 348904152 349293365 351829071 354743462
3591.3 354743462 357511253 359112091 360567780 364228401 364216003 365679016 369254189 370508041 372771873
3600C72771873J806603J037102J819992K077102K218018K897224L048058r0408K948837
3608.7C90534401J850510p6752O226539K683411j401024L279534J098251L999405M247742
3617.4D12442017J410789J907272N18570K120018L015442K931061K495613K662010
3625.1D29502792K289048J948356O220818L734245o343727K436066M293785N173492
3632.8D49254875K253800m41704L198738M555702K843437Q09136K072830L085022L341865
3641.5D70973701K412377J781540K891350L607750O149215J168556k224807N482864
3649.2D92242546J308098j59988k57149M802627N196190M195214N790863n652810Q90961
3657.9E08356552N793343K736397K635345O73485J911049J566734J883354K638817
$$ plain form
3600 372771873 374578476 375615578 377435570 379512672 381730690 384627914 387675972 387585564 390534401
3608.7 390534401 392384911 392308159 398534698 401218109 399817085 403096619 404194870 408194275 412442017
3617.4 412442017 413852806 415760078 416278648 418398666 421414108 424345169 426840782 429502792
3625.1 429502792 431791840 433740196 439961014 443695259 437351532 439787598 444081383 449254875
3632.8 449254875 451508675 451066971 454265709 458821411 461664848 462473984 464546814 467631836 470973701
3641.5 470973701 473386078 475167618 478058968 481666718 487815933 488984489 486759682 492242546
3649.2 492242546 493550644 493390656 493133507 497936134 503132324 507327538 513118401 507465591 508356552
3657.9 508356552 514149895 516886292 519521637 520195122 522106171 523672905 525556259 528195076
3665.6E28195076Q67043M312324L522873P25479J980515m922371J401672P166252Q865204
3674.3E52114067K305565j5548668J192551P656593N455208j234436J05362K397880
3682E54444122J595040J757126J093521K61802L222924O661491n588303m014167Q061676
3690.6E67495232k529297j033974M194298L36189J338539N51796p858J859131M78096
3699.3E72682152K224083L390312l915825k588386L971939K147140P77588M88319J923829
3708E81101151M222373n587539K890701O094055j2373199K610435M161377L37410J126709
3716.7E84583473J641236R48104k346572Q56399N115013j722832m422607L450623J953468
3725.4E90056305R37004j888885j023865K946281N10407M341507j568413p339592Q634682
$$ plain form
3665.6 528195076 529062119 533374443 536897316 537622795 539603310 534680939 536082611 543248863 552114067
3674.3 552114067 554419632 538870964 540063515 547720108 553175316 551940880 552046242 554444122
3682 554444122 556039162 557796288 558889809 559151611 562374535 569036026 563447723 559433556 567495232
3690.6 567495232 564965935 563931961 568126259 568462448 569800987 570352783 570344925 572204056 572682152
3699.3 572682152 574906235 578296547 574380722 571792336 575764275 577911415 578689003 579177322 581101151
3708 581101151 585323524 579735985 582626686 588720741 576347542 578957977 583119354 583456764 584583473
3716.7 584583473 586224709 587172813 584826241 585682640 590797653 589074821 584652214 588102837 590056305
3725.4 590056305 590993309 589104424 588080559 591026840 591537247 595878754 594310341 586970749 595605431
3734E95605431L434944q433724m24766K501182M94080P74841K210579l043938K100831
3742.7E95219460J0846786o829071j6610146Q141632N173798N939713p82433r853630
3750.4E91246109J0070305j915360q204460M368286L570824K994728m599380J859665
3758.2E99390717O432533p131500k884179M152756J748963l63884K591667j257324
3765.9F02679749m266167K890701N004425N37911p817192J555862K821655k26211R13429
3774.5F04094162l9520O65283L64189K730217J052933p153778J477394K049446M83169
3783.2F05723495J641388k441902p81402J288108Q12722Q82683m65088k73133Q7204
3791.9F06474075J16844r1781J350555L380699k824707m862861J599998M745789P519417
$$ plain form
3734 595605431 599040375 590606651 590181885 592683067 593177147 593951988 596162567 593118629 595219460
3742.7 595219460 606066246 599237175 582627029 590768661 595942459 601882172 601099739 591246109
3750.4 591246109 601316414 599401054 591196594 595564880 599135704 602130432 597531052 599390717
3758.2 599390717 605823250 598691750 595807571 599960327 601709290 601345406 603937073 602679749
3765.9 602679749 598413582 601304283 606308708 606846619 599029427 600585289 603406944 603180733 604094162
3774.5 604094162 604054642 604719925 605084114 607814331 608867264 601713486 603190880 605240326 605723495
3783.2 605723495 607364883 604922981 604141579 605429687 606242409 607125092 606660004 606386871 606474075
3791.9 606474075 606590919 606499138 607849693 611230392 608405685 603542824 605142822 609888611 617408028
3800.6F17408028l129082j1877174J587677J824379L759536N550652p641754m860344
3808.3F02621918M468384K175025k6435M16870q9188O05087N354767P78847j3788796
3817F02516479K831345N410843M530563K570572j5412063L34663M580612J764031K713432
3825.7F11840477P56378l898048r04999J806183L650970K262192q511581J275825P795410
3834.3F16072807n054092j880379Q658447n055084n652656P261734m000397k735901
3842.1F07614479N739098r65805l846817J449279J180191L73955J718979m15497R36241
3850.7F13784103N246048l339729K59781j1311302j519013Q589478l61061j989327
3858.4F09358978J695709J808472K567177m365158r00116N768166l510590n336647
$$ plain form
3800.6 617408028 614278946 602401772 603989449 605813828 609573364 615124016 607482262 602621918
3808.3 602621918 607090302 609265327 609238892 609655762 609566574 610171661 615526428 616305275 602516479
3817 602516479 605347824 610758667 615289230 617859802 602447739 602782402 607363014 609127045 611840477
3825.7 611840477 612596855 608698807 607793808 609599991 613250961 615513153 607001572 608277397 616072807
3834.3 616072807 611018715 609138336 617796783 612741699 607089043 614350777 610350380 607614479
3842.1 607614479 613353577 612387772 608540955 609990234 611170425 611544380 613263359 612847862 613784103
3850.7 613784103 619030151 615690422 615950203 604638901 603119888 611709366 611348305 609358978
3858.4 609358978 611054687 612863159 615430336 611065178 610165062 615933228 612422638 607085991
3866.2F07085991K596741L915977N252190m522324q418846K533150N686722M451522
3873.9F18581123r100837j139412L662185q04405J080208M674683k807923p638817
3881.6F06506805M571724J724701K69547N343895r802742q64029L779259Q49189L775292
3890.3F16153641J23062o790161K10037K861481r99794K19726M13704J584702K473526
3898.9F16249924p944680L333359K687149m718971L868027k671547j756668N14450
3906.7F09561043k03514J885185k8572k39754N04341Q63800K37503q56437N14564K362976
3916.3F14601135j871376l892059L139877O22673l767738J341743J991272J338082
3924F13503609j076660l009835J87989J152076J342163o12640j47285K139282k919731
$$ plain form
3866.2 607085991 609682732 613598709 618850899 614328575 605909729 608442879 614129601 618581123
3873.9 618581123 609480286 608340874 612003059 611198654 612278862 616953545 614145622 606506805
3881.6 606506805 611078529 612803230 613072777 618416672 608613930 607749901 611529160 612378349 616153641
3890.3 616153641 616276703 609486542 609696579 612558060 611558266 611777992 612191696 613776398 616249924
3898.9 616249924 608305244 611638603 614325752 609606781 613474808 610803261 609046593 609561043
3906.7 609561043 609357529 611242714 611214142 610974388 611478729 612342529 612580032 611723595 612238159 614601135
3916.3 614601135 612729759 608837700 611977577 612600250 608832512 610174255 612165527 613503609
3924 613503609 612426949 609417114 609605103 610757179 612099342 611486702 611339417 613478699 610558968
3932.7F10558968j681786K062073k8687K58446N15137p22237r55238j44425K028542
3941.4F11890793J333084l393326j955643P73850J543274J329994j367721O85653J95656
3950.1F11035614j950912J268768j08376l67660L98865L700N21774p62138J90124R3651
3959.7F10323410K02942N64003j221886K6703O00357l9100K27355L14103N7373p01332
3969.3F10353928r24721q2894J64757%Q393l14866O87q3504J45073J1559m7608O23970
3980.9F09854774j09748J62468K2811l26843l62434p0572Q28552m6081M74510K94075
3990.6F10721512n81589j46751k55509L32871l4065l62435L44200N68772l47023n58281
4000.2F09681702
$$ plain form
3932.7 610558968 608877182 610939255 610910568 611169014 611684151 610961914 610006676 609862251 611890793
3941.4 611890793 613223877 609830551 607874908 608648758 610192032 611522026 610154305 610839958 611035614
3950.1 611035614 609084702 610353470 610245094 609877434 610276299 610279999 610801773 610039635 610229759 610323410
3959.7 610323410 610526352 611090355 609868469 609895172 610495529 610456429 610683784 610997887 611055260 610353928
3969.3 610353928 609429207 609346313 609511070 609511070 609519463 609204597 609205284 609121780 609266853 609278412 609230804 609854774
3980.9 609854774 609745026 609907494 609930305 609603462 609241028 609170456 609999008 609952927 610427437 610721512
3990.6 610721512 610139923 609993172 609737663 610070534 610036469 609674034 610018234 610587006 610239983 609681702
4000.2 609681702
##END=$$ End of the data block
