##TITLE=Contaminacao sulfato - Esferas $$ Begin of the data block
##JCAMP-DX=5.00 $$ ACD/SpecManager v 10.08
##SPECTROMETER/DATA SYSTEM=Alpha
##DATE=23 Jul 2015 12:08:42
##DATA TYPE=INFRARED SPECTRUM
##DATA CLASS=XYDATA
##ORIGIN=
##OWNER=
##NPOINTS=1765
##FIRSTX=399.76428223
##LASTX=3997.64306641
##MAXX=3997.64306641
##MINX=399.76428223
##MAXY=0.88401163
##MINY=0.24140839
##XFACTOR=1.0000000000
##YFACTOR=1.000000000000000e-9
##FIRSTY=0.82229102
##DELTAX=2.03961372
##XUNITS=1/CM
##YUNITS=ARBITRARY UNITS
##XYDATA=(X++(Y..Y))
399.8H22291017K852201J705110N01037J423418J900792O59466O97315J359582M35471
418.1H33825409O05345J893819J154184P39097J677216J177966P8976R27210J422286
436.5H43501508K64108M11690J248002K87890K921J165390O26504k74360M97699M05609
456.9H48136961k83360Q59857J243412j19865p0333O83427l44038m76540R05395K69055
477.3H50803971p30037K51650M11213o89805k05576L62933p61807q20041K16544o24896
497.7H48214149j468300m41134m09067j376808p72297m10497j461685j433790q22842
516H39617729j456439j535833o70612j242101k093911j318694j117467k099395k020657
534.4H26062620j476825k128303k443075j908719k312303k848446k380431k523959
$$ y = [822291017, 825143218, 826848328, 827349365, 828772783, 830673575, 831333041, 832030356, 833389938, 833825409, 834430754, 836324573, 837478757, 838217854, 839895070, 841073036, 841152012, 842079222, 843501508, 843765616, 844177306, 845425308, 845713198, 845716119, 846881509, 847508013, 847233653, 847731352, 848136961, 847853601, 848713458, 849956870, 849837005, 849766672, 850450099, 850106061, 849629521, 850534916, 850803971, 850073934, 850325584, 850736797, 850046992, 849841416, 850204349, 849442542, 848622501, 848839045, 848214149, 846745849, 846304715, 845895648, 844518840, 843746543, 843336046, 841874361, 840440571, 839617729, 838161290, 836625457, 835954845, 834712744, 832618833, 831300139, 830182672, 828083277, 826062620, 824585795, 822457492, 820014417, 818105698, 815793395, 812944949, 810564518, 808040559]
550.7H08040559l299117l179371k981365l616631l864229l548324l922522m580855
567G79048145m701615m981994n607665n836189o042540o776332p460773p866800q641839
585.4G21132398r676576j0612190j1819303j3268053j4709711j6452194j9010603k2195637
601.7F03388131k5724829k9507875l2808721l3740699l0515850k1789640p394821J0109544
618D32015240K4787069L2044231L2034934K5978148J5802741L391266q874297j6604066
634.3E40575266j3649225O06894J7444611K7421236K9124498K7444422K5549770K3141384
650.6F77658856J9843340J6530156J3483882J1484504J0525882R225964P223905P371008
667G73347497R231389O879985N534232N974173N569816N065202N093575M692256M081965
$$ y = [808040559, 804741442, 801562071, 798580706, 794964075, 791099846, 787551522, 783629000, 779048145, 774346530, 769364536, 763756871, 757920682, 751878142, 745101810, 737641037, 729774237, 721132398, 711455822, 700843632, 689024329, 675756276, 661046565, 644594371, 625583768, 603388131, 577663302, 548155427, 515346706, 481606007, 451090157, 429300517, 421905696, 432015240, 456802309, 488846540, 520881474, 546859622, 562662363, 566053629, 557179332, 540575266, 526926041, 527532935, 544977546, 572398782, 601523280, 628967702, 654517472, 677658856, 697502196, 714032352, 727516234, 739000738, 749526620, 758752584, 765976489, 773347497, 782578886, 789458871, 794993103, 800967276, 806537092, 811602294, 816695869, 821388125, 825470090]
685.3H25470090M094779L906250L205598L101647L360867K856970K473235K808452
701.6H51277888K635956K021670K188683K363085J745284J578092J842559J387656
717.9H67040873R84907J537204J760900J324713J377403J564742J026153P02620J020372
736.3H78339887P92086L52204O51478P57933K16484L23773P82728L83615Q5712N54144
756.7H83240044M78327j10328P5519L28064k03490l57509J50264Q881l42906R1374
777.1H83358240K26855k60949m5240L71456j33872l83436J05440L398m31657o6102
797.5H82744133J65463l55244l24011J37330j84536n30601j47045k36570p69020n66840
817.9H79933059l51071q13425q44896l95536o43432j024962p66873q24332j283467
$$ y = [825470090, 829564869, 833471119, 836676717, 839778364, 843139231, 845996201, 848469436, 851277888, 853913844, 855935514, 858124197, 860487282, 862232566, 863810658, 865653217, 867040873, 868025780, 869562984, 871323884, 872648597, 874026000, 875590742, 876616895, 877319515, 878339887, 879131973, 879484177, 880135655, 880893588, 881110072, 881433845, 882216573, 882600188, 882685900, 883240044, 883718371, 883608043, 883683562, 884011626, 883808136, 883450627, 883600891, 883609772, 883266866, 883358240, 883585095, 883324146, 883278906, 883650362, 883516490, 883133054, 883238494, 883241892, 882810235, 882744133, 882909596, 882554352, 882230341, 882367671, 882183135, 881652534, 881505489, 881268919, 880499899, 879933059, 879581988, 878768563, 877923667, 877528131, 876884699, 875859737, 875092864, 874268532, 872985065]
836.2H72985065j094461q53776j251042j194179p10726j033783j558304j331925j221836
854.6H62735033j605451j548946j288712j585007j761794j498222j584113j839459
870.9H50023329j647591j542688j830220j825213j565338j674413j825869j672984
887.2H36439013j741468k040685k007544j883149k056837k092659j888037j978040
903.5H20750594k195835k124131k148151k406657k425968k339781k504468k600848
919.9H02004755k473355k486884k639354k627551k560258k667487k755642k719283
936.2G81074941k793014k930760k943158k959371l072381l111303l097236l221035
952.5G56946683l368616l363609l354252l410101l392696l391385l532648l700257
$$ y = [872985065, 871890604, 871036828, 869785786, 868591607, 867880881, 866847098, 865288794, 863956869, 862735033, 861129582, 859580636, 858291924, 856706917, 854945123, 853446901, 851862788, 850023329, 848375738, 846833050, 845002830, 843177617, 841612279, 839937866, 838111997, 836439013, 834697545, 832656860, 830649316, 828766167, 826709330, 824616671, 822728634, 820750594, 818554759, 816430628, 814282477, 811875820, 809449852, 807110071, 804605603, 802004755, 799531400, 797044516, 794405162, 791777611, 789217353, 786549866, 783794224, 781074941, 778281927, 775351167, 772408009, 769448638, 766376257, 763264954, 760167718, 756946683, 753578067, 750214458, 746860206, 743450105, 740057409, 736666024, 733133376, 729433119]
968.8G29433119l855765m013478l874898l446043l398955l802836m039108m012823
985.1F98989213m029155m081071l949821l763377l829539m060507m223466m318535
1001.4F66733742m364789m386544m499018m679740m776239m798949m876733m933834
1017.8F29417896m932880n015373n141259n209088n318284n504429n619049n663753
1034.1E87013781n755663n853832n870819n909681o073952o269932o394743o512344
1050.4E38372815o676436o795168o896674p060826p238269p390708p569462p756144
1066.7D80989128p928013q157015q437276q712620r000122r316594r534835r672702
1083D10229951r945601j0406107j0877877j1011631j0442376r463191r055674r253740
$$ y = [729433119, 725577354, 721563876, 717688978, 714242935, 710843980, 707041144, 703002036, 698989213, 694960058, 690878987, 686929166, 683165789, 679336250, 675275743, 671052277, 666733742, 662368953, 657982409, 653483391, 648803651, 644027412, 639228463, 634351730, 629417896, 624485016, 619469643, 614328384, 609119296, 603801012, 598296583, 592677534, 587013781, 581258118, 575404286, 569533467, 563623786, 557549834, 551279902, 544885159, 538372815, 531696379, 524901211, 518004537, 510943711, 503705442, 496314734, 488745272, 480989128, 473061115, 464904100, 456466824, 447754204, 438754082, 429437488, 419902653, 410229951, 400284350, 389878243, 379000366, 367988735, 357546359, 348083168, 339027494, 329773754]
1099.4C29773754q813113p587910p138401q097112r386838r876162r220570p757723
1115.7B61895925o114185m657984l463641k654403k151132j446187M0278K271682M779473
1134B48499826P217660R233028J0501295J0879755J0489524R607732Q446127P162750
1150.3C22037697N990803N117446M634023M592270M954487N694091O795913Q208454
1166.7C68025184R845644J1641711J3474345J4954239J5631408J5411257J4420808
1180.9D63404596J2827277J0969937R167910P474660N997062N103052M863500M958809
1197.3E24766803N234480N563557N590498N231083M760027M288613L867448L623009
1213.6E62925518L465235L262400L116012L037453K893924K743721K654911K517402
$$ y = [329773754, 320960641, 313372731, 306234330, 298137218, 288750380, 278874218, 269653648, 261895925, 255781740, 251123756, 247660115, 245005712, 242854580, 241408393, 241448671, 243720353, 248499826, 255717486, 264950514, 275451809, 286331564, 296821088, 306428820, 314874947, 322037697, 328028500, 333145946, 337779969, 342372239, 347326726, 353020817, 359816730, 368025184, 377870828, 389512539, 402986884, 417941123, 433572531, 448983788, 463404596, 476231873, 487201810, 496369720, 503844380, 509841442, 514944494, 519807994, 524766803, 530001283, 535564840, 541155338, 546386421, 551146448, 555435061, 559302509, 562925518, 566390753, 569653153, 572769165, 575806618, 578700542, 581444263, 584099174, 586616576]
1229.9E86616576K315521K210855K193273K120912K046823K039492K034009K034664
1246.2F03612125K086997K088249K008199J970888J959800J854182J722693J687408
1262.5F18990541J670122J629829J624525J645207J660943J717031J785457J763821
1278.8F32487476J725674J764357J739144J610637J567244J571894J498341J426816
1295.2F45391583J419902J394093J338780J325965J311958J263976J240671J236200
1311.5F55923128J188338J157343J200557J265347J269639J237332J220048J164377
1327.8F65626109J126051J135230J044452Q03113O97851R37283J174331J116216R20594
1346.2F74581230O94513N55992P13170R97722J102328R85146Q17656Q43466J017212
$$ y = [586616576, 588932097, 591142952, 593336225, 595457137, 597503960, 599543452, 601577461, 603612125, 605699122, 607787371, 609795570, 611766458, 613726258, 615580440, 617303133, 618990541, 620660663, 622290492, 623915017, 625560224, 627221167, 628938198, 630723655, 632487476, 634213150, 635977507, 637716651, 639327288, 640894532, 642466426, 643964767, 645391583, 646811485, 648205578, 649544358, 650870323, 652182281, 653446257, 654686928, 655923128, 657111466, 658268809, 659469366, 660734713, 662004352, 663241684, 664461732, 665626109, 666752160, 667887390, 668931842, 669734955, 670432806, 671370089, 672544420, 673660636, 674581230, 675275743, 675831735, 676544905, 677542627, 678644955, 679630101, 680447757, 681291223, 682308435]
1364.5F82308435R49264P27654N92052M88759N29825O24299M61161L2068j59383M92751
1384.9F87046885J564861J907170J324415O91652M95374O30558Q19266R05752P62641
1403.3F96148574P60496R31740Q87275P83443P51853N58257L27766O27220R53734Q09013
1423.7G03539371P06196O22392N65648O26326M71651L65973Q01921J021325Q01146
1442G09521949N66840M00424M39704N35011L75509n9k20895N53489J221955Q79287
1462.4G14273214N82278P98106Q12352L59774K76982Q35360J072883Q78334P22349
1480.8G20611632P14481N17189J70112K12133P23421P95782L63946K42531N79894P05302
1501.2G25636423K98619m46916j87695J109898J171112O27816K45631K20537J63972
$$ y = [682308435, 683257699, 683985353, 684577405, 685066164, 685595989, 686220288, 686681449, 686713517, 686554134, 687046885, 688611746, 690518916, 691843331, 692534983, 693030357, 693660915, 694480181, 695385933, 696148574, 696909070, 697840810, 698728085, 699511528, 700263381, 700821638, 701149404, 701776624, 702730358, 703539371, 704245567, 704867959, 705433607, 706059933, 706531584, 706897557, 707699478, 708720803, 709521949, 710088789, 710489213, 710928917, 711463928, 711839437, 711839378, 711618483, 712171972, 713393927, 714273214, 714855492, 715653598, 716465950, 716825724, 717102706, 717938066, 719010949, 719889283, 720611632, 721326113, 721843302, 722013414, 722225547, 722948968, 723744750, 724108696, 724351227, 724931121, 725636423, 725935042, 725488126, 725300431, 726410329, 727581441, 728209257, 728454888, 728675425, 728839397]
1519.5G28839397K34664O68049P03454O54161O27219K90096J85907L26157j39654n46932
1539.9G31842518K70486R16958P75098L04222K7240k4259k93494p54594r13203M03285
1560.3G32554257J043618M69505j1324l77536k30670J7225m89652p42793k17259k83658
1580.7G31731713p34151q89420r95636j256108j418531j449585j605392j791477j906276
1599.1G19685137k160787k480567k542019k463996k476275k425730k438367k909660
1615.4F99787736k840340j538396j042724j131475p91490m98712l48925j37389M2736
1633.7F91501021P17581J735031K086521K150714K055287K492368L497601K988100
1650.1G09224224K547860M072547L972948K850294K451539K517581K554953K016664
$$ y = [728839397, 729074061, 729742110, 730445564, 731099725, 731726944, 732017040, 732202947, 732529104, 732389450, 731842518, 732113004, 733029962, 733805060, 734109282, 734136522, 734112263, 733818769, 733064175, 732150972, 732554257, 733597875, 734067380, 734056056, 733678520, 733447850, 733465075, 732975423, 732232630, 732015371, 731731713, 730997562, 730108142, 729112506, 727856398, 726437867, 724988282, 723382890, 721591413, 719685137, 717524350, 715043783, 712501764, 710037768, 707561493, 705135763, 702697396, 699787736, 696947396, 695409000, 694366276, 693234801, 692443311, 691944599, 691595674, 691458285, 691501021, 692218602, 693953633, 696040154, 698190868, 700246155, 702738523, 706236124, 709224224, 711772084, 715844631, 719817579, 722667873, 725119412, 727636993, 730191946, 732208610]
1666.4G32208610J678705J938879J779616J425624J382709R38773L14414J28329R92656
1684.7G42788315J833260J569509J269997P71641K31326K18391L96073R52304J227319
1703.1G51258135Q12590P53164Q31545N97715J66953j83165J84178J016259J014650
1721.5G56452024O08802M22180K52485Q1360j13964n5730O42657O95884L26991L10719
1741.9G59623408L52025K21074L6359J24395N76913O27458L15011K43067K27988K81096
1762.2G62628794M19378K25961j7643j10090Q8811O00517O40214K98500J64032K31921
1782.6G65170395K36869K54750J26780j36018N2094M47572L46362O2645R9778L73065
1803G67034292L86775J71423P1406J43051K08676J98841J98186J63197L0875n9127
$$ y = [732208610, 733887315, 735826194, 737605810, 739031434, 740414143, 741352916, 741667330, 741795659, 742788315, 744621575, 746191084, 747461081, 748232722, 748464048, 748682439, 749078512, 750030816, 751258135, 752070725, 752823889, 753655434, 754253149, 754420102, 754236937, 754421115, 755437374, 756452024, 757060826, 757483006, 757735491, 757816851, 757702887, 757647157, 758289814, 758985698, 759312689, 759623408, 759975433, 760196507, 760232866, 760357261, 760934174, 761561632, 761876643, 762119710, 762347698, 762628794, 763048172, 763274133, 763256490, 763146400, 763235211, 763835728, 764475942, 764774442, 764938474, 765170395, 765407264, 765662014, 765788794, 765652776, 765704870, 766152442, 766498804, 766561449, 766661227, 767034292, 767421067, 767592490, 767663896, 767806947, 768015623, 768214464, 768412650, 768575847, 768606722, 768547595]
1823.4G68547595J9907M5777Q6665M02391M43101J93059J55330J40727j17422j56819
1843.8G69760311K54869L93987K83778K34603J31309O3837J38044J77980Q7738l994
1864.2G71522462j29580j49965K04682M59731K90155P7546P2836J02997M4704N7101
1884.6G72552669P7605m3750j2695J54257J37329N4180Q8454J53660Q0645k3961j728
1907.1G73216665M8399P0810J11818M0472j07825j1444J39237J04308R1254J47879
1927.5G73851573J28329K206k0087Q0109M7147r4891p3254Q6725J17779R2685R7930
1949.9G74316251K0922j0193P5519N5194j9789N3525P9215l7253j1683R8348L6121
1972.3G74656177k4975N7459P6473Q94K5630P2062j431n0306%N3883Q4638J15991J02580
$$ y = [768547595, 768567502, 768613279, 768699944, 769102335, 769545436, 769738495, 769893825, 770034552, 769917130, 769760311, 770015180, 770409167, 770692945, 770927548, 771058857, 771122694, 771260738, 771438718, 771526456, 771522462, 771392882, 771242917, 771447599, 771907330, 772197485, 772275031, 772347867, 772450864, 772495568, 772552669, 772630274, 772586524, 772573829, 772728086, 772865415, 772919595, 773008049, 773161709, 773242354, 773218393, 773216665, 773265064, 773335874, 773447692, 773488164, 773380339, 773368895, 773508132, 773612440, 773703694, 773851573, 773979902, 773982108, 773962021, 774042130, 774089277, 773994386, 773921132, 774007857, 774125636, 774218321, 774316251, 774337173, 774326980, 774402499, 774457693, 774437904, 774491429, 774570644, 774533391, 774521708, 774620056, 774656177, 774631202, 774688661, 774765134, 774766028, 774791658, 774863720, 774862289, 774811983, 774811983, 774865866, 774950504, 775066495, 775169075]
1998.8G75169075K6524K9862R0241L9637P868R0837Q1361m8876o7234l9458k01583
2021.3G75178254m78804l94226K78175P21693N22018K67267J70827J53780J73688J46329
2041.7G76739001J05083J23918J41263J19329J49488J92881J68204J49012J73211J44303
2062.1G78205693R2268J69158K82705K52842J73450J43290P1048r2387l20554p04586
2082.5G78272927j368940k221227l140330l938973l947198k686799r67145n5253m5836
2100.8G59901226k31147l64781n97775p83801n28633K07722J025259J547635J668334
2119.2G61844039J540899J392007J230121J002788Q43704P45118N20050K39492Q8155
2137.5G69446373K8491m292Q3626K39134K67923K45749L05593L32773L17037M10736
$$ y = [775169075, 775195599, 775225461, 775315702, 775355339, 775363207, 775454044, 775535405, 775486529, 775419295, 775379837, 775178254, 774699450, 774305224, 774583399, 775305092, 775827110, 776094377, 776265204, 776418984, 776592672, 776739001, 776844084, 776968002, 777109265, 777228594, 777378082, 777570963, 777739167, 777888179, 778061390, 778205693, 778297961, 778467119, 778749824, 779002666, 779176116, 779319406, 779390454, 779298067, 778977513, 778272927, 776903987, 774682760, 771542430, 767603457, 763656259, 760969460, 760002315, 759947062, 759901226, 759670079, 759305298, 758707523, 757923722, 757395089, 757602811, 758628070, 760175705, 761844039, 763384938, 764776945, 766007066, 767009854, 767853558, 768598676, 769118726, 769358218, 769446373, 769474864, 769470572, 769554198, 769793332, 770061255, 770307004, 770612597, 770945370, 771262407, 771673143]
2157.9G71673143N07593M46737L43680K01702q0466k74777k65718l20077m47392m32015
2178.3G71352410l51429l40342k59161P75L01778O14822J040757J333236J238466R75906
2198.7G75907218P25985M39346J87933L6061j47104l64244m29928l83199l92556l91006
2219.1G75188506l28064l16263k84135j22785k9743j08242j22190l0815l4988p1466
2239.5G73739815l2962p5578k02835j87397o4909j8061L3439J59919J91212J35481
2259.9G73678124J62005J79053J16706J36911K27094K16961J82211K17200J76966N3942
2280.3G75347173Q702j3351j26362k15828k22624k44200k54214j56045k1219O9857
2300.7G74171889J74761K67088K82764K94209L20017K73109K09451K18868K20001J80363
$$ y = [771673143, 772180736, 772627473, 772971153, 773172855, 773092389, 772817612, 772551894, 772231817, 771784425, 771352410, 771000981, 770660639, 770401478, 770402253, 770704031, 771318853, 772359610, 773692846, 774931312, 775907218, 776633203, 777072549, 777260482, 777296543, 777149439, 776785195, 776355267, 775972068, 775579512, 775188506, 774860442, 774544179, 774260044, 774137259, 774107516, 773999274, 773877084, 773846269, 773811281, 773739815, 773706853, 773631275, 773428440, 773241043, 773176134, 773158073, 773191512, 773351431, 773542643, 773678124, 773840129, 774019182, 774135888, 774272799, 774499893, 774716854, 774899065, 775116265, 775293231, 775347173, 775355875, 775342524, 775216162, 775000334, 774777710, 774533510, 774279296, 774123251, 774102032, 774171889, 774346650, 774613738, 774896502, 775190711, 775510728, 775783837, 775993288, 776212156, 776432157, 776612520]
2321.1G76612520K18511L21507L25561K70665K74956K43485J17004J2874r3043k06887
2341.5G78097153j17660J84059L54052L11613L00705L58642L42786K66611J49787j1444
2361.9G80236304p3195L636J2934n9008n1558N364L0101O3478J05024Q3029N9128R2626
2386.4G80507863J02937N9902L9757L6776J1384K4915N8651K5809p928L1472N1617
2408.8G80943155l57j9789K1279K6941J7405L8147J4484l1651j0192K6286K0325K0564
2433.3G81066597L0457J3412O079L2187M0650J9550P511O020q762j7345L516Q703l994
2459.8G81204581J0789J4007r597k443J4066M590j19P033R477P75n424O974J1742P868
2488.3G81274319m351l2187k0385J9849J4782j1623n365L994j4067j3471J5259J8954
$$ y = [776612520, 776831031, 777152538, 777478099, 777748764, 778023720, 778267205, 778384209, 778397083, 778304040, 778097153, 777979493, 778163552, 778517604, 778829217, 779129922, 779488564, 779831350, 780097961, 780247748, 780236304, 780163109, 780166745, 780179679, 780120671, 780069113, 780074477, 780104578, 780168056, 780273080, 780356109, 780415237, 780507863, 780610800, 780670702, 780710459, 780747235, 780758619, 780783534, 780842185, 780867994, 780860066, 780891538, 780943155, 780942798, 780923009, 780944288, 780971229, 780988634, 781026781, 781041265, 781009614, 780999422, 781025708, 781046033, 781066597, 781097054, 781110466, 781116545, 781148732, 781189382, 781208932, 781216443, 781222463, 781213701, 781196356, 781199872, 781208575, 781204581, 781215370, 781229377, 781219780, 781217337, 781231403, 781235993, 781235874, 781242907, 781252384, 781253159, 781247735, 781254709, 781266451, 781274319, 781269968, 781237781, 781217396, 781237245, 781252027, 781240404, 781235039, 781239033, 781224966, 781211495, 781226754, 781245708]
2512.8G81245708n36p75l040k5630j6272N722k0742m6969j9490O675L577J5080J2874
2539.3G81156182k8312m2498j5855o56J252J3471j967m6253l0578Q107j5438l2782
2563.8G80964673n722j4723n3048l6776J2398K1100J2874K0504o616m8101l3676k3365
2588.3G80809522m1426l0934r418j609L57o497l4511o1869m5777P511K7477J431k7359
2614.8G80586898n1915l6240Q524j79m6850n0663l0339l5525l2842k1040l1412l4332
2639.3G80224085l0100m6790m3154j6451k0742m3273m1545j9550k1815l2425j9849
2661.7G79888391L994J3173m828k4259l4810l5405p450J9133q35m5299o7115o5744
2686.2G79638946m0471n97m708n0128m1961L457j2875m3452k9623k3723l0816k5749
$$ y = [781245708, 781245172, 781244397, 781241357, 781215727, 781199455, 781205177, 781184435, 781137466, 781117976, 781124651, 781128228, 781143308, 781156182, 781127870, 781085372, 781069517, 781068861, 781070113, 781083584, 781081617, 781035364, 781004786, 781012893, 780997455, 780964673, 780958951, 780944228, 780891180, 780854404, 780866802, 780887902, 780900776, 780921280, 780914664, 780866563, 780832887, 780809522, 780768096, 780737162, 780727744, 780726135, 780726492, 780719995, 780685484, 780623615, 780577838, 780585349, 780612826, 780614257, 780586898, 780534983, 780498743, 780507267, 780507088, 780460238, 780409575, 780379236, 780343711, 780310869, 780289829, 780258417, 780224085, 780193985, 780147195, 780104041, 780087590, 780066848, 780023575, 779982030, 779962480, 779940665, 779908240, 779888391, 779892385, 779905558, 779900730, 779876471, 779841661, 779806256, 779798806, 779817939, 779817104, 779771805, 779704690, 779638946, 779598475, 779597878, 779593170, 779543042, 779501081, 779504538, 779491663, 779448211, 779418588, 779394865, 779364049, 779338300]
2710.7G79338300l2544m5180l2485k7776m7922l8743o675j2756n1021m3810j1205k9445
2735.1G78958738m9710m2201l6060k2054j1683l7610q1480p3492k8432j6748m1903
2757.6G78517365o1214n1379m2736n8651o0976j4126L6120L0518n4717j41800j15931
2780G77982473k8967l636k2412q106k9862j15752j09792k5511m4644j25944j05798
2802.4G77362049m9353o6876p2003o6101j33336j47939o7293n7638j06216p1883l4451
2824.9G76488960q9228j05620o2883p4446r4831o6161j37150l38793m38631l92556
2845.3G74688661l64602m03761l82662k36035o8783Q1122J85728J58250P1585L7372
2865.7G73766875K086J0193J12116M8995j70052j82092o1929o6281j23381j19031r1076
$$ y = [779338300, 779305756, 779260576, 779228091, 779200315, 779152393, 779113650, 779106975, 779094219, 779043198, 778999388, 778988183, 778958738, 778909028, 778866827, 778830767, 778808713, 778797030, 778759420, 778677940, 778604448, 778576016, 778559268, 778517365, 778456151, 778404772, 778362036, 778303385, 778242409, 778228283, 778264403, 778294921, 778240204, 778098404, 777982473, 777953506, 777949870, 777927458, 777919352, 777889490, 777773738, 777663946, 777638435, 777593791, 777467847, 777362049, 777312696, 777245820, 777173817, 777107716, 776974380, 776826441, 776759148, 776701510, 776595294, 776523411, 776488960, 776399732, 776294112, 776231229, 776156783, 776061952, 775995791, 775858641, 775519848, 775081217, 774688661, 774324059, 773920298, 773537636, 773301601, 773232818, 773313940, 773499668, 773657918, 773729503, 773766875, 773768961, 773779154, 773891270, 773940265, 773770213, 773588121, 773526192, 773459911, 773336530, 773217499, 773126423]
2888.1G73126423j21295j38640q8990j15633j92404j60754j13487j73926k27213k15471
2908.5G71578610k03610k07126l21567n40554o15776m69327k59697q2612J05560K48312
2928.9G69232213K03550J27137K09391K99454K90155L02613L05355J69933j1504o9618
2949.3G71058679j5915j848n2630o6162k2947M0054N3346k0742m4048M0293J04308
2971.7G71072388J02281P3195P4327R0241J5199r0777r9242l4154N7817N7578o8009
2994.2G71250844r6679o8426j39415j49489p2419m7207J0312J37329J07646r7096k15710
3016.6G70619690k03192j91569j64688j05321r7275j11818o8069k5868r9838j85132
3037G69366920j20997n4300j15872k07841k33352j66893j25170j83046k27988k33471
$$ y = [773126423, 773005128, 772866488, 772777498, 772661865, 772469461, 772308707, 772195220, 772021294, 771794081, 771578610, 771375000, 771167874, 770846307, 770305753, 769689977, 769220650, 768960953, 768878341, 768983901, 769232213, 769435763, 769562900, 769772291, 770071745, 770361900, 770664513, 770969868, 771139801, 771128297, 771058679, 771042764, 771040916, 770988286, 770922124, 770899177, 770939231, 770992577, 770971835, 770927787, 770968080, 771072388, 771174669, 771247864, 771322191, 771412432, 771427631, 771336854, 771237612, 771203458, 771261275, 771318853, 771250844, 771154165, 771085739, 770946324, 770796835, 770724416, 770677209, 770687521, 770824850, 770932496, 770835400, 770619690, 770416498, 770224929, 770060241, 769954920, 769857645, 769745827, 769677758, 769651890, 769552052, 769366920, 769245923, 769191623, 769075751, 768867910, 768634558, 768467665, 768342495, 768159449, 767931461, 767697990]
3057.4G67697990k24352j70171j04070q2254j57774k76148k97129k09332p6830l1412
3077.8G66068518j57058k76387k59459k30372k50757k90811l43382l58522k91586j74403
3098.2G63435781j66178k99811l33965j97351j34587k56837k77280j00613p2122k45630
3118.6G61351407m28677n45800n04970l73900l31104l64959l53694k89977k36869k66730
3139G57654727m18604n33819m96686m05669l22878k86043m06682o04570o44267n61595
3159.4G52973914n21183n39660n54145n57482n98252o25431o12736o40214o75618o53625
3179.8G46995568o60300p31349p66873p24972p08699p90536q57055q51214q59082q68261
3200.1G39177227q39293q30412q41916q37385q37982q26478p87675q02338q97885r56058
$$ y = [767697990, 767473638, 767303467, 767199397, 767117143, 766959369, 766683221, 766386092, 766176760, 766099930, 766068518, 765911460, 765635073, 765375614, 765145242, 764894485, 764603674, 764260292, 763901770, 763610184, 763435781, 763269603, 762969792, 762635827, 762438476, 762303889, 762047052, 761769772, 761669159, 761597037, 761351407, 760922730, 760376930, 759871960, 759498060, 759166956, 758801997, 758448303, 758158326, 757921457, 757654727, 757236123, 756702304, 756205618, 755799949, 755477071, 755191028, 754784346, 754179776, 753535509, 752973914, 752452731, 751913071, 751358926, 750801444, 750203192, 749577761, 748965025, 748324811, 747649193, 746995568, 746335268, 745603919, 744837046, 744112074, 743403375, 742612839, 741755784, 740904570, 740045488, 739177227, 738337934, 737507522, 736665606, 735828221, 734990239, 734163761, 733376086, 732573748, 731675863, 730719805]
3220.5G30719805r07719q79228r24945q92580p73191p72953r57430j077473j013160
3238.9G22521126r38475q61645p70866p82013q57890q64208p88986p05958p03156p68304
3259.3G14479625p63356o84739o32941n69463m61578n14269p47085q67486q38578q01027
3279.7G07599103p87854p85708q20399q60273q06153p83444r47952j151204j245558
3298F99410558j259089j176178j037896j107573j457572j750887j797199j740754j700699
3316.4F86382711j699746j755118j788914j789451j956165k198338k237559k168536
3332.7F70788884k128899k106249k223730k456189k589583k628088k595127k507627
3349F51553392k647042k965033l022969k858698k802789k906263k944231k769113k633214
$$ y = [730719805, 729812086, 728932858, 728007913, 727115333, 726342142, 725569189, 724611759, 723534286, 722521126, 721582651, 720721006, 719950140, 719168127, 718310237, 717446029, 716657043, 715951085, 715247929, 714479625, 713716269, 713031530, 712398589, 711829126, 711367548, 710853279, 710106194, 709238708, 708400130, 707599103, 706811249, 706025541, 705205142, 704344869, 703538716, 702755272, 701807320, 700656116, 699410558, 698151469, 696975291, 695937395, 694829822, 693372250, 691621363, 689824164, 688083410, 686382711, 684682965, 682927847, 681138933, 679349482, 677393317, 675194979, 672957420, 670788884, 668659985, 666553736, 664330006, 661873817, 659284234, 656656146, 654061019, 651553392, 648906350, 645941317, 642918348, 640059650, 637256861, 634350598, 631406367, 628637254, 626004040]
3367.4F26004040k818107l142059l165186k876103k616286k483427k413154k313912
3383.7F04175806k139509j915753j696825j734018j991689j964808j584649j386463
3400E89762092j637459j893044j767873j524210j377285j284301j304090j341284j217365
3418.4E76415181j049340r16779p29978m97997l50654l64482l03269j08480r8586k42293
3438.8E71753323k02954L5286K80082M72606N81681O42479P30455Q25822R40740J051843
3459.2E77111363J023353J046478J305580J450181J197756Q72373R09925J169383J354218
3477.5E87440610J326919J160562J179039J355827J375437J276314J281083J368939
3493.8E97764730J444042J439810J403809J404225J334906J242042J332283J542151
$$ y = [626004040, 623185933, 620043874, 616878688, 614002585, 611386299, 608902872, 606489718, 604175806, 602036297, 600120544, 598423719, 596689701, 594698012, 592733204, 591148555, 589762092, 588124633, 586231589, 584463716, 582939506, 581562221, 580277920, 578973830, 577632546, 576415181, 575365841, 574449062, 573719084, 573221087, 572870433, 572505951, 572202682, 572094202, 571995616, 571753323, 571550369, 571585655, 571865737, 572338343, 572920024, 573562503, 574292958, 575118780, 576059520, 577111363, 578134716, 579181194, 580486774, 581936955, 583134711, 584007084, 584917009, 586086392, 587440610, 588767529, 589928091, 591107130, 592462957, 593838394, 595114708, 596395791, 597764730, 599208772, 600648582, 602052391, 603456616, 604791522, 606033564, 607365847, 608907998]
3510.2F08907998J682937J628577J446546J402974J559853J753271J727402J538456
3526.5F21648014J547396J719713J810908J864732J861572J758814J778126J886427
3542.8F35875702J868307J737893J677811J754701J861215J895964J920641J984119
3559.1F50576353J966655J762629J649380K134859K688170K541184K226830K215623
3575.4F67761683K370298K534867K602219K406895K142728K380132K837778K706110
3591.7F87742710K488196K622366K768397K745927K689659K501309K192199K205730
3608.1G07956493K416730K451479K435863K229333K190113K604187K490818J757860
3624.4G26532876J106859J391828K340019K174556J677513J514375J373649J264453
$$ y = [608907998, 610590935, 612219512, 613666058, 615069032, 616628885, 618382156, 620109558, 621648014, 623195410, 624915123, 626726031, 628590763, 630452335, 632211149, 633989275, 635875702, 637744009, 639481902, 641159713, 642914414, 644775629, 646671593, 648592234, 650576353, 652543008, 654305637, 655955017, 658089876, 660778046, 663319230, 665546060, 667761683, 670131981, 672666848, 675269067, 677675962, 679818690, 682198822, 685036600, 687742710, 690230906, 692853272, 695621669, 698367596, 701057255, 703558564, 705750763, 707956493, 710373223, 712824702, 715260565, 717489898, 719680011, 722284198, 724775016, 726532876, 727639735, 729031563, 731371582, 733546138, 735223651, 736738026, 738111675, 739376128]
3640.7G39376128J096487O49929K30312O78480J613378J411617Q03709R17018J080215
3659G47857273P24136M08173K11716j18912j58369J97530m0770o8307P21157Q75950
3679.4G50609577O23524M23550J35780N6565M35054Q01027P89523N66363K58625K7656
3699.8G54727244J57416M21167K05516k43961l53158J79947O50763M30286O1631j19149
3720.2G56117702j22071k6762J37031J29163k40207n29706k42889M54545O41346q7500
3740.6G56230652q30769l75509L23474j31190j27792O34610N64397K4676k7656K55465
3761G56540358J32084j09732j23620l8624K16305L02315O5386j41620p2062L8206r4771
3783.5G56714225q8632J00493J05858p9155k93851l01421k49981l90828q0705K45750
$$ y = [739376128, 740472615, 741122544, 741352856, 742031336, 743644714, 745056331, 745860040, 746777058, 747857273, 748581409, 748989582, 749201298, 749082386, 748924017, 749121547, 749080777, 749012470, 749733627, 750609577, 751233101, 751656651, 751792431, 751848996, 752284050, 753085077, 753874600, 754440963, 754699588, 754727244, 754884660, 755305827, 755511343, 755267382, 754914224, 755094171, 755744934, 756175220, 756236851, 756117702, 755995631, 755968869, 756105900, 756235063, 755994856, 755465150, 755222261, 755676806, 756318152, 756230652, 755399883, 755024374, 755347848, 755216658, 755088866, 755723476, 756287873, 756312549, 756284893, 756540358, 756672442, 756562710, 756439090, 756400466, 756616771, 756919086, 756984472, 756842852, 756770790, 756808996, 756714225, 756625593, 756726086, 756831944, 756752789, 756458938, 756157517, 755907536, 755516708, 755436003, 755681753]
3803.9G55681753m0948Q1479L19481j4841m45187l92259k38239l06547J81615M33088
3824.3G55259395J29521j8180j41561j95742k10940l69668k65539J15812L04639L45051
3844.6G54952788J86444k78473r52780r93431M14193R46939K90155k54929l72529r6798
3865G53841579j02878k62022P0632K98977K64466K9742k84910j49786m8876j3113J34647
3887.5G53778458j01626j45078J71840M9651l64959n07951l17276Q3149M91738M75824
3907.9G53613770J69992m5836j75476k47001j54555r775j2398k0862N6684k1517j45614
3930.3G53007412K9147K15768O6758j26422j75714j08362j2934m6611j9073J20461
3950.7G52950430Q7380l6359o2227o8962o4493j072L7789K6703q106p0990r4652l8385
$$ y = [755681753, 755640805, 755722284, 756041765, 756026924, 755581737, 755189478, 754951239, 754644692, 754826307, 755259395, 755388916, 755370736, 755229175, 755033433, 754822493, 754452825, 754187286, 754303098, 754607737, 754952788, 755139232, 754860759, 753907979, 752914548, 753328741, 754275680, 754565835, 754310906, 753938377, 753841579, 753738701, 753476679, 753547311, 753846288, 754110754, 754140496, 753855586, 753705800, 753656924, 753643811, 753778458, 753676832, 753531754, 753703594, 753753245, 753388286, 752880335, 752563059, 752646208, 753137946, 753613770, 753783762, 753737926, 753562450, 753315449, 753160894, 753151119, 753138721, 753117859, 753174543, 753153026, 753007412, 753036559, 753252327, 753319085, 753192663, 753016949, 752908587, 752895653, 752849042, 752829969, 752950430, 753037810, 753001451, 752939224, 752870262, 752805769, 752804697, 752842486, 752869189, 752861083, 752790093, 752695441, 752657056]
3975.2G52657056l636j0550O5505J16051j6332j40846j49190j13011k8729L7372J8895
3997.6G52432585
$$ y = [752657056, 752653420, 752642870, 752708375, 752824426, 752808094, 752667248, 752518058, 752405047, 752376318, 752413690, 752432585]
##END=$$ End of the data block
