##TITLE=Contaminacao do sulfato de sodio 2 $$ Begin of the data block
##JCAMP-DX=5.00 $$ ACD/SpecManager v 10.08
##SPECTROMETER/DATA SYSTEM=Alpha
##DATE=23 Jul 2015 10:44:12
##DATA TYPE=INFRARED SPECTRUM
##DATA CLASS=XYDATA
##ORIGIN=
##OWNER=
##NPOINTS=1765
##FIRSTX=399.76428223
##LASTX=3997.64306641
##MAXX=3997.64306641
##MINX=399.76428223
##MAXY=0.88022482
##MINY=0.34912640
##XFACTOR=1.0000000000
##YFACTOR=1.000000000000000e-9
##FIRSTY=0.80439186
##DELTAX=2.03961372
##XUNITS=1/CM
##YUNITS=ARBITRARY UNITS
##XYDATA=(X++(Y..Y))
399.8H04391861M524827L431320K159417J742601K311349K311766J466632O56r48966
418.1H21391463J653016L858089K529025J528681J738190J388371J025081J025796
434.4H36137712P99775J081765J031279L85166P84635J128376P55131Q28147O06477
452.8H43538463k14219M232J003325J181245J056075M16040k17437K6226k91288l8624
473.2H46464038J112103O26028j40429j43349n68092k71320L23653n06282q00371k01583
493.6H45894396n07474q03411j092672j713216j108706o30260j264512j242221j184106
511.9H36347818j808047j997292j933098j813590j431823k061904k757966k004325
528.3H20539773j871646k603590k824486l021180l079355k951741l506542l943622
$$ y = [804391861, 808916688, 812348008, 814507425, 816250026, 818561375, 820873141, 822339773, 822340429, 821391463, 823044479, 826902568, 829431593, 830960274, 832698464, 834086835, 835111916, 836137712, 836937487, 838019252, 839050531, 839435697, 840220332, 841348708, 842103839, 842931986, 843538463, 843324244, 843328476, 844331801, 845513046, 846569121, 846985161, 846767724, 846793950, 846502662, 846464038, 847576141, 848202169, 848061740, 847918391, 847350299, 847078979, 847402632, 846896350, 846095979, 845894396, 845386922, 844583511, 843490839, 841777623, 840668917, 840038657, 838774145, 837531924, 836347818, 834539771, 832542479, 830609381, 828795791, 827363968, 825302064, 822544098, 820539773, 818668127, 816064537, 813240051, 810218871, 807139516, 804187775, 800681233, 796737611]
544.6G96737611l740251l919124m147232m055619m485369m996121n124152n474507
560.9G60795236n777300o076097o797791p181763p289470p937967q514703q743942
577.2G02476203r287953r950101j0484398j1242628j1968255j2815237j3922214j4621735
593.5F08183682j5305996j6433537j7503262j8395960j9384503j9826532j9359558
607.8D81974334j7790199j4583051r414077j962900P550001J5473843J8434077J7773062
624.1D97455090J4687270R509564L221452k271354m482508j076877O617725J4078438
640.4E37738800J8114150J8398583J7156481J6701699J6694367J5477836J3930857
654.7F54212773J2824416J2170851J1987269J1143744O675661J466810P846833J5520632
$$ y = [796737611, 792997360, 789078236, 784931004, 780875385, 776390016, 771393895, 766269743, 760795236, 755017936, 748941839, 742144048, 734962285, 727672815, 719734848, 711220145, 702476203, 693188250, 683238149, 672753751, 661511123, 649542868, 636727631, 622805417, 608183682, 592877686, 576444149, 558940887, 540544927, 521160424, 501333892, 481974334, 464184135, 449601084, 440187007, 438224107, 445774108, 461247951, 479682028, 497455090, 512142360, 521651924, 524873376, 522602022, 518119514, 517042637, 523660362, 537738800, 555852950, 574251533, 591408014, 608109713, 624804080, 640281916, 654212773, 667037189, 679208040, 691195309, 702339053, 709014714, 710481524, 718328357, 733848989]
671G33848989J2074113Q390963P190049P176697P157326O916225O803810O485522O049752
689.4H02093446N964637N737484N289495N033433M791796M397452M139721L759504
705.7H41206968L347695L266036K972424K471686K114534J442254J362860K607047
722H60791504K943576K220452J978695J815855J455248J317918J123607Q47280Q59023
740.4H75353158P20202N21720O45280O49929N20050N75960M46260K77042L51847J63376
760.8H80224824j12534j12414j83582l26276k77758l21626l05415j13606j79768j74403
781.2H78117442J7643j62244l88145l25442m56333n34296l45349m04358n58436m83632
801.6H74476850m55797m52101m55797p09295q37088q36133j073182j148999j002014
$$ y = [733848989, 745923102, 754314065, 761504114, 768680811, 775838137, 782754362, 789558172, 796043694, 802093446, 808058083, 813795567, 819085062, 824118495, 828910291, 833307743, 837447464, 841206968, 844554663, 847820699, 850793123, 853264809, 855379343, 856821597, 858184457, 860791504, 863735080, 865955532, 867934227, 869750082, 871205330, 872523248, 873646855, 874494135, 875353158, 876073360, 876595080, 877240360, 877890289, 878410339, 878986299, 879432559, 879709601, 880061448, 880224824, 880112290, 879999876, 879816294, 879490018, 879212260, 878890634, 878585219, 878471613, 878291845, 878117442, 878135085, 877972841, 877584696, 877259254, 876802921, 876268625, 875923276, 875518918, 874960482, 874476850, 874021053, 873568952, 873113155, 872403860, 871566772, 870730639, 869657457, 868508458, 867506444]
819.9H67506444j108050j198470j121164j207471j283526j362622j632512j690983
836.2H56901646j540244j644134j764477j770496j929820k015531k026737k192318
852.6H42017889k202570k096415k219558k340376k379656k491295k492905k411962
868.9H23383152k488255k611458k678931k673388k515852k455235k562999k593339
885.2H02803695k682268k870202k930284k965987l021717k947688k878189k936423
901.5G79570937l007769l093601l242373l339827l378093l427804l439903l485263
917.8G53156304l571927l539622l524661l611505l603220l577173l647506l664315
934.1G24416375l671646l785491l846824l839254l897191l930866l910601l922701
$$ y = [867506444, 866398394, 865199924, 864078760, 862871289, 861587763, 860225141, 858592629, 856901646, 855361402, 853717268, 851952791, 850182295, 848252475, 846236944, 844210207, 842017889, 839815319, 837718904, 835499346, 833158970, 830779314, 828288019, 825795114, 823383152, 820894897, 818283439, 815604508, 812931120, 810415268, 807960033, 805397034, 802803695, 800121427, 797251225, 794320941, 791354954, 788333237, 785385549, 782507360, 779570937, 776563168, 773469567, 770227194, 766887367, 763509274, 760081470, 756641567, 753156304, 749584377, 746044755, 742520094, 738908589, 735305369, 731728196, 728080690, 724416375, 720744729, 716959238, 713112414, 709273160, 705375969, 701445103, 697534502, 693611801]
950.5F93611801l966868m069388m195094m197359m123271m147351m179239Tm286409
968.8F56267583m418075m439473m196346l787994l808022m209339m360140m314899
985.1F22733295m345894m267752m076123m048705m138887m225374m293859m240989
1001.4E89095712m170955m234373m274070m241467m235983m203439m191637m207551
1017.8E55336237m140496m083574m090428m079640m107237m150629m083395m042268
1034.1E22558570m068852m003942l948330l988088l964603l937900l987223l970772
1050.4D90688860l948688l985703l970653l920972l885240l840178l854185l891677
1066.7D59391564l890008l945767m017413m018366l984452l920436l821462l781319
$$ y = [693611801, 689644933, 685575545, 681380451, 677183092, 673059821, 668912470, 664733231, 660553992, 656267583, 651849508, 647410035, 643213689, 639425695, 635617673, 631408334, 627048194, 622733295, 618387401, 614119649, 610043526, 605994821, 601855934, 597630560, 593336701, 589095712, 584924757, 580690384, 576416314, 572174847, 567938864, 563735425, 559543788, 555336237, 551195741, 547112167, 543021739, 538942099, 534834862, 530684233, 526600838, 522558570, 518489718, 514485776, 510537446, 506549358, 502584755, 498646855, 494659632, 490688860, 486740172, 482754469, 478783816, 474862844, 470977604, 467137426, 463283241, 459391564, 455501556, 451555789, 447538376, 443520010, 439535558, 435615122, 431793660, 428012341]
1083D28012341l809273l838032l827453l662259l274172k906859k872735k994180k813935
1101.4C98013443k410233k454490l169507m041105m580706m668415m440784m129023
1117.7C68119180l884971l766775l736943l544509k802849j256734Q12888K888113
1134C52827400M702449O073355O879598P167131P061511O683499O162971N565584N007356
1152.4D08130854M639030M432380M344463M411132M604131M883050N267114N748540
1168.7D46460694O291121O828487P250756P392288P177919O691754O012409N229235
1185D99334663M404217L579676K903045K492070K343297K423525K630829K820731K895474
1203.4E25827527K788127K551913K338826K187431K039373J907587J802266J713753
$$ y = [428012341, 424203068, 420365036, 416537583, 412875324, 409601152, 406694293, 403821558, 400827378, 398013443, 395603210, 393148720, 389979213, 385938108, 381357402, 376688987, 372248203, 368119180, 364234209, 360467434, 356730491, 353185982, 350383133, 349126399, 349939287, 352827400, 357529849, 363603204, 370482802, 377649933, 384711444, 391394943, 397557914, 403123498, 408130854, 412769884, 417202264, 421546727, 425957859, 430561990, 435445040, 440712154, 446460694, 452751815, 459580302, 466831058, 474223346, 481401265, 488093019, 494105428, 499334663, 503738880, 507318556, 510221601, 512713671, 515056968, 517480493, 520111322, 522932053, 525827527, 528615654, 531167567, 533506393, 535693824, 537733197, 539640784, 541443050, 543156803]
1219.7E43156803J660108J592696J506805J466394J450836J402438J352787J326144
1236E54915011J300156J283228J253367J230955J257479J286090J286506J289487J273155
1254.4E66375434J212955J155496J139581J137435J110792J073659J048207J096428
1270.7E75349987J191258J244247J265347J262903J246810J236498J195074J143515
1287E85135639J157701J150846J092196J073897J073062J044333J010239R75490R41396
1305.4E94654799R52243R18210Q23140Q33392Q72553Q59201R90390J138330J081109
1323.7F03123367R92536R57132R33826R28640Q30174N14090L00109P14302J326859
1342.1F10621035J305938R37700P65920P44462P19547P37429Q13603O26505J80125
$$ y = [543156803, 544816911, 546409607, 547916412, 549382806, 550833642, 552236080, 553588867, 554915011, 556215167, 557498395, 558751762, 559982717, 561240196, 562526286, 563812792, 565102279, 566375434, 567588389, 568743885, 569883466, 571020901, 572131693, 573205352, 574253559, 575349987, 576541245, 577785492, 579050839, 580313742, 581560552, 582797050, 583992124, 585135639, 586293340, 587444186, 588536382, 589610279, 590683341, 591727674, 592737913, 593713403, 594654799, 595607042, 596525252, 597348392, 598181784, 599054337, 599913538, 600903928, 602042258, 603123367, 604115903, 605073035, 606006861, 606935501, 607765675, 608279765, 608579874, 609294176, 610621035, 611926973, 612864673, 613630593, 614375055, 615094602, 615832031, 616645634, 617272139, 617452264]
1360.4F17452264K82466J028776J145840P13647L90172L5047K05934P81834O65725
1378.8F22701705J3649l28362J23858J207531K060056J566052K97070r9182N42461
1397.1F28084838J128495J368284R46343O91831J051069J011550P41780N77390Q822
1415.5F35610402o89149J25766J495242J397848J055181O77585L75569O73414L16262
1433.9F41038120l15905R37522K008319J351356N66840O7413J49131P10130M51266
1452.2F46964192r18567k039850L66569K926707J787424M81964J064062J161217m13656
1470.6F51380062r83715R27150K240002J944125J240611Q07286K08556p36177o98626
1488.9F56329274J075447J762867K92182m53949Q75354J505434L9339k599537j961172
$$ y = [617452264, 617734730, 618763506, 619909346, 620622993, 621013165, 621048212, 621254146, 622035980, 622701705, 622715354, 622386992, 622510850, 623718381, 625778437, 627344489, 627641559, 627542377, 628084838, 629213333, 630581617, 631527960, 632219791, 633270860, 634282410, 635024190, 635601580, 635610402, 634921253, 635047019, 636542261, 637940109, 638995290, 639672875, 640048444, 640721858, 641038120, 640722215, 641659737, 643668056, 645019412, 645586252, 645653665, 645802796, 646512926, 646964192, 646045625, 644005775, 644372344, 647299051, 649086475, 649568439, 650632501, 651793718, 651380062, 650396347, 651323497, 653563499, 655507624, 656748235, 657555521, 657764077, 657027900, 656329274, 657404721, 659167588, 659459770, 659005821, 659881175, 661386609, 661425948, 658826411, 656865239]
1507.3F56865239K522528L016472J241625k38836m95494l64124n1320J299858J694858
1525.6F65490806J600385J303315J0669j97828N47111j083731k735675K81334K843559
1544F68059945K652884J380086K52604j50680q04425k261519l109455J429617L997088
1562.4F71446145J868128J14978o66857j2517O65605o46412r58205Q67069R41217p0929
1582.8F73548222n62430p46965r17137j062572j196802j274526j247585j413464j824200
1601.1F63302541k076507k156138k258063k151608j904249k299071l388524k826452
1617.4F44241929p69377r01103j359403n09918r4056O4791o9798j105368o57260K334833
1637.8F41175270L224552K242326R15230M35650K450288K841174R84669L386080O232858
$$ y = [656865239, 659387767, 662404239, 663645864, 663407028, 662911534, 662547410, 662496090, 663795948, 665490806, 667091191, 668394506, 668405175, 668207347, 668754458, 667670727, 664935052, 665216386, 668059945, 670712829, 672092915, 672345519, 672194839, 671390414, 669128895, 666019440, 667449057, 671446145, 673314273, 673429251, 672762394, 672749877, 673415482, 672769070, 671810865, 672677934, 673619151, 673548222, 672985792, 672238827, 671321690, 670259118, 669062316, 667787790, 666540205, 665126741, 663302541, 661226034, 659069896, 656811833, 654660225, 652755976, 650456905, 647068381, 644241929, 643472552, 642571449, 641212046, 640702128, 640608072, 640672863, 640603065, 639497697, 638840437, 641175270, 644399822, 646642148, 647557378, 647993028, 650443316, 653284490, 654269159, 657655239, 663888097]
1656.2F63888097M570901K625227K072573K695620K016544N29945J102328K062619
1672.5F81563854J580775J807690J758754J90675j434684K5571L072321K697766J570582
1690.9F92833304L84629j214981j344442m37737J248121K474070J635611J452327J613438
1709.2F98644340P18534n80966j575470o67692K130092K618789J349986O31809R1076
1727.6G03360498n88477j244247j126766J153648J667023M71711L89814O09219J22607
1745.9G04815030m84526j79946J217961J513898N88536K18392J07348K75433Q50201
1764.3G08922327L01122o47425r70722k35557J419484J640380O59585J86086L20136
1782.6G11595416M03702M73917l8088r62972l41237J096845Q87394M530L8922P67827
$$ y = [663888097, 668458998, 671084225, 673156798, 675852418, 677868962, 678398907, 679501235, 681563854, 683144629, 684952319, 686711073, 686901748, 685467064, 685492635, 688564956, 691262722, 692833304, 693217933, 692002952, 690658510, 690220773, 691468894, 693942964, 695578575, 697030902, 698644340, 699362874, 698781908, 697206438, 696538746, 698668838, 701287627, 702637613, 703269422, 703360498, 702772021, 701527774, 700401008, 701554656, 703221679, 703693390, 704083204, 704692423, 704815030, 704330504, 704150558, 705368519, 706882417, 707470953, 707689345, 707796693, 708072126, 708922327, 709223449, 708576024, 707605302, 707369745, 708789229, 710429609, 711089194, 711275280, 711595416, 711999118, 712473035, 712434947, 711471975, 711130738, 712227583, 713114977, 713119507, 713158429, 713926256]
1803G13926256Q83698L10064j20819J03533N76079N29289K69175K35319K5868m27186
1823.4G16311276l75450j24097j6391P92444J131475M97699K00033J30355n35607q60095
1843.8G17151642L30210J170337Q96156N18679K68400J31071Q3804J41918J79887r9897
1864.2G20772207o97494o57141N54979J215875P18892K21371J28329J54972J20342
1882.6G22532332O4135j04905k81989R9778M43637K64407K45988L04341J67132P6830
1903G23811686N9962l7193k2411K22206K74002j04844l66450L219K70784K59995M16816
1925.4G24787772L76343J87993J02044Q1896J09494O4969j83642l38793N6386M67241
1945.8G25711703L84569J79053J05738J09971R9301Q7798R0897N9843l3736q5592Q1300
$$ y = [713926256, 714809954, 715120018, 714999199, 715102732, 715678811, 716208100, 716477275, 716712594, 716738462, 716311276, 715935826, 715811729, 715795338, 716587782, 717719257, 718216956, 718416989, 718547344, 718011737, 717151642, 717481852, 718652189, 719548345, 720067024, 720335424, 720466495, 720550299, 720692217, 720872104, 720772207, 720074713, 719417572, 719972551, 721188426, 721907318, 722128689, 722257018, 722411990, 722532332, 722596467, 722491562, 722209573, 722309351, 722752988, 723017395, 723263383, 723567724, 723734856, 723811686, 723871648, 723834455, 723812044, 724034250, 724308252, 724203408, 723836958, 723840177, 724110961, 724370956, 724787772, 725164115, 725352108, 725454152, 725536048, 725645542, 725710511, 725526869, 725188076, 725244462, 725711703, 726096272, 726275325, 726381063, 726491034, 726590335, 726678133, 726769030, 726828873, 726795137, 726709545, 726790845]
1968.3G26790845K76506K42710J13368P1288R9837R7692R2268R2030J7881q1598j04070
1990.7G27708757R6619L48091K90454J24335J14143J36375Q8096P1585J22845J25170
2011.1G29226470O5446j6630n3346k8849j05500l67105l39627L47018Q17597N91457
2031.5G30136931L30329K27213J74820J61171J57535K17974K63453K07067J92999K54035
2051.9G32323527K35796K00272K21908K15709J87814K04325K73764L55065L82185L25859
2072.3G34926224K66015K45035J64330m3511m51804j134514j995326k999544m012823
2090.6G24964082m245937l100633j387477l53635j93834l72767n31614p61569j068413
2109G12948203r22322j00732Q39531J447201J681805J611233J453816J326502J133025
$$ y = [726790845, 727067351, 727310061, 727423429, 727494717, 727594554, 727692246, 727784514, 727876544, 727894425, 727812827, 727708757, 727805376, 728153467, 728443921, 728568256, 728682399, 728818774, 728906870, 728978455, 729101300, 729226470, 729291916, 729275286, 729221940, 729193091, 729087591, 728720486, 728380859, 728727877, 729545474, 730136931, 730467260, 730694473, 730869293, 731030464, 731187999, 731405973, 731669426, 731876493, 732069492, 732323527, 732559323, 732759595, 732981503, 733197212, 733385026, 733589351, 733863115, 734218180, 734600365, 734926224, 735192239, 735437274, 735601604, 735558093, 735106289, 733971775, 731976449, 728976905, 724964082, 720718145, 717617512, 716230035, 715876400, 715682566, 715309799, 714778185, 714016616, 712948203, 712025881, 711925149, 712764680, 714211881, 715893686, 717504919, 718958735, 720285237, 721418262]
2127.3G21418262R53316Q18014N63264K84970J19507L755J2398J53780K14458K17139
2147.7G24758863K70427K82824L09229M12106M73380N38767N96881M70221K39491M947
2168.1G28357136k03490k69830l03149m19319m61400m00006l66927k83003p5101K01523
2188.5G25776434O13153J085997J354396J359999J165867Q17478N21659L31462Q4758
2206.9G33111203j54913l35872m82023m59194l36051l29375l49701l03208k56300j51813
2227.3G29952753n4360r1016j19507q4103p2956n1856p2896j89483k51711k32696k05398
2249.7G28526771j30832m6015j2219L9518Q6427L7372P689N4538P4446J12295J81973
2272.2G28931963K30074L12269L97980L77417K00570k06411p34508j050234j130343
$$ y = [721418262, 722371578, 723189592, 723752856, 724037826, 724157333, 724161088, 724173486, 724327266, 724541724, 724758863, 725029290, 725312114, 725621343, 726033449, 726506829, 727045596, 727642477, 728112698, 728352189, 728357136, 728153646, 727883816, 727580667, 727161348, 726699948, 726299942, 725933015, 725650012, 725574911, 725776434, 726389587, 727475584, 728829980, 730189979, 731355846, 732173324, 732694983, 733026445, 733111203, 732956290, 732620418, 732138395, 731679201, 731343150, 731013775, 730664074, 730360866, 730104566, 729952753, 729898393, 729807377, 729687870, 729603767, 729530811, 729478955, 729406059, 729216576, 728964865, 728732169, 728526771, 728395939, 728349924, 728337705, 728377223, 728463650, 728501022, 728508711, 728563249, 728637695, 728749990, 728931963, 729162037, 729474306, 729872286, 730249703, 730450273, 730243862, 729509354, 728459120, 727328777]
2290.5G27328777j180231j201034j208126j285553j289785j308978j697004k196014
2306.8G15962052k392709k287149j900316j777410k671600l877580l979563k926469
2323.1F94149256k049446k199293k456784j595855n46991q06570j466096j455605p58052
2341.5F80814564J545251N824327O668747J127183n894363r261608q096099n311787
2357.8F67416215k234995O06894K960861M945278O543934P469654P708490P555902
2374.1G02972233P323385P132828O709516N657256M095673K528370J324236N94199
2390.4G38337696K66909J41561P5937N5730M7743M3154O8068O9023L0160L4690N0246
2412.9G39220917L9578O0081O4612J3411q047K6047N1737N6982N2571N9545P5281N5432
$$ y = [727328777, 726148546, 724947512, 723739386, 722453833, 721164048, 719855070, 718158066, 715962052, 713569343, 711282194, 709381878, 707604468, 704932868, 701055288, 697075725, 694149256, 692099810, 689900517, 687443733, 685847878, 685300887, 684494317, 683028221, 681572616, 680814564, 682359815, 688184142, 694852889, 695980072, 690085709, 680824101, 672728002, 667416215, 665181220, 665788114, 668748975, 673694253, 680238187, 687707841, 695416331, 702972233, 710295618, 717428446, 724137962, 729795218, 733890891, 736419261, 737743497, 738337696, 738604605, 738746166, 738822103, 738877833, 738925576, 738968730, 739036798, 739105821, 739135981, 739170671, 739220917, 739260495, 739320576, 739385188, 739398599, 739390552, 739416599, 739468336, 739525318, 739577889, 739637434, 739712715, 739768147]
2437.4G39768147L6777N8770M1604l58L5644O9141M2558L7551L0279R715L3737L9935
2461.8G40203500J2457J6987J6690J4007L4928K1279J1563N4062N0664J7822L8266
2484.3G40492225M0114M708j669m649J967M8161M5121J4781L4333K7656P212M2737
2508.7G40752697M3154J1563K5868P928q345M1247L7193n186J6392K4855M291K4915
2533.2G40976572K2471O199K8491J9431m232Q345n305k7299K086K7001K4319J7404
2557.7G41095483o497K802N1498L0399j7584K146J9073K1935L3259l159k5391K1994
2582.2G41225958J7285j8060J3649K0147l934J1682m708l8624j2338O556J1623K8849
2606.6G41258085J0788k563K682k2947o974N2512J7702l9518o079J7464j014j5079
$$ y = [739768147, 739804924, 739863694, 739905298, 739904940, 739940584, 740009725, 740052283, 740089834, 740120113, 740129828, 740163565, 740203500, 740215957, 740232944, 740249634, 740263641, 740298569, 740319848, 740331411, 740385473, 740436137, 740453959, 740492225, 740532339, 740537047, 740535378, 740530729, 740532696, 740580857, 740625978, 740640759, 740675092, 740702748, 740709960, 740752697, 740795851, 740807414, 740833282, 740841210, 740832865, 740874112, 740911305, 740906119, 740922511, 740947366, 740951657, 740976572, 740999043, 741005242, 741033733, 741053164, 741048932, 741057277, 741051972, 741024673, 741026759, 741053760, 741078079, 741095483, 741088986, 741091788, 741143286, 741173685, 741156101, 741158247, 741177320, 741199255, 741232514, 741229355, 741203964, 741225958, 741243243, 741225183, 741238832, 741258979, 741255045, 741266727, 741262019, 741223395, 741211057, 741217613, 741229236, 741258085, 741268873, 741266310, 741268992, 741246045, 741239071, 741291583, 741309285, 741269767, 741263688, 741281152, 741280138, 741265059]
2631.1G41265059l1770j1384L3676J6034N36J6153k9266n8651j7941j192J669P75m1902
2657.6G41141796m1127Q643J6987K6107J9371m5180m4108K3008K9445J4603K5749K861
2682.1G41178155k1398n365j0252k1576r120k0921k1637O795j6331l5108K087j371
2706.6G41023958l1650l0220l2604j4782K2412J3888J78q165l5108l4511l5286n1140
2731.1G40786970j2637Q047k7299j9967k325j6034J1564L7431j1980m2617k4617l9280
2755.5G40647256n5670l6002k2411k1756j8239j2874p749j132P867o198o0201r9778
2780G40313113n9188L815M17j3947j7822n4538n6625k0981m0888q4162q0884p7545
2804.5G39810765p6890n3644q1659j25229q6129m0471m9353o7174p1764o0201n3525
$$ y = [741265059, 741233289, 741221905, 741255581, 741271615, 741272151, 741288304, 741259038, 741200387, 741182446, 741181254, 741182923, 741183698, 741141796, 741100669, 741109312, 741126299, 741152406, 741171777, 741126597, 741082489, 741105497, 741134942, 741149545, 741175294, 741178155, 741156757, 741151392, 741141140, 741119564, 741110444, 741089523, 741067886, 741074681, 741058350, 741023242, 741025329, 741023958, 740992308, 740962088, 740929484, 740914702, 740937114, 740951002, 740951180, 740943015, 740907907, 740873396, 740838110, 740786970, 740774333, 740782380, 740755081, 740735114, 740732789, 740716755, 740728319, 740765750, 740753770, 740711153, 740686536, 740647256, 740591586, 740555584, 740533173, 740511417, 740493178, 740480304, 740472555, 740471423, 740479290, 740473092, 740412891, 740313113, 740253925, 740257740, 740258157, 740244210, 740226388, 740171850, 740115225, 740094244, 740053356, 739969194, 739888310, 739810765, 739733875, 739680231, 739598572, 739473343, 739387214, 739346743, 739297390, 739230216, 739158452, 739098251, 739044726]
2826.9G39044726o2645o2525l9160l2723p5042j74582k98620l43203l09050l06428
2847.3G37340748l38912l12030k05338o1035R8288J69515J17124O2763M2141J8775
2867.7G36932039L1173P1049J5676j06275j19269m3392j4484n3048r7394j12474j25468
2890.1G36378133j05798l5405o2943j68085j64568j14739j22726j50859j82391j90436
2910.5G35080183j92285k86400m19259m45545l70979k23637m5657Q2493J64806J94014
2930.9G33537734J74522J76907K09510K31683K57194K89738K34425P4387q106M0829
2951.3G35218823M3392l2127n1021P569O9559O1274P569K7061P8738R3817J11401J07825
2975.8G35743880J00494R5427J2815o1274m2260k1040J6987O0141L040n0127m7684
$$ y = [739044726, 738982081, 738919556, 738880396, 738847673, 738772631, 738598049, 738299429, 737956226, 737647176, 737340748, 737001836, 736689806, 736484468, 736423433, 736521721, 736691236, 736808360, 736871123, 736913264, 736932039, 736963212, 737034261, 737049937, 736943662, 736824393, 736781001, 736766517, 736713469, 736616075, 736503601, 736378133, 736272335, 736236930, 736173987, 736005902, 735841334, 735726595, 735603869, 735453010, 735270619, 735080183, 734887898, 734601498, 734182239, 733736694, 733365715, 733142078, 733096421, 733178914, 733343720, 733537734, 733712256, 733889163, 734098673, 734330356, 734587550, 734877288, 735111713, 735186100, 735177994, 735218823, 735262215, 735230088, 735179067, 735186636, 735256195, 735317469, 735325038, 735352099, 735430837, 735524654, 735636055, 735743880, 735844374, 735939801, 735952616, 735891342, 735849082, 735828042, 735845029, 735905170, 735908210, 735858083, 735810399]
2998.2G35810399p9691j04845q4758m9352K2947J05918Q2850m1246j17600j28686j49727
3020.7G35266209j28508r7930j45555j60873r0003k4736k9683p3552n5313l994l7133
3043.1G34418929j55688k31564j75297j20342j53839j81199j95264j74642j21176j21772
3063.5G32788146r8825p6294j65224k28167j69634o7294l8624j41680k23756j91867
3083.9G31386781j83463j97590j86682k57015l28183k45094j46270j79887k34783k06232
3104.3G29221582j30057r7573j79112k07305q8632o5267j92702l40044m51207m22538
3124.7G27047145k75492k09272k93017l35931k39909j53005j97590l66389m72367m12345
3145.1G24091828l26693k57015k18273l59237n44667n19037m33505m28021m47631m99010
$$ y = [735810399, 735730708, 735625863, 735541105, 735491753, 735514700, 735620618, 735703468, 735662222, 735544622, 735415936, 735266209, 735137701, 735039771, 734894216, 734733343, 734643340, 734618604, 734588921, 734515369, 734460056, 734456062, 734418929, 734263241, 734031677, 733856380, 733736038, 733582199, 733401000, 733205736, 733031094, 732909918, 732788146, 732689321, 732613027, 732447803, 732219636, 732050002, 731982708, 731944084, 731802404, 731578648, 731386781, 731203318, 731005728, 730819046, 730562031, 730233848, 729988754, 729842484, 729662597, 729427814, 729221582, 729091525, 728993952, 728814840, 728607535, 728518903, 728453636, 728260934, 727920890, 727469683, 727047145, 726771653, 726562381, 726269364, 725933433, 725693524, 725540519, 725342929, 724976540, 724504173, 724091828, 723765135, 723508120, 723289847, 722930610, 722385943, 721866906, 721433401, 721005380, 720557749, 720058739]
3165.5G20058739n25892m86970m73439n12064n50747n76675n58614n58436o34492o35624
3185.9G14545786n67138n99205o76871p31229p84934p47085o58095o71863o97613o80625
3206.3G07731128p26939p55488p20561p27475p50184p53641p51912p55370p83145q04425
3226.7G00201988p83920p26521p06732q13008r11891q68082p94888p55965p11918p06852
3247.1F92422211p86841q10146o99699o10769o16073o37591o15657n80430n52296m78983
3267.5F86033726m00722m77791o34313o62744o26504o19889o24179o26922o50406o89983
3287.8F80020273o73533o66022p66039r12249j022458j030386r27925q59856j006782
3306.2F72155023j287163j459956j470268j425802j440347j487135j518071j552999
$$ y = [720058739, 719532847, 719045877, 718572438, 718060374, 717509627, 716932952, 716374338, 715815902, 715181410, 714545786, 713978648, 713379443, 712702572, 711971343, 711186409, 710439324, 709781229, 709109366, 708411753, 707731128, 707004189, 706248701, 705528140, 704800665, 704050481, 703296840, 702544928, 701789558, 701006413, 700201988, 699418068, 698691547, 697984815, 697171807, 696259916, 695391834, 694596946, 693840981, 693129063, 692422211, 691635370, 690825224, 690125525, 689514756, 688898683, 688261092, 687645435, 687065005, 686512709, 686033726, 685633004, 685155213, 684520900, 683858156, 683231652, 682611763, 681987584, 681360662, 680710256, 680020273, 679346740, 678680718, 677914679, 677002430, 675979972, 674949586, 674021661, 673161805, 672155023, 670867860, 669407904, 667937636, 666511834, 665071487, 663584352, 662066281, 660513282]
3322.5F60513282j605034j735568j860261j891732j923621j919448j871586j955033
3338.8F45750999k141535k260268k323806k329051k253116k322256k589285k745986
3355.2F26785696k680183k591431k640605k667427k509832k414883k588808k854288
3371.5F05838239k871930k615333k415001k362073k349734k283871k070547j787662
3387.8E87082088j614153j677275j838923j762449j436293j253605j465023j694918
3404.1E74339449j554191j318037j233340j197397j169026j123250j032471r11951
3420.4E64799786p23601n13971l90470l06010k32100j33157k027l0040j83464j46210
3440.8E62138736Q8334K69533M29689O41406P53701P59184P78675Q71182R63211R21726
$$ y = [660513282, 658908248, 657172680, 655312419, 653420687, 651497066, 649577618, 647706032, 645750999, 643609464, 641349196, 639025390, 636696339, 634443223, 632120967, 629531682, 626785696, 624105513, 621514082, 618873477, 616206050, 613696218, 611281335, 608692527, 605838239, 602966309, 600350976, 597935975, 595573902, 593224168, 590940297, 588869750, 587082088, 585467935, 583790660, 581951737, 580189288, 578752995, 577499390, 576034367, 574339449, 572785258, 571467221, 570233881, 569036484, 567867458, 566744208, 565711737, 564799786, 564076185, 563562214, 563171744, 562865734, 562633634, 562500477, 562498450, 562468410, 562284946, 562138736, 562227070, 562496603, 562926292, 563567698, 564321399, 565080583, 565859258, 566730440, 567693651, 568615377]
3461.2E68615377R44316J173199J286923J068950P84516Q00670J031398J162649J045107
3479.6E77913105R19343J070141J229644J162172J123964J196504J205742J226604
3495.9E87047219J245976J132607J056671J179696J279830J268626J411199J656533
3512.2E97278357J654207J441598J334965J372338J421511J420677J417398J547873
3528.5F08888924J793385J891791J792074J695394J691580J643896J415312J295686
3544.8F22108042J554191J803697J726090J711548J875162J841724J636088J457512
3561.1F35714054J098573O67811J385033K934337L130912K358079J978517K010107
3577.5F51277423K096832K088368J651585R95993J449168K752245K698898J984894
$$ y = [568615377, 569559693, 570732892, 572019815, 573088765, 573873281, 574673951, 575705349, 576867998, 577913105, 578832448, 579902589, 581132233, 582294405, 583418369, 584614873, 585820615, 587047219, 588293195, 589425802, 590482473, 591662169, 592941999, 594210625, 595621824, 597278357, 598932564, 600374162, 601709127, 603081465, 604502976, 605923653, 607341051, 608888924, 610682309, 612574100, 614366174, 616061568, 617753148, 619397044, 620812356, 622108042, 623662233, 625465930, 627192020, 628903568, 630778730, 632620454, 634256542, 635714054, 636812627, 637480438, 638865471, 641799808, 644930720, 647288799, 649267316, 651277423, 653374255, 655462623, 657114208, 658110201, 659559369, 662311614, 665010512, 666995406]
3593.8F66995406K101064K464056K486765K559483K355874J664877J537979K113461
3610.1F84278965K275527K052247J558423J230717K061844K614319J624107J9133q4877
3628.5F97630405K363921L347218K564609K036214J626193J237214Q16703k27452j525759
3646.8G09869266r28164J967788K874136J500368J004815J504242J172901M47273j93656
3665.2G19218969j186072j684309o63220n41449q94487J039922K167166J477658N87583
3683.5G19521761m33981j339019p57396J201451J921654J195073K62379l91304l01480
3701.9G20879138N00381M34637o25313j044154M22657J970172J273095l18646j196564
3720.2G22295403j192629p39038j3292M21405l11375j486301j137555J093269K405345
$$ y = [666995406, 669096470, 671560526, 674047291, 676606774, 678962648, 680627525, 682165504, 684278965, 686554492, 688606739, 690165162, 691395879, 693457723, 696072042, 697696149, 697715282, 697630405, 699994326, 703341544, 705906153, 707942367, 709568560, 710805774, 711622477, 711395025, 709869266, 708941102, 710908890, 713783026, 715283394, 716288209, 717792451, 718965352, 719412625, 719218969, 718032897, 716348588, 715685368, 715143919, 714249432, 715289354, 717456520, 718934178, 719521761, 719087780, 717748761, 716991365, 718192816, 720114470, 721309543, 721571922, 721180618, 720879138, 721379519, 721814156, 721188843, 720144689, 720567346, 722537518, 723810613, 723491967, 722295403, 721102774, 720363736, 720350444, 720771849, 720460474, 718974173, 717836618, 718929887, 721335232]
3738.6G21335232J157880j033485j232087M07993j5974l57806J523971J965702O48617
3756.9G24400043Q6129O59406N59807k05934m71532k09093N83768J008033L29137n12957
3777.3G26226807n09620J15871K26140J30773L32236K91705o5922o23882r84252q47220
3797.7G24292636j032770o31869O15657N60760O26564J111210K81572j164436j518250
3816.1G23141074q29994o35148M32373J469135P97093P7843l29315n77450o66678j026154
3836.5G21852779p39395M75168J155615J253068Q53479m15921k298892k930820L24786
3854.8G19529867K650738J526236j54376r30488l90350p9692o05523j40727Q03411
3873.2G22209096R78291L76761o50466n38826J0849M8041M22895J46031j89841N27442
$$ y = [721335232, 722493112, 721459627, 720227540, 720635533, 720619559, 720261753, 721785724, 723751426, 724400043, 724486172, 725145578, 725705385, 725499451, 725027919, 724818826, 725402594, 726410627, 726739764, 726226807, 725717187, 725833058, 726059198, 726189971, 726522207, 726813912, 726747990, 726124108, 725139856, 724292636, 723259866, 722627997, 723243654, 723804414, 724430978, 725542188, 725823760, 724659324, 723141074, 722311080, 721675932, 722108305, 723577440, 724374533, 724452376, 724123061, 723545611, 722878933, 721852779, 721113384, 721588552, 722744167, 723997235, 724850714, 724434793, 722135901, 719205081, 719529867, 722180605, 723706841, 723552465, 722621977, 722231627, 722151935, 721546412, 721405685, 722209096, 723187387, 723564148, 722913682, 722374856, 722385705, 722433746, 722856641, 723002672, 722812831, 723340273]
3893.6G23340273M41253q14855j458526q94546K38895J417160J569331P45833L1650
3912G24616468m72784p93636l95596K16067J79410r656J55747Q9347k68638r8765M28915
3934.4G23646879M21703J133l23713l00408j19N2571j0788J79648K84255J39236k8669
3956.8G24061728p6056m6790L279M2379M8637M6015O258p8440q5830J4722O0916L0100
3981.3G24026918Q583l6597r9361q7440j6153P630O378K1100
3997.6G23831058
$$ y = [723340273, 723781526, 722966671, 721508145, 720613599, 720852494, 722269654, 723838985, 724584818, 724616468, 724143684, 723350048, 722954452, 723170519, 723349929, 723340273, 723496020, 723585367, 723316729, 723217964, 723646879, 724068582, 724069715, 723746002, 723445594, 723445475, 723498046, 723487258, 723666906, 723951161, 724090397, 724061728, 723985672, 723938882, 723942161, 723984540, 724033177, 724079192, 724085450, 724007010, 723921180, 723935902, 723996818, 724026918, 724035501, 723998904, 723899543, 723812103, 723795950, 723803580, 723809958, 723831058]
##END=$$ End of the data block
