##TITLE=Comercial - Marcela $$ Begin of the data block
##JCAMP-DX=5.00 $$ ACD/SpecManager v 10.08
##SPECTROMETER/DATA SYSTEM=Alpha
##DATE=24 Oct 2013 10:57:42
##DATA TYPE=INFRARED SPECTRUM
##DATA CLASS=XYDATA
##ORIGIN=
##OWNER=
##NPOINTS=1765
##FIRSTX=399.75695801
##LASTX=3997.56933594
##MAXX=3997.56933594
##MINX=399.75695801
##MAXY=0.84796953
##MINY=0.23036051
##XFACTOR=1.0000000000
##YFACTOR=1.000000000000000e-9
##FIRSTY=0.54252821
##DELTAX=2.03957629
##XUNITS=1/CM
##YUNITS=ARBITRARY UNITS
##XYDATA=(X++(Y..Y))
399.8E42528212n489647k715230k76864M86374j03772J12951J304209K043546J650869
$$ 542528212 537038565 534323335 534046471 534532845 534429073 534542024 535846233 537889779 539540648
418.1E39540648p48217l101289l459990k538860j583934j997649l149271l107846j318812
$$ 539540648 538792431 535691142 532231152 529692292 528108358 526110709 522961438 519853592 518534780
436.5E18534780J170218K814054K912462K335727K541900L398895L495574K067208
$$ 518534780 519704998 522519052 525431514 527767241 530309141 533708036 537203610 539270818
452.8E39270818J10209r81569j028478p76768j479208l011287m013538l552437k382278
$$ 539270818 539381027 538399458 537370980 536594212 535115004 532103717 528090179 524537742 522155464
471.1E22155464k291262l205359l613949k765954r64403M94897N25475n01573j220822
$$ 522155464 519864202 516658843 513044894 510278940 509314537 509809434 510334909 509833336 508612514
489.5E08612514q76904j82986m91619j667202k426088k335489j861542j790673k611905
$$ 508612514 507735610 507552624 507061005 505393803 502967715 500632226 498770684 496980011 494368106
507.9D94368106l857970m514635m073560l355801l462255m140109m220098k990723
$$ 494368106 490510136 485995501 481921941 478566140 475103885 470963776 466743678 463752955
524.2D63752955j003235N88864J393288J881152K788097M487902O083548O090760M368693
$$ 463752955 462749720 463338584 464731872 466613024 469401121 473889023 479972571 486063331 490432024
542.5D90432024K224922Q40247J20520o60866j862526l227979m035294m238069m485995
$$ 490432024 492656946 493497193 493617713 492956847 491094321 487866342 483831048 479592979 475106984
560.9D75106984n334824o663531p631958p411301n875468l736377j616716N87493L171623
$$ 475106984 469772160 463108629 455476671 448065370 442189902 438453525 436836809 437424302 440595925
579.2D40595925N715459P332266P568449O734460N350441L890365K505988J216173
$$ 440595925 446311384 453643650 461212099 467946559 473297000 477187365 479693353 480909526
595.6D80909526J95176m66466o22511k04086K92569M95732Q27551J552969K520710
$$ 480909526 481104702 480638236 480015725 479811639 480104208 480599940 481427491 482980460 485501170
613.9D85501170L413290L992438M371375M679859M882991M960060M709244L793001
$$ 485501170 488914460 492906898 497278273 501958132 506841123 511801183 516510427 520303428
630.2E20303428K673209K088010K023339J935363J530171R61661O64055R67920J482010
$$ 520303428 522976637 525064647 527087986 529023349 530553520 531515181 532179236 533147156 534629166
648.6E34629166J513779J081348Q21829R68873J318753J504779J211762O65009M93348
$$ 534629166 536142945 537224293 538046122 539014995 540333748 541838527 543050289 543715298 544208646
666.9E44208646J380443J923085J550555J233041J149416J376152J604557J530051
$$ 544208646 545589089 547512174 549062729 550295770 551445186 552821338 554425895 555955946
683.3E55955946J232028R07422O75439M09425j89185j236797k469361l349542l544569
$$ 555955946 557187974 558095396 558770835 559180260 558991075 557754278 555284917 551935375 548390806
701.6E48390806l175319k545177j657427l45170J438021L362179M850507N606472N956531
$$ 548390806 545215487 542670310 541012883 540667713 542105734 545467913 550318420 555924892 561881423
720E61881423O349325O796181O972909O496787N414129M199862L414571L034652K343356
$$ 561881423 568230748 575026929 581999838 588496625 593910754 598110616 601525187 604559839 606903195
738.3F06903195R95279p25866k218783l310501m278779n248606o128729o601631o277025
$$ 606903195 607898474 607172608 604953825 601643324 597364545 592115939 585987210 579385579 573108554
756.7E73108554n237699l864765k272844k95699K214015N001724P528007R185671R655178
$$ 573108554 567870855 564006090 561733246 561437547 563651562 568653286 576181293 585366964 595022142
775E95022142R223700Q397459P633329O959915N974412M759848M033208M079342M537821
$$ 595022142 604245842 612643301 620276630 627236545 633210957 637970805 642004013 646083355 650621176
793.4F50621176N041361N348324N222381M817009M488647M210889L728926K867460
$$ 650621176 655662537 661010861 666233242 671050251 675538898 679749787 683478713 686346173
809.7F86346173J965881J493871J388729J186668M53055p86960k004683k900660l747225
$$ 686346173 688312054 689805925 691194654 692381322 692834377 692047417 690042734 687142074 683394849
828.1F83394849m892766o245613p298291p575989o991923o059646n276323m655897
$$ 683394849 678502083 672256470 664958179 657382190 650390267 644330621 639054298 634398401
844.4F34398401m036308l330946k613663k172291k190948k305985j683652M39704L911435
$$ 634398401 630362093 627031147 624417484 622245193 620054245 617748260 616064608 616504312 620415747
862.7F20415747P534444J0070384J1139035J0994315R917856P949829N021274J509428
$$ 620415747 627950191 638020575 649159610 660153925 670071781 678021610 683042884 684552312
879.1F84552312j872420m605353o406606p360816p840931p909775p406711o430209
$$ 684552312 682679892 678074539 671667933 664307117 656466186 648556411 641149700 634719491
895.4F34719491n443752m999220n360007o332934p371486q206546r051263j0070145
$$ 634719491 629275739 624276519 618916512 612583578 605212092 597005546 587954283 577884138
911.7E77884138j1047781j1425257j0694384q868456o507635m300773k540887j039088
$$ 577884138 566836357 555411100 544716716 535848260 529340625 525039852 522498965 521459877
928E21459877M59314J932621L156483M087865M964292N904258O269753M730701O40392
$$ 521459877 521919191 523851812 527008295 531096160 536060452 541964710 548234463 552965164 553605556
946.4E53605556m973530j0188997j3803005j6007960j7586738j8956810k0094931k0859063
$$ 553605556 548632026 538443029 524640024 508632064 491045326 472088516 451993585 431134522
962.7D31134522k1247178k1509230k1849305k2097409k1836400k0813346j9003629
$$ 431134522 409887344 388378114 366528809 344431400 322595000 301781654 282778025
977B82778025j6508788j3529003j0266647o951362l861606j300111N48929J710549
$$ 282778025 266269237 252740234 242473587 235522225 231660619 230360508 230909437 232619986
993.3B32619986K348453K659291K789438K696752K235651J438692O15537J04443R671
$$ 232619986 234968439 237627730 240417168 243113920 245349571 246788263 247403800 247508243 247517914
1011.6B47517914K68578O83412J111835J602933K233535K905101L391295L571928L466815
$$ 247517914 247786492 248469904 249581739 251184672 253418207 256323308 259714603 263286531 266753346
1030B66753346L215313K951562K640456K190560J718044J492829J702219K261221K854645
$$ 266753346 269968659 272920221 275560677 277751237 279469281 280962110 282664329 284925550 287780195
1048.3B87780195L300131L775328M596800N844354P332087Q887023J0344654J1034995
$$ 287780195 291080326 294855654 299452454 305296808 312628895 321515918 331860572 342895567
1064.7C42895567R651781M954099k479970r308130j2055099j0381311o539911k687544
$$ 342895567 352547348 357501447 355021477 345713347 333658248 323276937 316737026 314049482
1081C14049482K27213K145857L441989M536510N537897O139696N933851M860729L388852
$$ 314049482 314276695 316422552 319864541 324401051 329938948 336078644 342012495 346873224 350262076
1099.3C50262076K192169J653165J693397K059132K553493L127694L736079M070193
$$ 350262076 352454245 354107410 355800807 357859939 360413432 363541126 367277205 371347398
1115.6C71347398L770381K946943K221912K128839K743870L724218M420370M195660
$$ 371347398 375117779 378064722 380286634 382415473 385159343 388883561 393303931 397499591
1132C97499591K825022N07116k368629n332380p803500r181649r236067q278787o896794
$$ 397499591 400324613 400831729 398463100 393130720 385327220 376145571 366909504 358630717 351733923
1150.3C51733923n541652m319340l019602j458704K68340J963228L564745N281180
$$ 351733923 346192271 341872931 338853329 337394625 337662965 339626193 343190938 348472118
1166.6C48472118P341832R691030J1966288J3719529J4720917J5159935J5378266J5384525
$$ 348472118 355813950 365504980 377471268 391190797 405911714 421071649 436449915 451834440
1182.9D51834440J4872849J3538569J1438489R135098P165432N508124L939033K518058
$$ 451834440 466707289 480245858 491684347 500819445 507984877 513493001 517432034 519950092
1199.3E19950092J642048J698613K581656L692925M508078M968703N257249N494356
$$ 519950092 521592140 523290753 525872409 529565334 534073412 539042115 544299364 549793720
1215.6E49793720N463660M724503L214955J479447K14338l85582o80805j033663j426340
$$ 549793720 555257380 559981883 563196838 564676285 564890623 564505041 563824236 562790573 561364233
1233.9E61364233j532614j102388l14891L96729P69913R80258J434028K161145K739132
$$ 561364233 559831619 558729231 558414340 558811069 559580982 560561240 561995268 564156413 566895545
1252.3E66895545K786636K359867J945734J973152K347469K684474K680541K355337
$$ 566895545 569682181 572042048 573987782 575960934 578308403 580992877 583673418 586028755
1268.6E86028755K044081J906932J698673J107454K32994m80473p28190o29246o36518
$$ 586028755 588072836 589979768 591678441 592785895 593018889 592538416 591810226 591180980 590544462
1287E90544462j055717j660824k009809j974344j750052j585007j539409j422227j084804
$$ 590544462 589488745 587827921 585818112 583843768 582093716 580508709 578969300 577547073 576462269
1305.3E76462269o78301m92334p17998j290798j848102k158046k372205k763986l522516
$$ 576462269 575783968 575291634 574573636 573282838 571434736 569276690 566904485 564140499 560617983
1323.7E60617983m440844n013227n023062m624784m037500l366589k647341j878082
$$ 560617983 556177139 551163912 546140850 541516066 537478566 534111977 531464636 529586554
1340E29586554j058877m99666m93169q54671j173794j222133j169444j243770j388669
$$ 529586554 528527677 528028011 527534842 526680171 525506377 524284244 523114800 521871030 520482361
1358.3E20482361j505613j579285j341760p99537l67879j4246M74930J066506J529336
$$ 520482361 518976748 517397463 516055703 515256166 514888287 514874041 515348971 516415477 517944813
1376.7E17944813J738250J711428J845777K648890L793776M125238L433704K536297
$$ 517944813 519683063 521394491 523240268 525889158 529682934 533808172 537241876 539778173
1393E39778173J508057N15759j74224o15120j008570j600147j943588j769483j483321
$$ 539778173 541286230 541801989 541627765 541012645 540004075 538403928 536460340 534690857 533207536
1411.4E33207536j238644r35078p78198p95722l48449K84612N30601O30676P98703
$$ 533207536 531968892 531033814 530255616 529459894 529111445 529396057 529926658 530557334 531356037
1429.7E31356037J082360J487434J740337J488566J142800J191020J211941R03845
$$ 531356037 532438397 533925831 535666168 537154734 538297534 539488554 540700495 541604340
1446E41604340J03176q41141j285911j250982j556575k023936j072049L19839J773715
$$ 541604340 541707516 540866375 539580464 538329482 536772907 534748971 533676922 533996761 535770476
1464.4E35770476L366470M775822O416679Q425355Q896112Q263886Q100927Q123100
$$ 535770476 539136946 543912768 550329447 558754802 567650914 575914800 584015727 592138827
1480.7E92138827P896125P272184P018268P101000O670653N629838N233884N296111
$$ 592138827 600034952 607307136 614325404 621426404 628097057 633726895 638960779 644256890
1497F44256890M769742M304886M263818M700780M671753L155291K663314L114939L390610
$$ 644256890 649026632 653331518 657595336 662296116 666967869 670123160 672786474 675901413 679292023
1515.4F79292023L263593K864778K624571K461136K448916K379477K074957K086163
$$ 679292023 682555616 685420394 688044965 690506101 692955017 695334494 697409451 699495614
1531.7F99495614K155304K136826K451778K674162J743495J082003J276017J657366
$$ 699495614 701650918 703787744 706239522 708913684 710657179 711739182 713015199 714672565
1548G14672565J851857J691461J633346J911282K105773J097083M22060O72222R23693
$$ 714672565 716524422 718215883 719849229 721760511 723866284 724963367 725385427 726057649 726981342
1566.4G26981342J073718J010001Q63075P12216J52111k17676J8596M4048k65777p45296
$$ 726981342 728055060 729065061 729928136 730640352 730792463 730574787 730593383 730637431 730371654 729626358
1586.8G29626358j121819j280308j385272j763761k357960k850771l147065l287435
$$ 729626358 728504539 727224231 725838959 724075198 721717238 718866467 715719402 712431967
1603.1G12431967l500461l956139m630685m958630m709661n022585o117046n505979
$$ 712431967 708931506 704975367 700344682 695386052 690676391 685653806 679536760 674030781
1619.4F74030781m722238n211115n111992m609644m369498l630459k996445l246307
$$ 674030781 669308543 664097428 658985436 654375792 650006294 646375835 643379390 640133083
1635.7F40133083k846241j683831q43346j02699N25951J004696J504779K226829K506018
$$ 640133083 637286842 635603011 634759665 634656966 635182917 636187613 637692392 639919221 642425239
1654.1F42425239K075732K477109L314019L901004L978491L859878M300236M768372
$$ 642425239 644500971 646978080 650292099 654193103 658171594 662031472 666331708 671100080
1670.4F71100080M532516M623175M725873M410267M516244N066156N432785M421651
$$ 671100080 675632596 680255771 684981644 689391911 693908155 698974311 704407096 708828747
1686.7G08828747L743768L942609M033506M424274M480421L853262L476500K969444
$$ 708828747 712572515 716515124 720548630 724972904 729453325 733306587 736783087 739752531
1703G39752531K856672K888858K601087K526284K681970K832592K623200J904011J543999
$$ 739752531 742609203 745498061 748099148 750625432 753307402 756139994 758763194 760667205 762211204
1721.4G62211204J629173J776934J934111K108753K070367J719237J199007J235365
$$ 762211204 763840377 765617311 767551422 769660175 771730542 773449779 774648786 775884151
1737.7G75884151J562238J569033J423657J437962J584709J535773J203179J002312
$$ 775884151 777446389 779015422 780439079 781877041 783461750 784997523 786200702 787203014
1754G87203014J002490J015723J110673J132548R89139R92537J039624J038194R45806
$$ 787203014 788205504 789221227 790331900 791464448 792453587 793446124 794485748 795523942 796469748
1772.4G96469748P20441O42717O96779O99222P32004Q02636Q01385Q76427R00626O46591
$$ 796469748 797190189 797832906 798529685 799228907 799960911 800763547 801564932 802441359 803341985 803988576
1792.8H03988576N12659P05302Q04961O43611M74214N64814P65085P79689N68866L90947
$$ 803988576 804501235 805206537 806011498 806655109 807129323 807694137 808459222 809238911 809807777 810198724
1813.2H10198724M61996O12557O89268P04646O36816M90904M76777M93706L12745K21789
$$ 810198724 810660720 811273277 811962545 812667191 813304007 813794911 814271688 814765394 815078139 815299928
1833.6H15299928K49386K58267L84808N85556M56988L5108r9004J9312J71960K69770
$$ 815299928 815549314 815807581 816192389 816777945 817234933 817270041 817171037 817190349 817362309 817632079
1854H17632079K44439J38879J07824K04087L63588M53770K71738k4736J3769K32875
$$ 817632079 817876518 818015397 818123221 818327308 818690896 819144666 819416404 819391668 819405437 819638312
1874.4H19638312K97189K58386K16067K21490L18945M31478L94821K10166J40786J80125
$$ 819638312 819935501 820193887 820409954 820631444 820950389 821381867 821776688 821986854 822127640 822307765
1894.7H22307765J61231J44482J62005J34289J23084J82152J86324Q9168N6565J67966
$$ 822307765 822468996 822613478 822775483 822909772 823032856 823215008 823401332 823490500 823547065 823715031
1915.1H23715031K08140R8764O9440Q9407L4928K1279O6876J01805J16348J04309J11043
$$ 823715031 823923171 824021935 824091375 824180782 824215710 824236989 824303865 824405670 824522018 824626327 824737370
1937.6H24737370J98305K38180J35898Q1361J10447J44422K07961K43664K09093J62542
$$ 824737370 824935675 825173855 825309753 825391114 825501561 825645983 825853944 826097608 826306701 826469243
1958H26469243J54852J81735K13921J83225J06394J00017J43528J39057J17183J06454
$$ 826469243 826624095 826805830 827019751 827202976 827309370 827409387 827552915 827691972 827809155 827915609
1978.4H27915609P8440O2644P9334J13487J14024N2273l2604n2035J491K0146m8399
$$ 827915609 827994049 828056693 828136027 828249514 828363538 828415811 828383207 828331172 828332663 828352809 828304410
2000.8H28304410j29819j44660j35720j58489k22623k84672l04103l18348l44038l62039
$$ 828304410 828174591 828029931 827894211 827735722 827513099 827228427 826924324 826605976 826261938 825899899
2021.2H25899899l80099m17232m32134m08649l97325m17650m35412m22001l58283k66433
$$ 825899899 825519800 825102568 824670434 824261785 823864460 823446810 823011398 822589397 822231114 821964681
2041.6H21964681k21550k63870l25024k65241j06215J013J1563L040J1265M8161J23680
$$ 821964681 821743131 821479261 821154237 820888996 820782781 820783794 820795357 820798397 820809662 820857823 820981503
2064H20981503J28269N2213J491J5318R4533J61946J38163Q4400P0930R5546J56939
$$ 820981503 821109772 821161985 821163476 821178794 821273327 821435273 821573436 821657836 821728766 821824312 821981251
2086.5H21981251J86503J43767Q4340O1155J12891J96457K13444J66416J19448J18673
$$ 821981251 822167754 822311521 822395861 822457016 822569907 822766364 822979808 823146224 823265672 823384345
2106.9H23384345J59144J76132J36554N0604n483M2438J30117J50800P7844k5332n7996
$$ 823384345 823543489 823719621 823856175 823906779 823901296 823943734 824073851 824224651 824302495 824277163 824219167
2129.3H24219167L278P2480P1823R835j6212M1723R8884R3937N8293M3512P4505J37032
$$ 824219167 824222445 824294925 824366748 824376583 824360371 824402094 824500978 824594915 824653208 824696720 824771225 824908257
2153.8H24908257K11536K71023K87473K81453K91228L45707M30286M90666M73380M06384
$$ 824908257 825119793 825390816 825678289 825959742 826250970 826596677 827026963 827517629 827991009 828397393
2174.2H28397393M14431N02467N67258N38230M58062M37498M72188N12421N14447M57645
$$ 828397393 828811824 829314291 829881549 830419779 830877841 831315339 831787527 832299948 832814395 833272040
2194.6H33272040L95417L80457M44412N45084N50032M64857M20093M20451M33326M70161
$$ 833272040 833667457 834047914 834492326 835037410 835587442 836052299 836472392 836892843 837326169 837796330
2215H37796330M64917L90887L42846L62873M06742M16100L57807K80916K52247K57254
$$ 837796330 838261247 838652134 838994980 839357853 839764595 840180695 840538502 840819418 841071665 841328919
2235.4H41328919K65181K82347K64466K03967J79649K19821K71619K72095K22266J93655
$$ 841328919 841594100 841876447 842140913 842344880 842524529 842744350 843015969 843288064 843510330 843703985
2255.8H43703985K17438K47419K65896K60651K25663J94729K18451L09050L51846K73526
$$ 843703985 843921423 844168842 844434738 844695389 844921052 845115781 845334232 845643282 845995128 846268654
2276.1H46268654J91688K04027K71142L06248K34843J10268N4121O5685R9718J15335
$$ 846268654 846460342 846664369 846935511 847241759 847476602 847586870 847640991 847706676 847806394 847921729
2296.5H47921729M7803n8174r4354q6069r4116j13309j52289j98484k01881k24232
$$ 847921729 847969532 847911358 847817004 847730935 847636819 847523510 847371221 847172737 846970856 846746624
2316.9H46746624k90931l27408l46959l47256l12329k55465k29180k66910l17633l32057
$$ 846746624 846455693 846128285 845781326 845434070 845121741 844866276 844637096 844370186 844052553 843720496
2337.3H43720496k92182k06650K146M49002P05779K38716n95510j112342j154959j037836
$$ 843720496 843428314 843221664 843223810 843672812 844378591 844617307 844021797 842909455 841754496 840716660
2357.7H40716660o37174j16408K68519N87225P50363P28429P17222Q05080Q53360P49111
$$ 840716660 840079486 839963078 840231597 840818822 841569185 842297614 843014836 843819916 844673276 845422387
2378.1H45422387N89550M60863L46601K35915J26243k9743k06292k66909j64450m0769
$$ 845422387 846011937 846472800 846819401 847055316 847181559 847151816 846945524 846678615 846514165 846473396
2398.5H46473396o4075k24769l79622l98398k80320j68145k14398m00007n07652m27902
$$ 846473396 846409321 846184552 845804930 845406532 845126212 844958067 844743669 844343662 843836010 843408108
2418.9H43408108k92957k46525l48985n51343o26981m82440l26038l38971m98474o55174
$$ 843408108 843115151 842868626 842519641 841968298 841341317 840858877 840532839 840193868 839695394 839040220
2439.3H39040220o52611m82440l33786l90113n85317o69003n46873l56853k97784m31180
$$ 839040220 838387609 837905169 837571383 837181270 836595953 835926950 835380077 835023224 834725440 834294260
2459.7H34294260n71013n50628l91602k31624k62141m76301o12795n00620k71022j82569
$$ 834294260 833723247 833172619 832781017 832549393 832287252 831810951 831198156 830697536 830426514 830243945
2480.1H30243945k93493m49598m68075l04520j27018j34051k99394m02212l25322j35780
$$ 830243945 829950452 829500854 829032779 828728259 828601241 828467190 828167796 827765584 827440262 827304482
2500.5H27304482k5868j21236l18587m10854k79189p5280n8890k74241m97937m98593
$$ 827304482 827278614 827157378 826838791 826427937 826148748 826073468 826014578 825740337 825242400 824743807
2520.9H24743807l06129j44363k09510m75347o75082n97537l70681k80082m18186o42538
$$ 824743807 824437678 824293315 824083805 823608458 822933376 822335839 821965158 821685076 821266890 820624352
2541.3H20624352p25508n64516l38912l09050n05805p10010o70970l96609k36452m24445
$$ 820624352 819898844 819334328 818995416 818686366 818180561 817470551 816799581 816402972 816166520 815742075
2561.7H15742075o95884p31647n26964k77877k17378m21226o81818o72042l95418j81198
$$ 815742075 815046191 814314544 813787580 813509703 813292325 812871099 812189281 811517239 811121821 810940623
2582.1H10940623k51531n13137o52492m78744j87636r2208k62857n39720o17325l87192
$$ 810940623 810689092 810175955 809523463 809044719 808857083 808764875 808502018 807962298 807344973 806957781
2602.5H06957781j58012k36034n53191q14557q03590n83052m63486o46293r61185j075863
$$ 806957781 806799769 806563735 806010544 805195987 804392397 803809345 803345859 802699566 801738381 800662518
2622.9H00662518r13740p39216q22843j107156j323938j302839j048684q31604r43660
$$ 800662518 799748778 799009562 798186719 797079563 795755625 794452786 793404102 792572498 791628838
2641.2G91628838j238466j340925j147569q66592p91549j016259j284540j285553j035690
$$ 791628838 790390372 789049447 787901878 787035286 786243737 785227478 783942938 782657385 781621695
2659.6G81621695q07763p87019r91881j220525j138806p93993o13690p69198r97841
$$ 781621695 780813932 780026913 779035032 777814507 776675701 775881708 775268018 774498820 773500979
2677.9G73500979j031935q35598n79953n52475p98166j010597r67741p64728o28948
$$ 773500979 772469044 771633446 771053493 770501018 769702852 768692255 767724514 766959786 766330838
2696.3G66330838p39634j043260j220584j073420q22067p81834r77874j207054j235962
$$ 766330838 765591204 764547944 763327360 762253940 761431873 760650039 759672165 758465111 757229149
2714.6G57229149r90748p46012p93934j039683j205385j098097q07106o55592p88688
$$ 757229149 756238401 755492389 754698455 753658772 752453387 751355290 750548184 749892592 749103904
2733G49103904j000822j040101q64208o56545o58035q31008r53019q76903o37174m72724
$$ 749103904 748103082 747062981 746198773 745542228 744884193 744053185 743100166 742223263 741586089 741113365
2753.4G41113365n49674p74503q86381p28607m54426l52800n53608q75830r62734p36297
$$ 741113365 740563691 739789188 738902807 738174200 737719774 737366974 736813366 735937536 734974802 734238505
2773.8G34238505n39660o46472r34720j128137j087308r25183q91269j082599j366317
$$ 734238505 733698845 733052373 732117653 730989516 729902208 728977025 728085756 727003157 725636840
2792.2G25636840j501739j395822j249253j324475j628399j885235j888633j738608
$$ 725636840 724135101 722739279 721490026 720165551 718537152 716651917 714763284 713024676
2808.5G13024676j671255j823962k111792k276778k206445k087832k137541k360881
$$ 713024676 711353421 709529459 707417667 705140889 702934444 700846612 698709071 696348190
2824.8F96348190k597034k666056k573371k532243k671302k942383l195644l273785
$$ 696348190 693751156 691085100 688511729 685979486 683308184 680365801 677170157 673896372
2841.1F73896372l199339l196060l425777l712654l732264l523589l384709l491640
$$ 673896372 670697033 667500973 664075196 660362542 656630278 653106689 649721980 646230340
2857.4F46230340l861010m334748m722476n016029n330562n724192o093323o268084
$$ 646230340 642369330 638034582 633312106 628296077 622965515 617241323 611148000 604879916
2873.7F04879916o145060n747617n222439m647315m002809l297687k523542j752674
$$ 604879916 598734856 592987239 587764800 583117485 579114676 575816989 573293447 571540773
2890.1E71540773j182079r09925q26299p79152p72297r02772j210809j671374k168715
$$ 571540773 570358694 569448769 568622470 567843318 567071021 566168249 564957440 563286066 561117351
2908.4E61117351k580404k946854l368914l742337l789008l463983k942145k268613
$$ 561117351 558536947 555590093 552221179 548478842 544689834 541225851 538283706 536015093
2924.7E36015093j466572o66022J46150J127482K234161L231048L978312M578889N162656
$$ 536015093 534548521 533882499 534028649 535156131 537390292 540621340 544599652 549178541 554341197
2943.1E54341197N639493N930067O114602O230414O238043O194770O191015O141186
$$ 554341197 559980690 565910757 572025359 578255773 584493816 590688586 596879601 603020787
2959.4F03020787N900085N509377N161404M971981M879952M783392M612684M372180
$$ 603020787 608920872 614430249 619591653 624563634 629443586 634226978 638839662 643211842
2975.7F43211842M231035M205764M079580L786802L401518L042817K807617K576709
$$ 643211842 647442877 651648641 655728221 659515023 662916541 665959358 668766975 671343684
2992F71343684K207101J736521J218200P69317N03838K63334q9527m79400q11338j073837
$$ 671343684 673550785 675287306 676505506 677274823 677778661 678041995 677952468 677473068 676661730 675587893
3012.4F75587893j319707j558661j825273k115906k280473k318025k383292k485215
$$ 675587893 674268186 672709525 670884252 668768346 666487873 664169848 661786556 659301341
3028.7F59301341k604127k737880k836526k874910k865792k919316l108203l310442
$$ 659301341 656697214 653959334 651122808 648247898 645382106 642462790 639354587 636044145
3045.1F36044145l344417l201246l122330l249824l400922l441572l400564l313065
$$ 636044145 632699728 629498482 626376152 623126328 619725406 616283834 612883270 609570205
3061.4F09570205l259778l318846l480911l584206l506124l355563l237724l243864
$$ 609570205 606310427 602991581 599510670 595926464 592420340 589064777 585827053 582583189
3077.7E82583189l416777l524720l466308l459096l488064l465355l504157l496289
$$ 582583189 579166412 575641692 572175384 568716288 565228224 561762869 558258712 554762423
3094E54762423l335357l219068l298461l446341l419041l194094l061950l206134l297150
$$ 554762423 551427066 548207998 544909537 541463196 538044155 534850061 531788111 528581977 525284827
3112.4E25284827l104866k952933l007054l200949l432393l410518l138184k935827
$$ 525284827 522179961 519227028 516219974 513019025 509586632 506176114 503037930 500102103
3128.7E00102103k926857k995103k962232k800852k704978k827942k963633k892702
$$ 500102103 497175246 494180143 491217911 488417059 485712081 482884139 479920506 477027804
3145D77027804k734542k559126k392798k471209k738744k810210k663106k483427k358228
$$ 477027804 474293262 471734136 469341338 466870129 464131385 461321175 458658069 456174642 453816414
3163.4D53816414k334237k375245k386719k310098k200990k119333k095401k116233
$$ 453816414 451482177 449106932 446720213 444410115 442209125 440089792 437994391 435878158
3179.7D35878158k110184k039104j969904j960427j955628j926690j894504j830518
$$ 435878158 433767974 431728870 429758966 427798539 425842911 423916221 422021717 420191199
3196D20191199j731217j698882j728296j710862j638621j573175j531333j498073j486987
$$ 420191199 418459982 416761100 415032804 413321942 411683321 410110146 408578813 407080740 405593753
3214.3D05593753j470447j421749j377970j366675j364768j344502j256197j064837
$$ 405593753 404123306 402701557 401323587 399956912 398592144 397247642 395991445 394926608
3230.7C94926608r76354j199097j396686j283377j108140r81629q72522r12160j068383
$$ 394926608 393950254 392751157 391354471 390071094 388962954 387981325 387108803 386196643 385128260
3249C85128260j090110r39339q27164q51094q84563q51750q14647p48902o04988m77939
$$ 385128260 384038150 383098811 382271647 381420553 380535990 379684240 378869593 378120691 377515703 377037764
3269.4C77037764o12021q79019r03696p98017p60674p62523p44879o92040o37650n33849
$$ 377037764 376425743 375546724 374643028 373845011 373084337 372321814 371576935 370884895 370247245 369713396
3289.8C69713396m80741o38158q44836r24617q30173o03974m60834n82963q98748j138449
$$ 369713396 369232655 368594497 367749661 366825044 365994871 365390897 364930063 364347100 363448352 362309903
3310.2C62309903j120985r65237q94666r00835r02384q50857p85321r09865j099139
$$ 362309903 361188918 360223681 359329015 358428180 357525796 356674939 355889618 354979753 353880614
3328.6C53880614j092762j024037r52095q32945q98630j123547j205653j164109j040190
$$ 353880614 352787852 351763815 350811720 349978775 349080145 347956598 346750945 345586836 344546646
3346.9C44546646q91835j038342j357168j398444j210422j048267j054346j118660
$$ 344546646 343654811 342616469 341259301 339860857 338650435 337602168 336547822 335429162
3363.2C35429162r69112q14736j019329j418412j501739j219779r99957r51290r79483
$$ 335429162 334460050 333645314 332625985 331207573 329705834 328486055 327486098 326534808 325555325
3381.6C25555325r86696q90344o65695l92139m43339q09580q88944n32150k84612n89311
$$ 325555325 324568629 323678285 323012590 322620451 322177112 321367532 320478588 319946438 319661826 319072515
3402C19072515r93252q45313n07951m28796m63098n27382n69075m55410l20881l03328
$$ 319072515 318079263 317233950 316725999 316297203 315834105 315306723 314737648 314282238 313961357 313658029
3422.4C13658029k41697p8112O0201M9442M1097J37687N4777k02895k43723o735K47568
$$ 313658029 313416332 313338220 313398421 313447863 313488960 313626647 313681424 313478529 313234806 313228071 313475639
3444.8C13475639L21716K32696K33472L50386M40835N16803N98102N50330N07265P59960
$$ 313475639 313797355 314030051 314263523 314613909 315054744 315571547 316169649 316719979 317227244 317987204
3465.2C17987204R76562P01428K29835J89245N21481Q27521Q26925N48243N16832P54416
$$ 317987204 318963766 319665194 319895029 320084274 320605755 321433276 322260201 322808444 323325276 324079692
3485.6C24079692P64072O28800O75380P92473Q74162Q97318Q81910Q57324P03961N74082
$$ 324079692 324843764 325472564 326147944 326940417 327814579 328711897 329593807 330451131 331155092 331729174
3506C31729174O74694Q82566J062662J031041Q36104Q33094J059652J286149J196563
$$ 331729174 332403868 333286434 334349096 335380137 336216241 337049335 338108987 339395136 340591699
3524.4C40591699R07719Q65698J062244J278460J432449J372069J198083J347929J665265
$$ 340591699 341499418 342365116 343427360 344705820 346138269 347510338 348708421 350056350 351721615
3542.7C51721615J664161J329303J204073J418740J568347J643032J809567J996577
$$ 351721615 353385776 354715079 355919152 357337892 358906239 360549271 362358838 364355415
3559C64355415K080202K044082J971394K090513K330244K390832K394825K519101K689391
$$ 364355415 366435617 368479699 370451093 372541606 374871850 377262682 379657507 382176608 384865999
3577.4C84865999K896607L132194L251553L143638K960205L094137L304154L394663
$$ 384865999 387762606 390894800 394146353 397289991 400250196 403344333 406648487 410043150
3593.7D10043150L532231L695637L747582L762931L876627L901690L892958M005343
$$ 410043150 413575381 417271018 421018600 424781531 428658158 432559848 436452806 440458149
3610D40458149M093110M156143M123151M003286M124642M235953M214138M080087L869623
$$ 440458149 444551259 448707402 452830553 456833839 460958481 465194434 469408572 473488659 477358282
3628.4D77358282M119157M340738M231930M145980M157722M252583M386604M445195
$$ 477358282 481477439 485818177 490050107 494196087 498353809 502606392 506992996 511438191
3644.7E11438191M290938M019082L995120M072130L930330L997267M199207M009902
$$ 511438191 515729129 519748211 523743331 527815461 531745791 535743058 539942265 543952167
3661E43952167L748477L859937L903269L587604L645957L602504K911330K837956L227353
$$ 543952167 547700644 551560581 555463850 559051454 562697411 566299915 569211245 572049201 575276554
3679.4E75276554L307283L425836L469408L107786K439141K249956K517462K628148
$$ 575276554 578583837 582009673 585479081 588586867 591026008 593275964 595793426 598421574
3695.7E98421574K576351K388298K115786K162338K454161K499342K086640J604199
$$ 598421574 600997925 603386223 605502009 607664347 610118508 612617850 614704490 616308689
3712F16308689J847386K178669K070368J817882J628816J513422J551270J886845K093911
$$ 616308689 618156075 620334744 622405112 624222994 625851810 627365232 628916502 630803347 632897258
3730.3F32897258J950979J495719J138389J531601J952410J384795P05063J391530
$$ 632897258 634848237 636343956 637482345 639013946 640966356 642351151 643056214 644447744
3746.7F44447744J567781P15375P73907J525759J612008J210928J153052J371324J304567
$$ 644447744 646015525 646730900 647504807 649030566 650642574 651853502 653006554 654377878 655682445
3765F55682445J137316R18329Q50141J156568J383007J293719R96947Q79824R21786
$$ 655682445 656819761 657738090 658588231 659744799 661127806 662421525 663418472 664298296 665220082
3783.4F65220082R18627R78589J060009J117050J092911J058400J198232R24885M48942
$$ 665220082 666138709 667117298 668177307 669294357 670387268 671445668 672643900 673568785 674017727
3801.7F74017727Q17180Q22127M95970R70841J389801J056850O46651R46879P86841
$$ 674017727 674834907 675657034 676153004 677123845 678513646 679570496 680217147 681164026 681950867
3820.1F81950867L88205P45177Q67308P88152P95483Q83222J093149P78914J96934
$$ 681950867 682339072 683084249 683951557 684739709 685535192 686418414 687511563 688290477 688487411
3838.4F88487411L49164O24239P01666R81212J284956J034856k03609n53787P89225
$$ 688487411 688836575 689460814 690162480 691143692 692428648 693463504 693259895 692706108 693495333
3856.8F93495333J202822Q82029N56648N34356P14183M44650K09868L92914N91993
$$ 693495333 694698155 695580184 696136832 696671188 697385371 697830021 698039889 698432803 699024796
3875.2F99024796Q04008O40571M96864O35862M10796M03285N47170K55764L02016P51377
$$ 699024796 699828804 700469375 700966239 701602101 702012897 702416182 702963352 703219116 703521132 704272509
3895.5G04272509Q31127N41806J91152o9201N3644M21703N39541M99785M85242L90410
$$ 704272509 705103636 705645442 705836594 705767393 705821037 706242740 706782281 707282066 707767308 708157718
3915.9G08157718K55823K42591K89738K59877K69889L70384L32117J94847J87040K93791
$$ 708157718 708413541 708656132 708945870 709205747 709475636 709846020 710178137 710372984 710560024 710853815
3936.3G10853815M15564M18424K57373K15590L42786L30508K07782K29061L24309L24666
$$ 710853815 711269379 711687803 711945176 712160766 712503552 712834060 713041842 713270903 713595212 713919878
3956.7G13919878K94089K45452K09689K61248L14354L03627K39372J96516K34425K79427
$$ 713919878 714213967 714459419 714669108 714930356 715244710 715548337 715787709 715984225 716218650 716498077
3977.1G16498077K73108K88070L11136K53856J87755J67429J56105J96099K50280K27153
$$ 716498077 716771185 717059255 717370391 717624247 717812002 717979431 718135536 718331635 718581915 718809068
3997.5G18809068
$$ 718809068
##END=$$ End of the data block
