##TITLE=Comercial - Marcela $$ Begin of the data block
##JCAMP-DX=5.00 $$ ACD/SpecManager v 10.08
##SPECTROMETER/DATA SYSTEM=Alpha
##DATE=24 Oct 2013 10:57:42
##DATA TYPE=INFRARED SPECTRUM
##DATA CLASS=XYDATA
##ORIGIN=
##OWNER=
##NPOINTS=1765
##FIRSTX=399.75695801
##LASTX=3997.56933594
##MAXX=3997.56933594
##MINX=399.75695801
##MAXY=0.84853876
##MINY=0.23030655
##XFACTOR=1.0000000000
##YFACTOR=1.000000000000000e-9
##FIRSTY=0.54157656
##DELTAX=2.03957629
##XUNITS=1/CM
##YUNITS=ARBITRARY UNITS
##XYDATA=(X++(Y..Y))
399.8E41576564n572915k862274k94209P16746J85847l1650R96888K238214J848996
418.1E38802207j095057l338575l290892k222180j572431k058684k965451k927661
434.4E19331276j103282J250267K518356K520144K095282K556324L736437L920436
450.7E36825240K193808o735r66311q64505o36042j355588l016591m158437l722072
469.1E24292767k588928k400756l127873l529906k684295q41498M90427L18467p61628
487.5E09166777j276493p38442l3975k22563j369059k462149k664387k064377j677543
505.8D96657789k423436l800690m559755m235149l558665l515422m030586m047751
522.1D66486335k884984r89527O11246J417488J902193K897977M655213O107002N876392
$$ y = [541576564, 536003649, 533141375, 532847166, 533563912, 533749759, 533718109, 534714997, 536953211, 538802207, 537707150, 534368575, 531077683, 528855503, 527283072, 525224388, 522258937, 519331276, 518227994, 519478261, 521996617, 524516761, 526612043, 529168367, 532904804, 536825240, 539019048, 539012313, 538046002, 537181497, 536545455, 535189867, 532173276, 528014839, 524292767, 521703839, 519303083, 516175210, 512645304, 509961009, 509119511, 509609938, 509928405, 509166777, 507890284, 507151842, 507117867, 506895304, 505526245, 503064096, 500399709, 498335332, 496657789, 494234353, 490433663, 485873908, 481638759, 478080094, 474564672, 470534086, 466486335, 463601351, 462611824, 463223070, 464640558, 466542751, 469440728, 474095941, 480202943, 486079335]
540.5D86079335M105807K115875Q75086K20716o35058j940548l220529l945917m230231
558.8D79424536m606962n547762o808132p536262p168025n755246l736466j554608
575.2D36711073O12974L033191N593866P353455P580012O719142N438060M041105K615154
593.5D79698032J239777J39028n32091n96464j50114L31163N66185Q66234J603365
611.9D83165115K572447L349304L884465M295587M625589M892707N007148M675209
628.2E16467571L713250K720952K240003K094507J982391J640200J072705P78198R77695
646.5E33687472J286328J283109R90570Q49545J064539J426041J560092J275003P06851
664.9E44129550L70622J195014J907110J568198J225114J141787J399636J741826J714230
$$ y = [486079335, 490185142, 492301017, 493176103, 493396819, 492761761, 490821213, 487600684, 483654767, 479424536, 474817574, 469269812, 462461680, 454925418, 447757393, 442002147, 438265681, 436711073, 437324047, 440357238, 445951104, 453304559, 460884571, 467603713, 473041773, 477082878, 479698032, 480937809, 481076837, 480544746, 479948282, 479798168, 480129331, 480695516, 481561750, 483165115, 485737562, 489086866, 492971331, 497266918, 501892507, 506785214, 511792362, 516467571, 520180821, 522901773, 525141776, 527236283, 529218674, 530858874, 531931579, 532709777, 533687472, 534973800, 536256909, 537247479, 538097024, 539161563, 540587604, 542147696, 543422699, 544129550, 544500172, 545695186, 547602296, 549170494, 550395608, 551537395, 552937031, 554678857, 556393087]
683.3E56393087J236677P40528M95434L19898j38104j138210k431333l333807l509820
701.6E48634350l185808k632380j709640k86519J524150L366947M763246N572617O040930
720E62087893O421924O785333O938219O491781N400002M202366L447413L016233K310813
738.3F07101977J036942o38068k218067l395737m272520n172014o138385o671667o360590
756.7E73271871n318106l882169k266527l54826K130032N024075P637739R275973R720385
775E95238447R242714Q374571P629157O999254O091952M866004L937483L831685M432678
793.4F50643945N120277N380094N210281M848241M591942M381299L779114K739727
809.7F86694920J840413J452386J384020J191020M40776p96497j999616k961874l883898
$$ y = [556393087, 557629764, 558370292, 558865726, 559185624, 559047520, 557909310, 555477977, 552144170, 548634350, 545448542, 542816162, 541106522, 540820003, 542344153, 545711100, 550474346, 556046963, 562087893, 568509817, 575295150, 582233369, 588725150, 594125152, 598327518, 601774931, 604791164, 607101977, 608138919, 607500851, 605282784, 601887047, 597614527, 592442513, 586304128, 579632461, 573271871, 567953765, 564071596, 561805069, 561450243, 563580275, 568604350, 576242089, 585518062, 595238447, 604481161, 612855732, 620484889, 627484143, 633576095, 638442099, 642379582, 646211267, 650643945, 655764222, 661144316, 666354597, 671202838, 675794780, 680176079, 683955193, 686694920, 688535333, 689987719, 691371739, 692562759, 693003535, 692207038, 690207422, 687245548, 683361650]
828.1F83361650m974127o214202p247507p539571o965935o097317n345225m689991
844.4F34287775m046381l305614k546549k107978k151608k275586j655221M30524L882527
862.7F20511889P523001J0027945J1067271J0978758R927273P923603N009949J513660
879.1F84483349j885354m619062o433666p409990p854581p887005p424117o504416
895.4F34465158n495727m993439n378723o377697p367074q163095r020090j0075748
911.7E77593565j1043251j1376738j0647893q853436o533026m328013k519428j009465
928E21282315M63605J928806L180445M111230M918814N854606O296993M777848O20664
946.4E53435326n032599j0213554j3825059j6057491j7599553j8940270k0092905k0855963
$$ y = [683361650, 678387523, 672173321, 664925814, 657386243, 650420308, 644322991, 638977766, 634287775, 630241394, 626935780, 624389231, 622281253, 620129645, 617854059, 616198838, 616629362, 620511889, 628034890, 638062835, 649130106, 660108864, 670036137, 677959740, 682969689, 684483349, 682597995, 677978933, 671545267, 664135277, 656280696, 648393691, 640969574, 634465158, 628969431, 623975992, 618597269, 612219572, 604852498, 596689403, 587669313, 577593565, 566550314, 555173576, 544525683, 535672247, 529139221, 524811208, 522291780, 521282315, 521745920, 523674726, 526855171, 530966401, 535885215, 541739821, 548036814, 552814662, 553435326, 548402727, 538189173, 524364114, 508306623, 490707070, 471766800, 451673895, 430817932]
962.7D30817932k1244109k1500796k1837324k2077650k1812141k0823776j9011647
977B82510489j6465604j3459861j0199592o916061l866568j296252N74559J737192
993.3B32618302K359167K641663K763942K673924K225116J446485O32793J48296P6652
1011.6B47586340K89663O37561J073346J587033K206475K886534L407210L597229L464222
1030B66735613L203005K952427K630531K156377J696527J515895J751990K287238K831996
1048.3B87761599L272503L775299M571915N779087P313460Q919508J0334044J0998607
1064.7C42726022R679914N005210k484381r318799j2014180j0322422o530732k732992
1081C14007640K03341K164871L422141M465967N512774O187737N985707M857034L366291
$$ y = [430817932, 409573823, 388073027, 366235703, 344158053, 322345912, 301522136, 282510489, 266044885, 252585024, 242385432, 235469371, 231602803, 230306551, 230881110, 232618302, 234977469, 237619132, 240383074, 243056998, 245282114, 246728599, 247361392, 247509688, 247586340, 247876003, 248513564, 249586910, 251173943, 253380418, 256266952, 259674162, 263271391, 266735613, 269938618, 272891045, 275521576, 277677953, 279374480, 280890375, 282642365, 284929603, 287761599, 291034102, 294809401, 299381316, 305160403, 312473863, 321393371, 331727415, 342726022, 352405936, 357411146, 354926765, 345607966, 333593786, 323271364, 316740632, 314007640, 314210981, 316375852, 319797993, 324263960, 329776734, 335964471, 341950178, 346807212, 350173503]
1099.3C50173503K224237J721829J720965K024591K517134L133625L747999M054189
1115.6C71318072L755719K944022K212584K129078K769411L746420M414439M163474
1132C97453219K789914N06848k343922n314142p788420r156972r210080q271396o899625
1150.3C51765424n519122m282027l015310j481324K33411J939476L588468N300224
1166.6C48529220P295042R617418J1925042J3725966J4747530J5153378J5355259J5399158
1182.9D51748013J4899761J3548285J1471629R182930P164001N482614L945768K547801
1199.3E19990802J657188J684129K548277L667951M509926M979908N277872N521894
1215.6E49837947N464494M684448L154993J450539K30849l50475o45996j021802j447916
$$ y = [350173503, 352397740, 354119569, 355840534, 357865125, 360382259, 363515884, 367263883, 371318072, 375073791, 378017813, 380230397, 382359475, 385128886, 388875306, 393289745, 397453219, 400243133, 400749981, 398406059, 393091917, 385303497, 376146525, 366936445, 358665049, 351765424, 346246302, 341964275, 338948965, 337467641, 337701052, 339640528, 343228996, 348529220, 355824262, 365441680, 377366722, 391092688, 405840218, 420993596, 436348855, 451748013, 466647774, 480196059, 491667688, 500850618, 508014619, 513497233, 517443001, 519990802, 521647990, 523332119, 525880396, 529548347, 534058273, 539038181, 544316053, 549837947, 555302441, 559986889, 563141882, 564592421, 564823270, 564472795, 563826799, 562804997, 561357081]
1233.9E61357081j555324j068413k43843M18842P63893J010120J467467K152264K694428
1252.3E66996515K745747K368868J981258J977444K335250K669692K649069K330244
1268.6E86054087K054333J928926J697063J131118K82347m91560p68482o26982o06775
1287E90654075j024842j649082k019465j968503j730084j591742j565576j428246j060307
1305.3E76616228o51658n00500p46429j306117j869917k180159k353966k726257l504634
1323.7E60776591m438698n011499n023360m631102m053593l399134k666711j859904
1340E29692590j051605n20885n05149q37862j136124j197756j168847j242697j397908
1358.3E20633757j552343j634300j350045p82907l80576m4227M66645J077354J553297
$$ y = [561357081, 559801757, 558733344, 558489501, 558908343, 559672236, 560682356, 562149823, 564302087, 566996515, 569742262, 572111130, 574092388, 576069832, 578405082, 581074774, 583723843, 586054087, 588108420, 590037346, 591734409, 592865527, 593147874, 592656314, 591887832, 591260850, 590654075, 589629233, 587980151, 585960686, 583992183, 582262099, 580670357, 579104781, 577676535, 576616228, 575964570, 575464070, 574717641, 573411524, 571541607, 569361448, 567007482, 564281225, 560776591, 556337893, 551326394, 546303034, 541671932, 537618339, 534219205, 531552494, 529692590, 528640985, 528120100, 527614951, 526777089, 525640965, 524443209, 523274362, 522031665, 520633757, 519081414, 517447114, 516097069, 515314162, 514933586, 514889359, 515356004, 516433358, 517986655]
1376.7E17986655J777470J729489J809537K570689L721833M106939L441691K530754
1393E39675057J492917N15640j27077n40674r81271j618147j942456j746177j466334
1411.4E33261478j234353r56893q36968q29279l23952L03448N48780O56187P99298
1429.7E31387746J061857J435101J668096J512944J224697J212180J199484Q90851
1446E41592956R1433q39233j276791j259685j616538k054572j011431L65675J777589
1464.4E35769403L383934M790962O365240Q335233Q866667Q293271Q138478Q141816
1480.7E92085004P905781P278741O987690P046879O688118N693793N241573N271792
1497F44199371M783273M339576M253983M603386M615903L235519K738059L148734L372848
$$ y = [517986655, 519764125, 521493614, 523303151, 525873840, 529595673, 533702612, 537144303, 539675057, 541167974, 541683614, 541556537, 541015863, 540034592, 538416445, 536473989, 534727812, 533261478, 532027125, 531070232, 530233264, 529403985, 529080033, 529383481, 529932261, 530588448, 531387746, 532449603, 533884704, 535552800, 537065744, 538290441, 539502621, 540702105, 541592956, 541684389, 540845156, 539568365, 538308680, 536692142, 534637570, 533626139, 533991814, 535769403, 539153337, 543944299, 550309539, 558644772, 567511439, 575804710, 583943188, 592085004, 599990785, 607269526, 614257216, 621304095, 627992213, 633686006, 638927579, 644199371, 648982644, 653322220, 657576203, 662179589, 666795492, 670031011, 672769070, 675917804, 679290652]
1515.4F79290652L191173K779425K615630K567709K532661K401054K067029K038300
1531.7F99483633K119541K122820K383947K596676J793445J204073J366436J684487
1548G14755058J830578J652002J597584J819908J942516J154840O11424P52568R34065
1566.4G27050543J070380J024902Q76069O86884J64688j48416N5730N2274k74837p65503
1586.8G29792714j143992j304805j384974j752555k374113k851724l110111l263116
1603.1G12607324l501594l972530m647017m949927m710972n055607o086171n425035
1619.4F74258471m715860n221069n057693m564404m358590l615141k974927l191054
1635.7F40559733k755284j627922q45492j61946M57287J009345J521527K193451K570570
$$ y = [679290652, 682481825, 685261250, 687876880, 690444589, 692977250, 695378304, 697445333, 699483633, 701603174, 703725994, 706109941, 708706617, 710500062, 711704135, 713070571, 714755058, 716585636, 718237638, 719835222, 721655130, 723597646, 724752486, 725363910, 726116478, 727050543, 728120923, 729145825, 730021894, 730708778, 730873466, 730725050, 730780780, 730833054, 730558217, 729792714, 728648722, 727343917, 725958943, 724206388, 721832275, 718980551, 715870440, 712607324, 709105730, 705133200, 700486183, 695536256, 690825284, 685769677, 679683506, 674258471, 669542611, 664321542, 659263849, 654699445, 650340855, 646725714, 643750787, 640559733, 637804449, 636176527, 635331035, 635169089, 635626376, 636635721, 638157248, 640350699, 642921269]
1654.1F42921269K232730K559424L321647L893197L987730L849744M278005M779756
1670.4F71823502M536926M603923M741490M432737M468263M936814N362570M511833
1686.7G09418058L825426L967405M006564M315854M353225L774345L477931L027081
1703G40165889K902031K945066K644181K512455K609909K716481K560377J972497J629829
1721.4G62658715J671613J802444J925647K044261J985669J680970J252234J267731
1737.7G76289284J516819J541496J460433J462578J545549J476645J210451J070857
1754G87574112J041294R96887J063049J097977J004637J006543J026929R94086Q81970
1772.4G96687484P41303P24554P34567O84917P22945Q28505Q36074Q44956Q22544O61671
$$ y = [642921269, 645153999, 647713423, 651035070, 654928267, 658915997, 662765741, 667043746, 671823502, 676360428, 680964351, 685705841, 690138578, 694606841, 699543655, 704906225, 709418058, 713243484, 717210889, 721217453, 725533307, 729886532, 733660877, 737138808, 740165889, 743067920, 746012986, 748657167, 751169622, 753779531, 756496012, 759056389, 761028886, 762658715, 764330328, 766132772, 768058419, 770102680, 772088349, 773769319, 775021553, 776289284, 777806103, 779347599, 780808032, 782270610, 783816159, 785292804, 786503255, 787574112, 788615406, 789612293, 790675342, 791773319, 792777956, 793784499, 794811428, 795805514, 796687484, 797428787, 798153341, 798887908, 799572825, 800295770, 801124275, 801960349, 802805305, 803627849, 804289520]
1792.8H04289520O00695P29978P70510O21140M69804N49256P37906P51853N74410M29749
1813.2H10524821M92513O29306O96004O75559N72383M58658M93348N21600L64721K69174
1833.6H15698087K48075K34782L71635N56052M17650O9857j4186N6564J51158K29120
1854H18018794K06411J35839J60813K53558L46840L93152K30849R835P0810K45631
1874.4H20072532K98083K58326K05696K25961L19302L93808L48687K01821J42873J63197
1894.7H22630286J72556J98602J96576J17302Q3447J54376J88529J24813Q0287J29223
1915.1H24075997J59144J21832J08004P1108J2756M0292Q4877R5248J10090J04368
1935.5H24983716J16766K02775K36630J44422Q7917J09196J57058K22802K40326J95801
$$ y = [804289520, 804890215, 805620193, 806390703, 807011843, 807481647, 808030903, 808768809, 809520662, 810095072, 810524821, 811017334, 811646640, 812342644, 813018203, 813590586, 814049244, 814542592, 815064192, 815428913, 815698087, 815946162, 816180944, 816552579, 817108631, 817526281, 817596138, 817581952, 817638516, 817789674, 818018794, 818225205, 818361044, 818521857, 818775415, 819122255, 819515407, 819746256, 819756091, 819826901, 820072532, 820370615, 820628941, 820834637, 821060598, 821379900, 821773708, 822122395, 822324216, 822467089, 822630286, 822802842, 823001444, 823198020, 823315322, 823398769, 823553145, 823741674, 823866487, 823946774, 824075997, 824235141, 824356973, 824464977, 824536085, 824548841, 824589133, 824674010, 824769258, 824879348, 824983716, 825100482, 825303257, 825539887, 825684309, 825772226, 825881422, 826038480, 826261282, 826501608, 826697409]
1955.9H26697409J49250J57952J96517K01583J63734J11103R8944J37627J55926J22785
1976.3H28192830P4923M4167O6638J15633J35422J19269N3108l0578k5689L3021J9192
1998.8H28797936p2956j48654j44004j09554j35600k37286l15071l12268l06011l34918
2019.2H26681614l59178l83317m22716m33386m06921l90887m24564m53293m15564l41475
2039.6H22650313k69115k37226k80917l21924k33293q0228P868K4795q821l6478L3379
2062H21248353J47461J55211P6353K9147K6107N5253J11819J26004Q1778N6445R4712
2084.4H22208643J71304K03371J63316J09852Q8930J27017J98544K08258J52707J07706
2104.8H23739648J02162J29640J61469J49012O4969J2457P4804J51098J40071M9412
$$ y = [826697409, 826846659, 827004611, 827201128, 827402711, 827566445, 827677548, 827776492, 827914119, 828070045, 828192830, 828267753, 828311920, 828378558, 828494191, 828629613, 828748882, 828801990, 828771412, 828745723, 828778744, 828797936, 828724980, 828576326, 828432322, 828322768, 828187168, 827949882, 827634811, 827322543, 827016532, 826681614, 826322436, 825939119, 825516403, 825083017, 824676096, 824285209, 823860645, 823407352, 822991788, 822650313, 822381198, 822143972, 821863055, 821541131, 821307838, 821227610, 821235478, 821260273, 821251452, 821214974, 821248353, 821395814, 821551025, 821627378, 821656525, 821682632, 821737885, 821849704, 821975708, 822057486, 822113931, 822208643, 822379947, 822583318, 822746634, 822856486, 822945416, 823072433, 823270977, 823479235, 823631942, 823739648, 823841810, 823971450, 824132919, 824281931, 824346900, 824359357, 824434161, 824585259, 824725330, 824774742]
2125.2H24774742l6657n0842j0312N5134R0242M7028j729J6868P4506J05679R0599
2147.7H25155258O2287O1512J05798J81377K51293K76864K87950L29018L91721M62413
2168H27565491N07534M60803L90291M12882M82201N40078N40137M72665M51923M90069
2188.4H32314074N06341N00799M71711M04477L67582M39763N49734N39183M40657M04120
2208.8H36938441M32193M65036M78088M40836L76761L46244L56018L91364M07517L67046
2229.2H40999544L02076K56002K68459L09408K92063K23279J81079J98960K51591K84493
2249.6H43566954K60532K07841J86921K01046K42114K95580K75194J97470J71781K40326
2270H45845759L53157L64423K41995J67668K20001L09109L22342K10941Q1301K5868
$$ y = [824774742, 824738085, 824687243, 824676931, 824732065, 824822307, 824869335, 824867606, 824884474, 824958980, 825064659, 825155258, 825217545, 825279057, 825384855, 825566232, 825817525, 826094389, 826382339, 826711357, 827103078, 827565491, 828073025, 828533828, 828924119, 829337001, 829819202, 830359280, 830899417, 831372082, 831824005, 832314074, 832820415, 833321214, 833792925, 834197402, 834564984, 835004747, 835554481, 836093664, 836534321, 836938441, 837370634, 837835670, 838313758, 838754594, 839131355, 839477599, 839833617, 840224981, 840632498, 840999544, 841301620, 841557622, 841826081, 842135489, 842427552, 842650831, 842831910, 843030870, 843282461, 843566954, 843827486, 844035327, 844222248, 844423294, 844665408, 844960988, 845236182, 845433652, 845605433, 845845759, 846198916, 846563339, 846805334, 846973002, 847193003, 847502112, 847824454, 848035395, 848116696, 848142564]
2290.4H48142564M0949J17004J60873P7366o2763j17898r5249p0452o4433j34706k18273
2312.9H47774982j98543k09331l05534l67879l75331l59356l51846l10302k22683k21133
2333.3H44853044l24369l41773k65896k02656K0385M91917O94275K17676n47052j047015
2353.6H43548536j189410j101017o09279p0870K59757N62668O96838O58810P25925
2372H43481958Q77857Q97825P55072N88774M44472L24011K34008J31547j5676j84595
2392.4H47535253k71440j97351p4565o3718j91331l66389m07100k57433j37627k23100
2412.8H45345199m17828n09620m21226k88427k66612l93688n74410o14703m82380l45052
2433.2H41031253l32296m67777o19590o01769m42266l62873m59969o15299o65903n40555
$$ y = [848142564, 848183513, 848300517, 848461390, 848538756, 848475993, 848358095, 848262846, 848192394, 848127961, 847993255, 847774982, 847576439, 847367108, 847061574, 846693695, 846318364, 845959008, 845607162, 845296860, 845074177, 844853044, 844528675, 844186902, 843921006, 843718350, 843738735, 844230652, 844924927, 845142603, 844595551, 843548536, 842359126, 841258109, 840648830, 840577960, 840837717, 841400385, 842097223, 842756033, 843481958, 844359815, 845257640, 846012712, 846601486, 847045958, 847369969, 847603977, 847735524, 847719848, 847535253, 847263813, 847066462, 846991897, 846928179, 846736848, 846370459, 845963359, 845705926, 845568299, 845345199, 844927371, 844417751, 843996525, 843708098, 843441486, 843047798, 842473388, 841858685, 841376305, 841031253, 840698957, 840231180, 839611590, 839009821, 838567555, 838204682, 837744713, 837129414, 836463511, 835922956]
2453.6H35922956l54588l00884m14431n65767n92828m24504k23816k35200m44889n85615
2474H31780434m85421k75731k00629l12567m64379m66884k93314j21117j06692k59817
2494.4H28793883m12821l69907j53959p629j05202l17216m04120k78115q3327n3108
2514.8H26608479k44558m70996m99010l17275j62602k35021m65929o30558n69284l60846
2535.2H22652400k69413m21465o88851p92324n76556k93732k89738n21004p09713o78002
2555.6H17411602m31180k44201l83496o56068p16448n09381k64645k54631m86195p08103
2576H12757254o50585l65377j83105k71618n18680o47247m72903j64986o4075k64048
2596.4H09154630n37277o04331m09365j90198k42531n56112q20696p85947n44190m29750
$$ y = [835922956, 835568368, 835267484, 834853053, 834287286, 833694458, 833269954, 833046138, 832810938, 832366049, 831780434, 831295013, 831019282, 830818653, 830506086, 830041707, 829574823, 829281509, 829160392, 829053700, 828793883, 828381062, 828011155, 827857196, 827849567, 827744365, 827427149, 827023029, 826744914, 826661587, 826608479, 826363921, 825892925, 825393915, 825076640, 824914038, 824679017, 824213088, 823582530, 823013246, 822652400, 822382987, 821961522, 821272671, 820480347, 819903791, 819610059, 819320321, 818799317, 818089604, 817411602, 816980422, 816736221, 816352725, 815696657, 814980209, 814470828, 814206183, 813951552, 813465357, 812757254, 812106669, 811741292, 811558187, 811286569, 810767889, 810120642, 809647739, 809482753, 809418678, 809154630, 808617353, 808013022, 807603657, 807413459, 807170928, 806614816, 805794120, 805008173, 804463983, 804034233]
2616.8H04034233o23643r64463j115084r50396p47859q04007j075387j305580j282275
2635.1G95165539j027823q43346r73165j256347j340806j140118q74102q17239j035929
2653.5G85856664j284361j266539j012921p97153p90476r86994j178622j111209q25942
2671.8G76602447o34551p41839r77278j042307q53180n83947n27621p68780j030505
2690.2G69442439j009047p60019o04749p46011j070917j233160j057864q07345p73549
2708.5G61379778r61601j208127j245975r79305p24137p88152j072466j252890j136958
2726.9G52010167q35121o37889p43091j007617j085043q74698o24537n91040p88629
2745.2G44822502r84728r18210o26862m32253n42521q04007r12965p24852m15265l35157
$$ y = [804034233, 803410590, 802446127, 801331043, 800380647, 799632788, 798828781, 797753394, 796447814, 795165539, 794137716, 793294370, 792321205, 791064858, 789724052, 788583934, 787709832, 786892593, 785856664, 784572303, 783305764, 782292843, 781495690, 780705214, 779718220, 778539598, 777428389, 776602447, 775967896, 775226057, 774248779, 773206472, 772353292, 771769345, 771241724, 770472944, 769442439, 768433392, 767673373, 767068624, 766322613, 765251696, 764018536, 762960672, 762153327, 761379778, 760418177, 759210050, 757964075, 756984770, 756260633, 755472481, 754400015, 753147125, 752010167, 751175046, 750537157, 749794066, 748786449, 747701406, 746826708, 746202171, 745611131, 744822502, 743837774, 742919564, 742292702, 741860449, 741317928, 740513921, 739600956, 738876104, 738460839, 738125682]
2765.6G38125682n72562q67665r23038p14540n43297o54697r26137j107395j092374
2784G30723977r62317r18388j061142j316190j484870j429618j289010j324236j586855
2802.3G19351351j852274j908660j763165j644611j796126k133608k330840k228260
2818.7G03693807k044976k099335k377391k634942k689243k577722k527117k664745
2835F84078336k931237l161490l238798l209889l238380l458142l734886l772438l549814
2853.3F53783262l368080l484011l876507m357219m758179n052507n366921n756915
2869.7F17762923o098509o244838o129443n758763n238116m667222m032374l312707
2886E76280951k523899j771390j232266r50993q32974p88391p77841q77082j199782
$$ y = [738125682, 737553120, 736685455, 735762417, 735047877, 734504580, 733849883, 732923746, 731816351, 730723977, 729761660, 728843272, 727782130, 726465940, 724981070, 723551452, 722262442, 720938206, 719351351, 717499077, 715590417, 713827252, 712182641, 710386515, 708252907, 705922067, 703693807, 701648831, 699549496, 697172105, 694537163, 691847920, 689270198, 686743081, 684078336, 681147099, 677985609, 674746811, 671536922, 668298542, 664840400, 661105514, 657333076, 653783262, 650415182, 646931171, 643054664, 638697445, 633939266, 628886759, 623519838, 617762923, 611664414, 605419576, 599290133, 593531370, 588293254, 583626032, 579593658, 576280951, 573757052, 571985662, 570753396, 569802403, 568969429, 568181038, 567403197, 566526115, 565326333]
2904.3E65326333j692116k170146k555787k922952l336311l708541l806055l515363
2920.6E41619062k932846k216458j471997o98685J32680J093447K207279L252566M007041
2939E44992089M575730N132138N642057N984604O150961O244660O251454O186128O185293
2957.4E97345114O164491N924642N523920N186677N007803M930318M843712M647553
2973.7F39574230M378199M228711M228831M129171L805936L416359L104806K885580
2990F69751823K646267K240897J726090J215280P69138M78685K62618n0604m22121
3008.3F78618073p45832j061380j371622j598537j824499k113163k302885k339125
3024.7F65261030k378642k468109k580524k707183k821863k895534k876222k881468
$$ y = [565326333, 563634217, 561464071, 558908284, 555985332, 552649021, 548940480, 545134425, 541619062, 538686216, 536469758, 534997761, 534299076, 534431756, 535525203, 537732482, 540985048, 544992089, 549567819, 554699957, 560342014, 566326618, 572477579, 578722239, 584973693, 591159821, 597345114, 603509605, 609434247, 614958167, 620144844, 625152647, 630082965, 634926677, 639574230, 643952429, 648181140, 652409971, 656539142, 660345078, 663761437, 666866243, 669751823, 672398090, 674638987, 676365077, 677580357, 678349495, 678828180, 679090798, 679040194, 678618073, 677872241, 676810861, 675439239, 673840702, 672016203, 669903040, 667600155, 665261030, 662882388, 660414279, 657833755, 655126572, 652304709, 649409175, 646532953, 643651485]
3041F43651485l089547l347516l383398l210604l120184l261805l416299l446877l411293
3059.3F13963962l329814l283381l352762l491163l551662l484785l378868l264845
3075.6E86826682l256678l431619l523171l441751l434002l476679l492058l548860
3092E59221864l525019l365338l235578l279090l445864l464103l236472l087163l230095
3110.3E29353142l297091l056824k909422l041208l274381l459871l409803l141284
3126.6E03763258k919614k928644l054858l037840k840131k713055k817452k918779
3143D80532885k870858k783179k610475k400428k460957k745032k840728k701103k504796
3161.3D56615329k351374k331197k403855k435684k346904k190709k086967k094805
$$ y = [643651485, 640561938, 637214422, 633831024, 630620420, 627500236, 624238431, 620822132, 617375255, 613963962, 610634148, 607350767, 603998005, 600506842, 596955180, 593470395, 590091527, 586826682, 583570004, 580138385, 576615214, 573173463, 569739461, 566262782, 562770724, 559221864, 555696845, 552331507, 549095929, 545816839, 542370975, 538906872, 535670400, 532583237, 529353142, 526056051, 522999227, 520089805, 517048597, 513774216, 510314345, 506904542, 503763258, 500843644, 497915000, 494860142, 491822302, 488982171, 486269116, 483451664, 480532885, 477662027, 474878848, 472268373, 469867945, 467406988, 464661956, 461821228, 459120125, 456615329, 454263955, 451932758, 449528903, 447093219, 444746315, 442555606, 440468639, 438373834]
3177.6D38373834k155930k159417k084255k008021j950293j925827j952320j949966
3193.9D22187805j867473j748145j676917j681178j720220j692057j595050j532018
3210.3D08674747j508743j504928j482129j421809j368165j342922j345247j355559
3226.6C97345245j314044j146257r93937j157582j397401j330853j140475r90242q94040
3244.9C86980414r73075j147032j121223r14305q02547q41737q84771q42870p88927
3263.3C78663927p42256o32584n28008o25700q49605r14245q36313p60615p32094p26402
3283.7C71316105o85722o22838n26726m96001o55025q47399r29713q60155o27994m33028
3304.1C64631504n53876r13084j148015j145244j018673r17554r14186r14276q43018
$$ y = [438373834, 436217904, 434058487, 431974232, 429966211, 428015918, 426090091, 424137771, 422187805, 420320332, 418572187, 416895270, 415214092, 413493872, 411801815, 410206765, 408674747, 407166004, 405661076, 404178947, 402757138, 401388973, 400046051, 398700804, 397345245, 396031201, 394884944, 393891007, 392733425, 391336024, 390005171, 388864696, 387874454, 386980414, 386007339, 384860307, 383739084, 382824779, 382022232, 381180495, 380295724, 379452854, 378663927, 377921671, 377289087, 376761079, 376135379, 375285774, 374371529, 373535216, 372774601, 372042507, 371316105, 370630383, 370007545, 369480819, 368984818, 368329793, 367482394, 366552681, 365692526, 365064532, 364631504, 364077628, 363164544, 362016529, 360871285, 359852612, 358935058, 358020872, 357106596, 356263578]
3322.4C56263578q18461r75520j132816j096099j004964r29505q31306q92729j117617
3340.8C47464561j233935j216978j094162r33141j038402j318544j374811j215965
3357.1C38038623j072913j078129j125663r94862q83847j079172j402914j465500j215935
3375.5C27719688j019656j001776j017540r81391q68052o62506m13268m52727q19415
3393.8C20483357r12518n09888k24351n56142r82165q24869m92900m75258n64366n99325
3414.2C14341575n53370m17143l55541l41684j92672J520Q3655J2428L0368J79857
3434.6C12788993N6148k77520l05682K8014L06517L37154K47001K29508L32624M49568
3455C14192325N50419O04123M97639M88341Q13156J000047O56724K34127K78413N78463
$$ y = [356263578, 355445117, 354469597, 353336781, 352240682, 351235718, 350306213, 349474907, 348582178, 347464561, 346230626, 345013648, 343919486, 342986345, 341947943, 340629399, 339254588, 338038623, 336965710, 335887581, 334761918, 333767056, 332883209, 331804037, 330401123, 328935623, 327719688, 326700032, 325698256, 324680716, 323699325, 322831273, 322168767, 321755499, 321302772, 320483357, 319570839, 319060951, 318836600, 318280458, 317298293, 316473424, 315980524, 315505266, 314940900, 314341575, 313788205, 313371062, 313015521, 312673837, 312481165, 312482685, 312566340, 312578768, 312609136, 312788993, 312845141, 312567621, 312261939, 312289953, 312596470, 312933624, 313180625, 313410133, 313742757, 314192325, 314742744, 315346867, 315844506, 316332847, 317146003, 318146050, 318802774, 319036901, 319315314, 319893777]
3475.4C19893777Q26508Q13753N14745M77255P43627P77245O55711O95139P80493Q37028
3495.8C27015281Q81642R22233R02593O96927N55188O95139R04202J049757J034260
3514.2C34657222Q78900Q77500J093596J308680J201600R25153R14037J078576J229406
3532.5C44164670J417249J452208J280933J374513J673490J639157J297146J250923
3548.8C55550289J510322J645386J680643J784921J943707K057254K077580K040505
3565.1C70290607K143800K363652K394706K361179K532750K771408K968579L192991
3581.5C91019672L315360L133744K905905L149658L417820L443718L550082L741026
3597.8D17676985L795117L832132L975064L947347L867894L981382M118055M221052
$$ y = [319893777, 320720285, 321534038, 322048783, 322526038, 323269665, 324046910, 324702621, 325397760, 326178253, 327015281, 327896923, 328819156, 329721749, 330418676, 330973864, 331669003, 332573205, 333622962, 334657222, 335536122, 336413622, 337507218, 338815898, 340017498, 340942651, 341856688, 342935264, 344164670, 345581919, 347034127, 348315060, 349689573, 351363063, 353002220, 354299366, 355550289, 357060611, 358705997, 360386640, 362171561, 364115268, 366172522, 368250102, 370290607, 372434407, 374798059, 377192765, 379553944, 382086694, 384858102, 387826681, 391019672, 394335032, 397468776, 400374681, 403524339, 406942159, 410385877, 413935959, 417676985, 421472102, 425304234, 429279298, 433226645, 437094539, 441075921, 445193976, 449415028]
3614.1D49415028M221797M076064M113644M241139M279077M122257L867269M143118
3630.4D82479393M396797M313796M243374M186482M206240M362821M455448M212677
3646.7E16857028L852665L987492M218459M001558L987550M221618M049302L789603
3663E48965275L872752L834188L490329L595412L571987K918899K928198L295540L323257
3681.4E79795837L434301L456354L045022K385021K273321K592027K714694K597749
3697.7F02294326K313793K052784K191305K473354K401650J912057J516998J897752
3714F19054019K235353K094448J840174J671434J557767J560807J887322K064884J852691
3732.4F35818899J427531J183867J598299J990020J385391O52492J318991J468539
$$ y = [449415028, 453636825, 457712889, 461826533, 466067672, 470346749, 474469006, 478336275, 482479393, 486876190, 491189986, 495433360, 499619842, 503826082, 508188903, 512644351, 516857028, 520709693, 524697185, 528915644, 532917202, 536904752, 541126370, 545175672, 548965275, 552838027, 556672215, 560162544, 563757956, 567329943, 570248842, 573177040, 576472580, 579795837, 583230138, 586686492, 589731514, 592116535, 594389856, 596981883, 599696577, 602294326, 604608119, 606660903, 608852208, 611325562, 613727212, 615639269, 617156267, 619054019, 621289372, 623383820, 625223994, 626895428, 628453195, 630014002, 631901324, 633966208, 635818899, 637246430, 638430297, 640028596, 642018616, 643404007, 644056499, 645375490, 646844029]
3748.7F46844029O76394R11057J662254J602948J140535J145363J413762J374305J174092
3767.1F57944739Q68320Q39293J225472J421392J266360R46581Q33452R04739R52125
3785.4F67202473J026451J081825J086115J039625J022756J136064Q59738M86314Q90851
3803.8F75832212Q14021M94361J006960J386702J033307O12080Q60035O69777L43502
3822.1F83052957Q24869R64999Q34763Q20756Q90970J071692P64072K01523L41535
3840.5F89768136O41048P47323R85622J249433R25898m30643o50466R30488J345337
3858.8F95512176R28342N39064M98951O64294M03881K57492N04553O80387Q31425O32048
3879.2G01452613M96924O16729L84212L97265N13136K44915L76821P74026P27475M34041
$$ y = [646844029, 647520423, 648431480, 650093734, 651696682, 652837217, 653982580, 655396342, 656770647, 657944739, 658813059, 659652352, 660877824, 662299216, 663565576, 664512157, 665345609, 666250348, 667202473, 668228924, 669310749, 670396864, 671436489, 672459245, 673595309, 674455047, 674941361, 675832212, 676646233, 677140594, 678147554, 679534256, 680567563, 681179643, 682039678, 682709455, 683052957, 683877826, 684842825, 685677588, 686498344, 687389314, 688461006, 689225078, 689426601, 689768136, 690409184, 691156507, 692142129, 693391562, 694317460, 693886817, 693236351, 694166839, 695512176, 696440518, 696979582, 697478533, 698142827, 698546708, 698804200, 699308753, 699989140, 700820565, 701452613, 701949537, 702566266, 702950478, 703347743, 703860879, 704105794, 704482615, 705256641, 705984116, 706418157]
3899.6G06418157J74999n663J67370N05567N40435M65036M78386M06862K88307K79963
3920G09719419K53737J65523K27987L79920L26217J93297K55883L91543M50909L89815
3940.4G12754250K30431K36333L61204K96950K02835K58743K97785K73586K72214K89321
3960.8G15473652K98321K73585K51532K51472K42353K46048K69055K99752K90990K42650
3981.2G18139410K32697K34723K09450K14041K12907J67191J75059K43724
3997.5G19829202
$$ y = [706418157, 706593156, 706587493, 706754863, 707260430, 707800865, 708265901, 708744287, 709151149, 709439456, 709719419, 709973156, 710138679, 710366666, 710746586, 711072803, 711266100, 711521983, 711913526, 712364435, 712754250, 712984681, 713221014, 713582218, 713879168, 714082003, 714340746, 714638531, 714912117, 715184331, 715473652, 715771973, 716045558, 716297090, 716548562, 716790915, 717036963, 717306018, 717605770, 717896760, 718139410, 718372107, 718606830, 718816280, 719030321, 719243228, 719410419, 719585478, 719829202]
##END=$$ End of the data block
