##TITLE=Comercial - Marcela $$ Begin of the data block
##JCAMP-DX=5.00 $$ ACD/SpecManager v 10.08
##SPECTROMETER/DATA SYSTEM=Alpha
##DATE=24 Oct 2013 10:57:42
##DATA TYPE=INFRARED SPECTRUM
##DATA CLASS=XYDATA
##ORIGIN=
##OWNER=
##NPOINTS=1765
##FIRSTX=399.75695801
##LASTX=3997.56933594
##MAXX=3997.56933594
##MINX=399.75695801
##MAXY=0.84936881
##MINY=0.23032770
##XFACTOR=1.0000000000
##YFACTOR=1.000000000000000e-9
##FIRSTY=0.53966105
##DELTAX=2.03957629
##XUNITS=1/CM
##YUNITS=ARBITRARY UNITS
##XYDATA=(X++(Y..Y))
$$ plain form
399.8 539661050 533998668 531276405 531387150 532542944 533048153 533069670 533766806 535664678 537453651
418.1 537453651 536556065 533288538 529817939 527640402 526576161 524694920 521374285 518245339 517051220
436.5 517051220 518115997 520573139 523330808 525828063 528616667 532258630 535915434 538120449
452.8 538120449 538277447 537170470 536212683 535806477 534585953 531450033 527208924 523548901 521023393
471.1 521023393 518641293 515546441 512186110 509644449 508777678 509363711 509918749 509272397 507961750
489.5 507961750 507135391 506971121 506546617 505048931 502704620 500366867 498545170 496732950 493976355
507.9 493976355 490037680 485619247 481555820 477862537 474043101 470038533 466272235 463429451
524.2 463429451 462198913 462686688 464242905 466325015 469298363 473945230 479975969 485802084 490016162
$$ packed form
399.8E39661050n662382k722263J10745J155794N05209K1517O97136J897872J788973
418.1E37453651q97586l267527l470599k177537j064241j881241l320635l128946j194119
436.5E17051220J064777K457142K757669K497255K788604L641963L656804K205015
452.8E38120449J56998j106977r57787m06206j220524l135920m241109l660023k525508
471.1E21023393k382100l094852l360331k541661q66771N86033N55038o46352j310647
489.5E07961750q26359j64270m24504j497686k344311k337753j821697j812220k756595
507.9D93976355l938675m418433m063427l693283l819436m004568l766298k842784
524.2D63429451j230538M87775J556217K082110K973348M646867O030739N826115M214078
$$ plain form
542.5 490016162 492293894 493137717 493204027 492525429 490580946 487318456 483408421 479287833 474731654
560.9 474731654 469146967 462333798 454894036 447792679 442042440 438345760 436822712 437475473 440533489
579.2 440533489 446028054 453298569 460957766 467754215 473149598 477156460 479788691 480969727
595.6 480969727 481021315 480558425 480045855 479845881 480155021 480791390 481719017 483265549 485727817 489077002
616 489077002 493043154 497365266 501972258 506908834 511981964 516685724 520470321 523274779 525537968
634.3 525537968 527660906 529603183 531067729 532048702 532938600 534095705 535484791 536808193 537867010
652.7 537867010 538760126 539768338 541075408 542573214 543836892 544438422 544670522 545965970 548091352
671 548091352 549737751 550945163 552112818 553524613 555160046 556832790 558186710 559004128 559510350
$$ packed form
542.5D90016162K277732Q43823O6310o78598j944483l262490l910035m120588m556179
560.9D74731654n584687o813169p439762p101357n750239l696680j523048O52761L058016
579.2D40533489N494565P270515P659197O796449N395383M006862K632231J181036
595.6D80969727N1588m62890n12570j99974L09140O36369R27627J546532K462268L349185
616D89077002L966152M322112M606992M936576N073130M703760L784597K804458K263189
634.3E25537968K122938J942277J464546R80973Q89898J157105J389086J323402J058817
652.7E37867010Q93116J008212J307070J497806J263678O01530K32100J295448K125382
671E48091352J646399J207412J167655J411795J635433J672744J353920Q17418N06222
$$ plain form
689.4 559510350 559887946 559805036 558682740 556224167 552788973 549151719 545931995 543445051 541875839
707.7 541875839 541524947 542963386 546428323 551376700 557006240 562967598 569300592 576037169 582980156
726.1 582980156 589508891 594962478 599217176 602692425 605731249 608083427 609162688 608516455 606221676
744.4 606221676 602745473 598384678 593074322 586849749 580181539 573872924 568583488 564656913
760.8 564656913 562377214 562068224 564262152 569366992 577073276 586379707 596050620 605191886 613536656
779.1 613536656 621183872 628132045 634164691 639058828 643078566 647011578 651473403 656514347
795.4 656514347 661867261 667108774 671940148 676471412 680773497 684523165 687351167 689307630
811.7 689307630 690792918 692182720 693387806 693794191 692870557 690721333 687732816 683925450 678979218
$$ packed form
689.4E59510350L77596q2910j122296k458573l435194l637254l219724k486944j569212
707.7E41875839l50892J438439L464937M948377N629540N961358O332994O736577O942987
726.1E82980156O528735N453587M254698L475249L038824K352178J079261o46233k294779
744.4F06221676l476203m360795n310356o224573o668210o308615n289436l926575
760.8E64656913k279699l08990K193928N104840P706284R306431R670913R141266Q344770
779.1F13536656P647216O948173O032646M894137M019738L933012M461825N040944
795.4F56514347N352914N241513M831374M531264M302085L749668K828002J956463
811.7F89307630J485288J389802J205086M06385r23634k149224k988517l807366m946232
$$ plain form
830.1 678979218 672688603 665347576 657745361 650751054 644683838 639357209 634593129 630434692
846.4 630434692 627098441 624592125 622512579 620392561 618144214 616498053 616962075 620897114 628466189
864.8 628466189 638523161 649564683 660452425 670314252 678235650 683236361 684689701 682696581
881.1 682696581 678017497 671603084 664160490 656194210 648226917 640788078 634284258 628760278
897.4 628760278 623718500 618345141 612031698 604692519 596490920 587439060 577403069 566408932
913.7 566408932 555028319 544372380 535517514 529011786 524751186 522234678 521165133 521619618
930 521619618 523605704 526823044 530921400 535826504 541664362 547933877 552684247 553285420 548235893
948.4 548235893 537979901 524128199 508075356 490427494 471409887 451306522 430473626
$$ packed form
830.1F78979218o290615p341027p602215o994307o067216n326629m764080m158437
846.4F30434692l336251k506316k079546k120018k248347j646161M64022L935039P569075
864.8F28466189J0056972J1041522J0887742R861827P921398N000711J453340j993120
881.1F82696581m679084o414413p442594p966280p967293p438839o503820n523980
897.4F28760278n041778n373359o313443p339179q201599r051860j0035991j0994137
913.7E66408932j1380613j0655939q854866o505728m260600k516508j069545M54485
930E21619618J986086L217340M098356M905104N837858O269515M750370O01173n049527
948.4E48235893j0255992j3851702j6052843j7647862j9017607k0103365k0832896
$$ plain form
962.7 430473626 409204930 387649089 365795761 343724757 321925521 301186472 282287300
977 282287300 265844345 252350509 242174253 235357687 231586412 230327696 230914414 232645988
993.3 232645988 234982461 237619877 240381122 243039623 245253921 246723294 247406140 247564137 247608468
1011.6 247608468 247867569 248476699 249517873 251090914 253319621 256237984 259652644 263219208 266641229
1030 266641229 269836307 272793978 275424063 277605802 279343516 280891061 282665730 284960270 287773818
1048.3 287773818 291017145 294776797 299354225 305139422 312448084 321351588 331647664 342608571
1064.7 342608571 352252573 357233822 354793191 345568180 333629191 323329896 316797972 314085156
1081 314085156 314287364 316389352 319785684 324309230 329854757 335981876 341883451 346739173 350167811
$$ packed form
962.7D30473626k1268696k1555841k1853328k2071004k1799236k0739049j8899172
977B82287300j6442955j3493836j0176256o816566l771275j258716N86718J731574
993.3B32645988K336473K637416K761245K658501K214298J469373O82846J57997M4331
1011.6B47608468K59101O09130J041174J573041K228707K918363L414660L566564L422021
1030B66641229L195078K957671K630085K181739J737714J547545J774669K294540K813548
1048.3B87773818L243327L759652M577428N785197P308662Q903504J0296076J0960907
1064.7C42608571R644002M981249k440631r225011j1938989j0299295o531924k712816
1081C14085156K02208K101988L396332M523546N545527O127119N901575M855722L428638
$$ plain form
1099.3 350167811 352424771 354123354 355808079 357826233 360351980 363483578 367214352 371233970
1115.6 371233970 374967039 377932698 380162418 382264763 385027200 388798177 393213540 397371352
1132 397371352 400157124 400641203 398289293 393015504 385297000 376187056 366980016 358727425 351882279
1150.3 351882279 346365124 342032790 338987321 337503463 337760478 339710891 343248338 348471940
1166.6 348471940 355724812 365328729 377238423 390941918 405667156 420810759 436157703 451545656
1182.9 451545656 466460168 480050147 491537809 500699878 507863343 513361573 517292380 519810438
1199.3 519810438 521473348 523198664 525794923 529496372 534003615 538977027 544274747 549802601
1215.6 549802601 555245817 559923291 563096464 564554155 564762533 564370930 563703358 562705398 561310470
$$ packed form
1099.3C50167811K256960J698583J684725K018154K525747L131598L730774M019618
1115.6C71233970L733069K965659K229720K102345K762437L770977M415363M157812
1132C97371352K785772M84079k351910n273789p718504r109944r207040q252591o845146
1150.3C51882279n517155m332334l045469j483858K57015J950413L537447N223602
1166.6C48471940P252872R603917J1909694J3703495J4725238J5143603J5346944J5387953
1182.9D51545656J4914512J3589979J1487662R162069P163465N498230L930807K518058
1199.3E19810438J662910J725316K596259L701449M507243M973412N297720N527854
1215.6E49802601N443216M677474L173173J457691K08378l91603o67572r97960j394928
$$ plain form
1233.9 561310470 559804499 558743119 558467686 558865547 559639633 560675740 562174261 564339280 566995442
1252.3 566995442 569688499 572047710 574059010 576067686 578395665 581024647 583657682 586021125
1268.6 586021125 588116288 590057194 591731668 592818797 593085408 592643976 591945648 591331959 590698361
1287 590698361 589681804 588058710 586014569 583997548 582270324 580722749 579196990 577779770 576693952
1305.3 576693952 576029062 575546145 574795842 573447168 571542680 569384277 567079723 564364731 560841560
1323.7 560841560 556395531 551399350 546415269 541818261 537764907 534343898 531649709 529794872
1340 529794872 528805852 528337121 527816355 526931226 525764644 524567008 523416460 522175014 520741463
1358.3 520741463 519155979 517544448 516245663 515475452 515066504 515002906 515473902 516546011 518074870
$$ packed form
1233.9E61310470j505971j061380k75433L97861P74086J036107J498521K165019K656162
1252.3E66995442K693057K359211K011300K008676K327979K628982K633035K363443
1268.6E86021125K095163J940906J674474J087129K66611m41432o98328o13689o33598
1287E90698361j016557j623094k044141k017021j727224j547575j525759j417220j085818
1305.3E76693952o64890m82917p50303j348674j904488k158403k304554k714992l523171
1323.7E60841560m446029m996181m984081m597008m053354l421009k694189j854837
1340E29794872r89020m68731n20766q85129j166582j197636j150548j241446j433551
1358.3E20741463j585484j611531j298785p70211m08948o3598M70996J072109J528859
$$ plain form
1376.7 518074870 519817293 521517098 523327410 525912225 529621899 533702075 537123621 539635181
1393 539635181 541124403 541648328 541510105 540948331 539953530 538342178 536453187 534760475 533290565
1411.4 533290565 532033622 531065941 530222952 529422104 529141486 529453039 529995382 530650079 531450093
1429.7 531450093 532530665 533998311 535665691 537136316 538360298 539618194 540850163 541740000
1446 541740000 541807353 540944815 539653003 538361013 536702573 534663141 533690393 534035146 535751641
1464.4 535751641 539121449 543926835 550249159 558499992 567328215 575633168 583803117 591986597
1480.7 591986597 599913955 607164502 614089310 621096671 627816558 633543670 638748050 643971860
1497 643971860 648781776 653166354 657403111 661903799 666436970 669745147 672582209 675753772 679093003
$$ packed form
1376.7E18074870J742423J699805J810312K584815L709674M080176L421546K511560
1393E39635181J489222N23925j38223n61774r94801j611352j888991j692712j469910
1411.4E33290565j256943r67681q42989q00848k80618L11553N42343O54697Q00014
1429.7E31450093J080572J467646J667380J470625J223982J257896J231969Q89837
1446E41740000O7353q62538j291812j291990j658440k039432r72748L44753J716495
1464.4E35751641L369808M805386O322324Q250833Q828223Q304953Q169949Q183480
1480.7E91986597P927358P250547O924808P007361O719887N727112N204380N223810
1497F43971860M809916M384578M236757M500688M533171L308177K837062L171563L339231
$$ plain form
1515.4 679093003 682272792 685053945 687637031 690200925 692767024 695213556 697344780 699408650
1531.7 699408650 701504171 703626573 705976188 708470225 710266113 711558282 712998629 714733124
1548 714733124 716575921 718195319 719707668 721413851 723298192 724570990 725334406 726142347 727069438
1566.4 727069438 728127301 729169726 730069518 730711043 730810106 730709374 730857670 730966866 730715275
1584.7 730715275 729943573 728773892 727456868 726084352 724356472 722007871 719154716 716029406
1601.1 716029406 712788463 709329903 705395699 700788975 695877969 691189468 686113954 680012763
1617.4 680012763 674659491 670047820 664892435 659858882 655320823 651010096 647425532 644407332
1633.7 644407332 641151249 638458729 636952996 636183143 636041045 636491656 637533307 639078677 641220570
$$ packed form
1515.4F79093003L179789K781153K583086K563894K566099K446532K131224K063870
1531.7F99408650K095521K122402K349615K494037J795888J292169J440347J734495
1548G14733124J842797J619398J512349J706183J884341J272798P63416Q07941R27091
1566.4G27069438J057863J042425Q99792O41525R9063j00732J48296J09196k51591
1584.7G30715275p71702j169681j317024j372516j727880k348601k853155l125310
1601.1G16029406l240943l458560l934204m606724m911006m688501n075514o101191
1617.4F80012763n353272m611671n155385n033553m538059m310727l584564l018200
1633.7F44407332l256083k692520j505733p69853j42098M50611J041651J545370K141893
$$ plain form
1652 641220570 643830359 646216512 648860872 652211726 656129777 660130620 663955808 668180585 672946215
1670.4 672946215 677505255 682093859 686808050 691251516 695737183 700631738 705900490 710383236
1686.7 710383236 714224279 718196452 722155511 726347744 730608523 734371006 737842321 740875542
1703 740875542 743777573 746704936 749345660 751853764 754423678 757067323 759578228 761589825 763293386
1721.4 763293386 764986157 766744673 768614888 770628512 772570848 774170339 775402725 776701450
1737.7 776701450 778227210 779772401 781231463 782677293 784190059 785640299 786867023 787955701
1754 787955701 789001942 790021420 791096151 792179763 793181360 794191360 795195222 796144128 797007799
1772.4 797007799 797781944 798535168 799264491 799952567 800706327 801538229 802348971 803174376 803942263 804544508
$$ packed form
1652F41220570K609789K386153K644360L350854L918051M000843L825188M224777M765630
1670.4F72946215M559040M588604M714191M443466M485667M894555N268752M482746
1686.7G10383236L841043L972173L959059M192233M260779L762483L471315L033221
1703G40875542K902031K927363K640724K508104K569914K643645K510905K011597J703561
1721.4G63293386J692771J758516J870215K013624J942336J599491J232386J298725
1737.7G76701450J525760J545191J459062J445830J512766J450240J226724J088678
1754G87955701J046241J019478J074731J083612J001597J010000J003862R48906Q63671
1772.4G97007799P74145P53224P29323O88076P53760Q31902Q10742Q25405P67887O02245
$$ plain form
1792.8 804544508 805170536 805943966 806718826 807328165 807802558 808377445 809138417 809909940 810487092 810895026
1813.2 810895026 811364472 811980784 812685072 813380837 813951790 814383626 814844370 815345645 815723360 816022336
1833.6 816022336 816282213 816510201 816873908 817422628 817819834 817868054 817852557 817931771 818118393 818380892
1854 818380892 818615258 818752408 818877161 819096506 819436967 819820285 820022941 820033073 820142031 820406854
1874.4 820406854 820693016 820953786 821174681 821377397 821653664 822044849 822420895 822640657 822792172 822982490
1894.7 822982490 823180318 823358715 823531508 823676348 823800445 823956609 824116647 824204683 824258208 824381113
1915.1 824381113 824539244 824659705 824780166 824883103 824924707 824951231 825001240 825104594 825260758 825403154 825517893
1937.6 825517893 825684905 825891674 826021612 826104224 826222420 826386869 826601148 826831341 827028215 827191949
$$ packed form
1792.8H04544508O26028P73430P74860O09339M74393N74887P60972P71523N77152M07934
1813.2H10895026M69446O16312P04288O95765N70953M31836M60744N01275L77715K98976
1833.6H16022336K59877K27988L63707N48720L97206M8220j5497P9214J86622K62499
1854H18380892K34366J37150J24753K19345L40461L83318K02656J0132J08958K64823
1874.4H20406854K86162K60770K20895K02716K76267L91185L76046K19762J51515J90318
1894.7H22982490J97828J78397J72793J44840J24097J56164J60038Q8036N3525J22905
1915.1H24381113J58131J20461TJ02937M1604K6524N0009J03354J56164J42396J14739
1937.6H25517893J67012K06769J29938Q2612J18196J64449K14279K30193J96874J63734
$$ plain form
1958 827191949 827358484 827558756 827796221 827991188 828086853 828163087 828285635 828417301 828527689 828623116
1978.4 828623116 828703105 828797281 828927755 829059720 829150200 829184055 829176605 829177916 829187870 829151452 829071045 828969121
2002.8 828969121 828849733 828732133 828580618 828320503 828001738 827705443 827406704 827079356 826741934 826369107
2023.2 826369107 825925767 825472116 825083911 824737787 824341953 823876679 823426306 823070347 822808921 822581291
2043.6 822581291 822313428 822001278 821765900 821687222 821698129 821705401 821698785 821709454 821757078 821853817 821968138
2066.1 821968138 822050869 822087526 822110832 822197139 822357416 822487652 822552443 822621882 822736979 822912693 823106945
2088.5 823106945 823245227 823338211 823431432 823560953 823758841 823977470 824155152 824288249 824411273 824573398
2108.9 824573398 824759901 824903190 824943423 824929357 824979842 825119376 825269639 825321913 825273216 825232327 825261593
$$ packed form
1958H27191949J66535K00272K37465J94967R5665P6234J22548J31666J10388R5427
1978.4H28623116P9989R4176J30474J31965R0480L3855p450J311R954l6418q0407j01924
2002.8H28969121j19388j17600j51515k60115l18765k96295k98739l27348l37422l72827
2023.2H26369107m43340m53651l88205l46124l95834m65274m50373l55959k61426k27630
2043.6H22581291k67863l12150k35378p8678J0907P272o616J0669M7624R6739J14321
2066.1H21968138Q2731L6657K3306Q6307J60277J30236O4791O9439J15097J75714J94252
2088.5H23106945J38282R2984R3221J29521J97888K18629J77682J33097J23024J62125
2108.9H24573398J86503J43289M0233j4066N0485J39534J50263N2274m8697m0889K9266
$$ plain form
2131.3 825261593 825354517 825450897 825472057 825437605 825446367 825540543 825679123 825799823 825855434 825880647 825978339
2153.8 825978339 826189280 826469839 826764882 827049136 827354670 827737808 828177392 828633368 829086661 829512715
2174.2 829512715 829951644 830466986 831036091 831552863 831981063 832412183 832894564 833382487 833859742 834334731
2194.6 834334731 834770918 835173965 835623324 836155951 836686432 837135196 837551773 838004112 838498056 838992178
2215 838992178 839424610 839790940 840143144 840519249 840924501 841328442 841686666 841985404 842254519 842526376
2235.4 842526376 842795849 843056202 843296409 843495131 843683600 843926132 844205499 844443440 844632268 844854057
2255.8 844854057 845133901 845415294 845686316 845919371 846092105 846273363 846526802 846865654 847212374 847453237
2276.1 847453237 847634196 847880006 848217428 848556459 848771811 848865509 848918736 848989129 849121094 849283040
$$ packed form
2131.3H25261593R2924R6380K1160l4452Q762R4176J38580J20700N5611K5213R7692
2153.8H25978339K10941K80559K95043K84254L05534L83138M39584M55976M53293M26054
2174.2H29512715M38929N15342N69105N16772M28200M31120M82381M87923M77255M74989
2194.6H34334731M36187M03047M49359N32627N30481M48764M16577M52339M93944M94122
2215H38992178M32432L66330L52204L76105M05252M03941L58224K98738K69115K71857
2235.4H42526376K69473K60353K40207J98722J88469K42532K79367K37941J88828K21789
2255.8H44854057K79844K81393K71022K33055J72734J81258K53439L38852L46720K40863
2276.1H47453237J80959K45810L37422L39031K15352R3698N3227P0393J31965J61946
$$ plain form
2296.5 849283040 849368811 849320114 849225223 849179327 849149406 849080443 848944187 848748446 848562956 848400533 848213732
2319 848213732 847940207 847546816 847131610 846776068 846500337 846280575 846032560 845710516 845371783 845114291
2339.4 845114291 844972432 845005631 845404327 846057534 846339107 845888555 844941914 843858242 842787385
2357.7 842787385 842075467 841925561 842185795 842690945 843322992 843991756 844695032 845466375 846272945 847008288
2378.1 847008288 847585142 847982228 848251104 848440349 848539293 848480523 848241627 847974956 847846627 847826004
2398.5 847826004 847764611 847538769 847134888 846722543 846478879 846349597 846149027 845768332 845265090 844821095
2418.9 844821095 844541311 844308674 843918681 843331575 842715025 842239797 841904044 841548502 841047108 840432167
2439.3 840432167 839843392 839398742 839046419 838605225 837976098 837291658 836759090 836409390 836103261 835682929
$$ packed form
2296.5H49283040Q5771m8697r4891m5896k9921o8963j36256j95741j85490j62423j86801
2319H48213732k73525l93391m15206l55542k75731k19762k48015l22044l38733k57492
2339.4H45114291j41859L3199L98696O53207K81573m50552r46641j083672j070857
2357.7H42787385p11918j49906K60234N05150O32047O68764P03276P71343Q06570P35343
2378.1H47008288N76854L97086K68876J89245R8944n8770k38896k66671j28329k0623
2398.5H47826004o1393k25842m03881m12345k43664j29282k00570l80695n03242m43995
2418.9H44821095k79784k32637l89993n87106o16550m75228l35753l55542n01394o14941
2439.3H40432167n88775m44650l52323m41194o29127o84440n32568l49700l06129m20332
$$ plain form
2459.7 835682929 835124731 834568083 834168911 833910584 833616674 833151579 832596600 832159638 831916630 831725776
2480.1 831725776 831394911 830911458 830454290 830190063 830093503 829972446 829664409 829221904 828880250 828770578
2500.5 828770578 828766048 828657448 828350306 827943861 827684999 827643573 827571332 827263772 826799273 826366425
2520.9 826366425 826090395 825933576 825669527 825149596 824500799 823978961 823685765 823425770 822953761 822254717
2541.3 822254717 821517587 820959628 820614159 820296824 819800079 819102764 818443298 818058670 817827344 817403734
2561.7 817403734 816696346 815964758 815485716 815264583 815034986 814545870 813840389 813195884 812809885 812611282
2582.1 812611282 812347054 811839521 811220348 810794771 810627460 810493708 810186565 809670925 809116662 808741331
2602.5 808741331 808535457 808258891 807682157 806871116 806129873 805606961 805157185 804529548 803591847 802501440
$$ packed form
2459.7H35682929n58198n56648l99172k58327k93910m65095n54979m36962k43008j90854
2480.1H31725776l30865m83453m57168k64227r6560j21057l08037m42505l41654j09672
2500.5H28770578m530j08600l07142m06445k58862m1426p2241l07560m64499m32848
2520.9H26366425k76030j56819k64049n19931o48797n21838k93196k59995m72009o99044
2541.3H22254717p37130n57959l45469l17335m96745o97315o59466l84628k31326m23610
2561.7H17403734p07388p31588m79042k21133k29597m89116p05481o44505l85999j98603
2582.1H12611282k64228n07533o19173m25577j67311j33752l07143n15640n54263l75331
2602.5H08741331k05874k76566n76734q11041p41243n22912m49776o27637r37701j090407
$$ plain form
2622.9 802501440 801570415 800840318 800034463 798939347 797607005 796292603 795256853 794454098 793530941
2641.2 793530941 792275786 790901721 789752781 788886309 788063347 787027657 785767734 784540355 783560157
2659.6 783560157 782782137 781990588 780964077 779744923 778660655 777902484 777300358 776534081 775525272
2677.9 775525272 774503946 773695350 773118854 772559583 771759152 770736217 769759476 769022167 768436909
2696.3 768436909 767704368 766634583 765394211 764323473 763516247 762745559 761771142 760559618 759326875
2714.6 759326875 758360863 757639647 756847739 755786777 754560351 753457487 752647519 751989901 751210332
2733 751210332 750218868 749181628 748325467 747711599 747128189 746314526 745317638 744438589 743834198 743373275
2753.4 743373275 742815733 742024302 741138041 740447998 740026593 739638925 739011824 738113940 737206757 736549914
$$ packed form
2622.9H02501440r31025p30097q05855j095116j332342j314402j035750q02755r23157
2641.2G93530941j255155j374065j148940q66472q22962j035690j259923j227379r80198
2659.6G83560157p78020p91549j026511j219154j084268p58171o02126p66277j008809
2677.9G75525272j021326q08596n76496n59271q00431j022935r76741p37309n85258
2696.3G68436909p32541j069785j240372j070738q07226p70688r74417j211524j232743
2714.6G59326875r66012p21216p91908j060962j226426j102864q09968o57618p79569
2733G51210332r91464j037240q56161o13868n83410q13663r96888q79049o04391m60923
2753.4G43373275n57542p91431q86261o90043m21405l87668o27101q97884r07183o56843
$$ plain form
2773.8 736549914 736050487 735393465 734427154 733272314 732193708 731327713 730495095 729412138 728012860
2792.2 728012860 726495624 725098431 723862410 722565651 720958292 719096899 717246890 715556860
2808.5 715556860 713915527 712064981 709889591 707560897 705363691 703335524 701212585 698803246
2824.8 698803246 696183980 693536460 690968573 688439369 685764790 682805419 679628789 676395535
2841.1 676395535 673188329 669920802 666400373 662625253 658866227 655318081 651905954 648390234
2857.4 648390234 644491613 640093386 635313928 630258858 624866247 619055629 612880945 606538415
2873.7 606538415 600331306 594565630 589357018 584678769 580591738 577256083 574763656 573007405
2890.1 573007405 571758151 570801616 569967806 569192231 568459868 567612410 566378415 564615488 562407851
$$ packed form
2773.8G36549914m99427o57022r66311j154840j078606q65995q32618j082957j399278
2792.2G28012860j517236j397193j236021j296759j607359j861393j850009j690030
2808.5G15556860j641333j850546k175390k328694k197206k028167k122939k409339
2824.8F98803246k619266k647520k567887k529204k674579k959371l176630l233254
2841.1F76395535l207206l267527l520429l775120l759026l548146l412127l515720
2857.4F48390234l898621m398227m779458n055070n392611n810618o174684o342530
2873.7F06538415o207109n765676n208612m678249m087031l335655k492427j756251
2890.1E73007405j249254r56535q33810p75575p32363q47458j233995j762927k207637
$$ plain form
2908.4 562407851 559864640 556938529 553535163 549771249 545983315 542486727 539545417 537320435
2924.7 537320435 535824358 535100162 535241842 536379814 538623631 541862071 545834422 550406218 555544734
2943.1 555544734 561169386 567156851 573358119 579635978 585900366 592136621 598385572 604587734
2959.4 604587734 610526204 616071761 621324420 626414716 631388068 636257350 640959084 645399690
2975.7 645399690 649696946 654017687 658220351 662075937 665546775 668690801 671603024 674300373
2992 674300373 676614702 678390741 679625332 680443227 681001544 681316614 681299150 680909395 680167794 679119527
3012.4 679119527 677817941 676283598 674468279 672354937 670080245 667772889 665413380 662969291
3028.7 662969291 660398901 657678425 654858172 651996315 649156928 646271229 643151700 639780581
$$ packed form
2908.4E62407851k543211k926111l403366l763914l787934l496588k941310k224982
2924.7E37320435j496077p24196J41680J137972K243817L238440L972351M571796N138516
2943.1E55544734N624652N987465O201268O277859O264388O236255O248951O202162
2959.4F04587734N938470N545557N252659N090296M973352M869282M701734M440606
2975.7F45399690M297256M320741M202664L855586L470838L144026K912223K697349
2992F74300373K314329J776039J234591Q17895N58317L15070j7464l89755p41601j048267
3012.4F79119527j301586j534343j815319k113342k274692k307356k359509k444089
3028.7F62969291k570390k720476k820253k861857k839387k885699l119529l371119
$$ plain form
3045.1 639780581 636385620 633193254 630086303 626798153 623365700 619944453 616570294 613254488
3061.4 613254488 609954417 606571615 603053987 599469006 595953286 592551470 589252889 585973978
3077.7 585973978 582550049 579039633 575584233 572107315 568576038 565038323 561471760 557962239
3094 557962239 554610312 551336288 547995687 544528186 541083694 537859380 534732699 531425834 528066814
3112.4 528066814 524982333 522060156 519010782 515728951 512252569 508817434 505641401 502675533
3128.7 502675533 499704182 496611863 493530959 490643919 487894267 485050201 482079297 479149789
3145 479149789 476352304 473749548 471338183 468843699 466061562 463185161 460448354 457916468 455527425
3163.4 455527425 453152716 450749397 448339075 445957512 443670303 441515148 439408123 437269956
$$ packed form
3045.1F39780581l394961l192366l106951l288150l432453l421247l374159l315806
3061.4F13254488l300071l382802l517628l584981l515720l401816l298581l278911
3077.7E85973978l423929l510416l455400l476918l531277l537715l566563l509521
3094E57962239l351927l274024l340601l467501l444492l224314l126681l306865l359020
3112.4E28066814l084481k922177l049374l281831l476382l435135l176033k965868
3128.7E02675533k971351l092319l080904k887040k749652k844066k970904k929508
3145D79149789k797485k602756k411365k494484k782137k876401k736807k531886k389043
3163.4D55527425k374709k403319k410322k381563k287209k155155k107025k138167
$$ plain form
3179.7 437269956 435131997 433034658 430993319 429010659 427039236 425041467 423088700 421244442
3196 421244442 419472307 417709500 415932775 414172053 412488669 410887271 409321457 407797545 406308532
3214.3 406308532 404833734 403371930 401913136 400489807 399106234 397721708 396407515 395303160
3230.7 395303160 394319355 393115729 391675711 390324831 389150947 388110340 387196511 386253923 385143220
3249 385143220 384010524 383060127 382237554 381364971 380405992 379464388 378637612 377940655 377345055 376805365
3269.4 376805365 376136363 375238478 374315113 373509139 372760713 371997148 371247411 370560199 369932920 369410932
3289.8 369410932 368882775 368137687 367227316 366306484 365491122 364878446 364400685 363792539 362861693 361699075
3310.2 361699075 360535294 359517604 358600259 357681215 356760919 355917931 355125606 354135036 352887750
$$ packed form
3179.7D37269956k137959k097339k041339j982660j971423j997769j952767j844258
3196D21244442j772135j762807j776725j760722j683384j601398j565814j523912j489013
3214.3D06308532j474798j461804j458794j423329j383573j384526j314193j104355
3230.7C95303160r83805j203626j440018j350880j173884j040607r13829r42588j110703
3249C85143220j132696r50397q22573q72583r58979r41604q26776o96957n95600n39690
3269.4C76805365o69002q97885r23365q05974p48426p63565p49737o87212o27279n21988
3289.8C69410932n28157p45088r10371r20832q15362o12676m77761o08146r30846j162618
3310.2C61699075j163781j017690r17345r19044r20296q42988p92325r90570j247286
$$ plain form
3328.6 352887750 351677567 350664616 349787384 348959506 348019838 346865714 345620662 344397217 343258917
3346.9 343258917 342265069 341193676 339833975 338425010 337241381 336192966 335074604 333900064
3363.2 333900064 332847655 331896275 330790430 329417735 327998251 326799124 325788558 324795038 323757678
3381.6 323757678 322759181 321888596 321219623 320799947 320325404 319448888 318441540 317858130 317633122
3399.9 317633122 317077309 316049695 315169901 314656675 314227998 313733459 313174605 312637687 312215239
3418.3 312215239 311858654 311534017 311314791 311239541 311293840 311346978 311392903 311551869 311607182 311337113
3438.7 311337113 311037362 311046064 311308473 311638981 311908662 312153220 312471032 312883258 313417107 314045012
3459.1 314045012 314598799 315114051 315883458 316850722 317542970 317773938 317979872 318525285 319376051 320261687
$$ packed form
3328.6C52887750j210183j012951q77232q27878r39668j154124j245052j223445j138300
3346.9C43258917r93848j071393j359701j408965j183629j048415j118362j174540
3363.2C33900064j052409r51380j105845j372695j419484j199127j010566r93520j037360
3381.6C23757678r98497q70585o68973m19676m74543q76516j007348n83410k25008
3399.9C17633122n55813j027614q79794n13226m28677m94539n58854n36918m22448
3418.3C12215239l56585l24637k19226p5250N4299N3138M5925J58966N5313k70069
3438.7C11337113k99751Q702K62409L30508K69681K44558L17812M12226N33849O27905
3459.1C14045012N53787N15252P69407R67264O92248K30968K05934N45413Q50766Q85636
$$ plain form
3479.5 320261687 320881218 321413517 322159708 322945833 323620528 324330419 325131387 326004595 326910228 327841640
3499.9 327841640 328772813 329509586 330085695 330794096 331731588 332809597 333830982 334693462 335590005
3518.2 335590005 336683333 337982178 339239508 340215266 341097891 342148125 343422711 344906002 346401662
3536.6 346401662 347718149 349138051 350828588 352456808 353799433 355126292 356658548 358262390
3552.9 358262390 359906077 361717999 363733292 365866125 367996544 370074779 372254550 374653429
3569.2 374653429 377124518 379619420 382247269 385007858 387938768 391156793 394580036 397859752
3585.5 397859752 400829643 403948545 407382458 410897881 414521426 418345690 422208518 426063210
3601.9 426063210 430038780 433991879 437903017 441981673 446194768 450467288 454693109 458768696
$$ packed form
3479.5C20261687O19531N32299P46191P86125O74695P09891Q00968Q73208R05633R31412
3499.9C27841640R31173P36773N76109P08401R37492J078009J021385Q62480Q96543
3518.2C35590005J093328J298845J257330R75758Q82625J050234J274586J483291J495660
3536.6C46401662J316487J419902J690537J628220J342625J326859J532256J603842
3552.9C58262390J643687J811922K015293K132833K130419K078235K179771K398879
3569.2C74653429K471089K494902K627849K760589K930910L218025L423243L279716
3585.5C97859752K969891L118902L433913L515423L623545L824264L862828L854692
3601.9D26063210L975570L953099L911138M078656M213095M272520M225821M075587
$$ plain form
3618.2 458768696 462965101 467338085 471723646 475887299 479722738 483856529 488264322 492563218
3634.5 492563218 496820629 501063168 505314171 509699583 514178395 518392622 522202253 526151001
3650.8 526151001 530367196 534394920 538426518 542666435 546696663 550490201 554411948 558235586
3667.1 558235586 561603546 565125108 568701208 571572781 574477136 577828288 581196070 584633350
3683.4 584633350 588075399 591115952 593498349 595724523 598238349 600905418 603500187 605833769
3699.8 605833769 607913673 610133052 612628937 615022480 616927028 618480980 620403469 622605622
3716.1 622605622 624627411 626421988 628098428 629646659 631176353 633059859 635126531 636937141
3732.4 636937141 638252795 639331698 640963435 643030524 644414783 645064652 646458387 647980988
$$ packed form
3618.2D58768696M196405M372984M385561M163653L835439M133791M407793M298896
3634.5D92563218M257411M242539M251003M385412M478812M214227L809631L948748
3650.8E26151001M216195M027724M031598M239917M030228L793538L921747L823638
3667.1E58235586L367960L521562L576100K871573K904355L351152L367782L437280
3683.4E84633350L442049L040553K382397K226174K513826K667069K594769K333582
3699.8F05833769K079904K219379K495885K393543J904548J553952J922489K202153
3716.1F22605622K021789J794577J676440J548231J529694J883506K066672J810610
3732.4F36937141J315654J078903J631737K067089J384259O49869J393735J522601
$$ plain form
3748.7 647980988 648630917 649522245 651205719 652811766 653939366 655079782 656479001 657799423 658929825
3767.1 658929825 659822106 660708368 661965013 663386285 664619744 665552974 666423440 667351484 668275952
3785.4 668275952 669273615 670351028 671469986 672556162 673570693 674653649 675411582 675742805 676568985
3803.8 676568985 677446604 678049326 679160476 680597365 681585133 682083249 682854474 683512390 683916986
3822.1 683916986 684809566 685812771 686700463 687560558 688403130 689402103 690123200 690263987 690607011
3840.5 690607011 691294909 692037404 693043172 694345474 695285499 694808960 694116116 695083618 696503162
3858.8 696503162 697497427 698009908 698417962 699084938 699536324 699760854 700180590 700832129 701728940 702392995
3879.2 702392995 702855647 703475356 703859091 704244673 704764247 704994917 705381334 706229210 707012773 707394898
$$ packed form
3748.7F47980988O49929Q91328J683474J606047J127600J140416J399219J320422J130402
3767.1F58929825Q92281Q86262J256645J421272J233459R33230Q70466R28044R24468
3785.4F68275952R97663J077413J118958J086176J014531J082956P57933L31223Q26180
3803.8F76568985Q77619O02722J111150J436889R87768M98116P71225O57916M04596
3822.1F83916986Q92580J003205Q87692Q60095Q42572R98973P21097J40787L43024
3840.5F90607011O87898P42495J005768J302302R40025m76539o92844R67502J419544
3858.8F96503162R94265N12481M08054O66976M51386K24530M19736O51539Q96811O64055
3879.2G02392995M62652O19709L83735L85582N19574K30670L86417Q47876P83563L82125
$$ plain form
3899.6 707394898 707467377 707413375 707591474 708159447 708783507 709303021 709771931 710085988 710274935 710578382
3920 710578382 710948765 711187661 711422324 711785436 712097645 712307930 712570369 712940216 713379622 713753521
3940.4 713753521 713931739 714108348 714455009 714780867 715003133 715230227 715503752 715836167 716198504 716511965
3960.8 716511965 716766298 717018962 717305243 717572868 717778385 718003511 718289733 718584239 718841493 719082057
3981.2 719082057 719356835 719634712 719880283 720065832 720180392 720345914 720595241 720824659
3997.5 720824659
$$ packed form
3899.6G07394898P2479n4002J78099N67973O24060N19514M68910L14057J88947L03447
3920G10578382L70383K38896K34663L63112L12209K10285K62439L69847M39406L73899
3940.4G13753521J78218J76609L46661L25858K22266K27094K73525L32415L62337L13461
3960.8G16511965K54333K52664K86281K67625K05517K25126K86222K94506K57254K40564
3981.2G19082057K74778K77877K45571J85549J14560J65522K49327K29418
3997.5G20824659
##END=$$ End of the data block
