##TITLE=Cogumelo $$ Begin of the data block
##JCAMP-DX=5.00 $$ ACD/SpecManager v 10.08
##SPECTROMETER/DATA SYSTEM=Alpha
##DATE=14 Apr 2015 15:41:24
##DATA TYPE=INFRARED SPECTRUM
##DATA CLASS=XYDATA
##ORIGIN=
##OWNER=
##NPOINTS=1765
##FIRSTX=399.76428223
##LASTX=3997.64306641
##MAXX=3997.64306641
##MINX=399.76428223
##MAXY=0.79019821
##MINY=0.08333480
##XFACTOR=1.0000000000
##YFACTOR=1.000000000000000e-9
##FIRSTY=0.78449887
##DELTAX=2.03961372
##XUNITS=1/CM
##YUNITS=ARBITRARY UNITS
##XYDATA=(X++(Y..Y))
399.8G84498870L068686J818657Q11994n29051o34432M45903N93543j104713k589881
418.1G86379576p83682Q55148N56528K23041n55575j465321k144396l249824m262567
436.5G75552928m270613m277289m106283k794325j365781m28975K40386Q25584P71940
454.8G60147572O68048J869142K422691J808882J376092J090586J123309J317501J409352
473.2G73233175J408816J220464J004339M40120j84774j16527K99394P09593J061738
491.5G79076338R50277K29001p91431j656890j760125j262247j135827j142919r91523
509.9G71514654j500010k798140m132212m503429l714919l047824l002345k371311
526.2G46444464q59559K53737R19581J233339J043975R59039J147807J219630J081824
$$ y = [784498870, 787567556, 789386213, 790198207, 789669156, 789034724, 789480627, 790074170, 788969457, 786379576, 785595894, 786451042, 787007570, 787230611, 786675036, 785209715, 783065319, 779815495, 775552928, 771282315, 767005026, 762898743, 760104418, 758738637, 758309662, 758550048, 759375632, 760147572, 760815620, 762684762, 765107453, 766916335, 768292427, 769383013, 770506322, 771823823, 773233175, 774641991, 775862455, 776866794, 777306914, 777122140, 777005613, 777305007, 778014600, 779076338, 780026615, 780255616, 779464185, 777807295, 776047170, 774784923, 773649096, 772506177, 771514654, 770014644, 767216504, 763084292, 758580863, 754865944, 751818120, 748815775, 746444464, 745584905, 745838642, 746758223, 747991562, 749035537, 749994576, 751142383, 752362013, 753443837]
544.6G53443837R03726P50243N03958J67429n4598j90258k92062l85404n00441n63562
565G53782868o41703p14839r51588j222908q99852m04358n26368p19428m86017l48985
585.4G46866822m33743n49137n21779k10286j8954m7445O1035K68817K40266J25647
605.8G45781243J32441J70052K45214K05815R4712J63078K55227J94907K03490K21193
626.2G47667372K146j90377J371M54306O53804M54425K25723K02239J63436P2598P6950
648.6G49783993j3232k44618m11153m25875m11332l80337k64525j95146o71208j255214
669G45511353p92384o12080p35104o78242n73635p27713r09686q75652q50737q85308
689.4G37870812j012504j297056j869560k619981l258825l882527n007804o872892
$$ y = [753443837, 754347563, 755097806, 755601764, 755769193, 755714595, 755524337, 755232275, 754846871, 754346430, 753782868, 753141165, 752426326, 751474738, 750251830, 749351978, 748947620, 748421252, 747701824, 747215807, 746866822, 746433079, 745883942, 745362163, 745151877, 745132923, 745085478, 745146513, 745415330, 745655596, 745781243, 745913684, 746083736, 746328950, 746534765, 746629477, 746792555, 747047782, 747242689, 747446179, 747667372, 747669518, 747479141, 747480512, 747934818, 748588622, 749043047, 749268770, 749471009, 749634445, 749707043, 749783993, 749770761, 749526143, 749114990, 748689115, 748277783, 747897446, 747632921, 747437775, 746766567, 745511353, 744718969, 744106889, 743371785, 742693543, 742119908, 741392195, 740482509, 739606857, 738756120, 737870812, 736858308, 735561252, 733691692, 731071711, 727812886, 723930359, 718922555, 712049663]
705.7G12049663r844899j4114022j9304514k9460371n2191377o2105059j5895069M3262422
722E52396774M1610301j440346l5262645j6569137M6245634P3658884M8069119K0982862
738.3G29691446R933889N460560L089547J782179J198053R18031O62506M63307L18348
756.7G53517866J82271J68979J58847P2181m5121j63376k50757k72274j75357p4267
777.1G53118992n8174k19703n38945p08163p25150q31902r16720o86168k28763M3392
797.5G48248696j0192j87635k89321l46423m91082o52433o58631o73771q16941q21173
817.9G43301094p83861r28044j089633j092195r81510r35197r40561r14455j047730
836.2G34587908j395941j602411j564622j624525j613259r05395P1228N30243N29587
$$ y = [712049663, 702204764, 688090742, 668786228, 639325857, 587134480, 525029421, 509134352, 552396774, 594007075, 592566729, 557304084, 540734947, 586980581, 660639465, 708708584, 729691446, 739625335, 745085895, 748175442, 749957621, 751155674, 752073705, 752736211, 753199518, 753517866, 753700137, 753869116, 754027963, 754100144, 754055023, 753891647, 753640890, 753368616, 753193259, 753118992, 753060818, 752841115, 752302170, 751594007, 750868857, 750036955, 749120235, 748434067, 748205304, 748248696, 748238504, 748050869, 747761548, 747415125, 746924043, 746271610, 745612979, 744939208, 744122267, 743301094, 742517233, 741589189, 740499556, 739407361, 738425851, 737490654, 736550093, 735635638, 734587908, 733191967, 731589556, 730024934, 728400409, 726787150, 725881755, 725952983, 726483226, 727012813]
854.6G27012813K09153k30134o81281j417100k761603n248010r127617j1961996r870410
873F85923815l595472K527297N926669O550014O616234P494986P173121M780889K332211
891.3G25729764R65237K69413n3823j13487j84417l76344n51998l94166K95937R92120
911.7G26578236J061976P06613M04477K08020K801j55925k16365k74658l32118l62515
932.1G27620542l58105l41475l91721m24326m10855m65631n72741o30379o76572p85828
952.5G22562909r14812j019716j105130j178503j282632j451791j662492j816273j507640
970.9G10623920n27024N33580R82106P60436K25604l02792p15494r70185r57846p62761
991.3G08889544p07924q55208q86678p12336o34551q76724j308024j698554k135217
$$ y = [727012813, 727221966, 726991832, 726310551, 724893451, 722131848, 716883838, 707756221, 695794225, 685923815, 682328343, 684855640, 690782309, 697332323, 703948557, 711443543, 718616664, 723397553, 725729764, 726695001, 726964414, 726910591, 726797104, 726612687, 726236343, 725684345, 725290179, 725586116, 726578236, 727640212, 728346825, 728751302, 728959322, 728962123, 728806198, 728589833, 728315175, 727983057, 727620542, 727262437, 726920962, 726529241, 726104915, 725694060, 725228429, 724655688, 724025309, 723348737, 722562909, 721648097, 720628381, 719523251, 718344748, 717062116, 715610325, 713947833, 712131560, 710623920, 710096896, 710630476, 711612582, 712373018, 712598622, 712295830, 711580336, 710610151, 709652305, 708889544, 708181620, 707326412, 706439734, 705727398, 705092847, 704216123, 702908099, 701209545, 699074328]
1009.6F99074328k927303l964842m208505k963126j343309l60966J023412K836227
1025.9F87165916K924323J281202m2260m53651n28097n49734n24461m55856l72887
1044.3F88444495m08709n58972m06146M3869P7605l99292q74936j165867j286685j335144
1064.7F82130218j438678j603126j889944k257109k519190k710879k802134k646506
1081F64262652k368748k209842k180219k146423k046644j884043j639545j200855n99146
1099.4F47987187j6689M32312O37949N08785P5281l71397n06282n18858o63519o97077
1119.8F46867692m76539k07841n8055j2875J10150M69446J016438J623034K194703
1138.1F51526153K664328L018677L306389L462493L302753K843201K246082J662076
$$ y = [699074328, 696147025, 692182183, 687973678, 685010552, 683667243, 683306277, 684329689, 687165916, 690090239, 691371441, 691329181, 690875530, 690347433, 689797699, 689273238, 688817382, 688444495, 688035786, 687476814, 687070668, 687114537, 687192142, 686792850, 685917914, 684752047, 683465362, 682130218, 680691540, 679088414, 677198470, 674941361, 672422171, 669711292, 666909158, 664262652, 661893904, 659684062, 657503843, 655357420, 653310776, 651426733, 649787188, 648586333, 647987187, 647970498, 648402810, 649040759, 649549544, 649624825, 649253428, 648747146, 648228288, 647564769, 646867692, 646391153, 646183312, 646125257, 646112382, 646222532, 646691978, 647708416, 649331450, 651526153, 654190481, 657209158, 660515547, 663978040, 667280793, 670123994, 672370076, 674032152]
1154.4F74032152J180827P36177K71797j24514l35037l60310l21389l32534m84765
1172.8F74262404n14745K6345O32405N77808J76251j20998k85744l70741m38571n42045
1193.2F73402369o88732q57889r99809j003146r12666r26554j030684j110256j170933
1211.5F64701700j256227j447976j772106k079248k218068k233922k305865k540172
1227.9F48848116k944052l434002l893078m190325m130125l672302k987743k271950
1244.2F21324539j646757j158476q26895o77705o71089p30454q10683p47204m41074
1262.5F13614202n4241K48850M28378M54009L74794L11077K99155L34800M28259N69701
1282.9F17008984O21617N62668M78685L57568K04027J72913L27885M86672N57720N45681
$$ y = [674032152, 675212979, 675949156, 676220953, 676096439, 675761402, 675401092, 675079703, 674747169, 674262404, 673747659, 673774004, 674406409, 674984217, 675160468, 675039470, 674753726, 674382985, 673944414, 673402369, 672713637, 671855748, 670855939, 669852793, 668940127, 668013573, 666982889, 665872633, 664701700, 663445473, 661997497, 660225391, 658146143, 655928075, 653694153, 651388288, 648848116, 645904064, 642470062, 638576984, 634386659, 630256534, 626584232, 623596489, 621324539, 619677782, 618519306, 617692411, 617014706, 616343617, 615613163, 614802480, 614055276, 613614202, 613559961, 613808811, 614237189, 614691198, 615065992, 615377069, 615676224, 616011024, 616439283, 617008984, 617630601, 618193269, 618671954, 619029522, 619233549, 619406462, 619734347, 620221019, 620778739, 621324420]
1303.3F21324420N30541O24001P54118P42078P35759P51257O36399O09219N82576K97487
1323.7F27587855j28806n94914j235485k142310l389776m863321n960763n363703k888739
1342.1F01020038m78208R58741J359522J036584O18518K55048k82466j226008k593219
1360.4F00668550l637672l441214k959013k447844j650333j923383k327621k52902
1376.7E82028568K764046L933310K613068J06394j717627k018928k256274l807962
1393.1E81644595n063832m688263m237771m132927n005300o451547o229579n190373
1409.4E40645003m057467k517759j826525k457559k549947j387775j587987k528905
1425.7E21731079l446043m590094m376113l606737l946722k865523o81340o52880j518309
$$ y = [621324420, 621854961, 622478962, 623233080, 623975158, 624710917, 625462174, 626098573, 626707792, 627290368, 627587855, 627459049, 626864135, 625628650, 623486340, 620096564, 615233243, 609272480, 603908777, 601020038, 600541830, 601500571, 602860093, 603896677, 604515195, 604770243, 604487777, 603261769, 600668550, 597030878, 593589664, 590630651, 588182807, 586532474, 584609091, 582281470, 582028568, 584792614, 588725924, 591338992, 591445386, 589727759, 587708831, 585452557, 581644595, 576580763, 571892500, 567654729, 563521802, 558516502, 552064955, 545835376, 540645003, 536587536, 534069777, 532243252, 529785693, 527235746, 525847971, 524259984, 521731079, 518285036, 513694942, 509318829, 505712092, 501765370, 498899847, 498218507, 497565627, 496047318]
1444.1D96047318k529115l852486n194485p343442j0706394k1352858m4421166m8634678
1460.4C52012694k1914572K1070928L6414593J1966706j4554978j0483533M8245698
1474.7D22757536P6296866M9193472K1309733J0238230N792976L242612K884924M545450
1491E96261799M484833K574026J819968K655089K406240L64065j757681J099169O565869
1509.3F16473377N683124K987206Q47101K74122K52902N30422J957476K240181K037823
1527.7F33283734J367092k03251m99189J8298j988470l666997M48584L604651L422260
1546F35786712K145946J235903Q68737o1691j863777k111793L818512M976213K249241
1564.4F47044003O50704q285Q74758J122474n57899k32101K164781K269805J456141
$$ y = [496047318, 493518203, 489665717, 484471232, 477127790, 466421396, 445068538, 400647372, 352012694, 330098122, 351169050, 387583643, 399550349, 384995371, 374511838, 422757536, 499054402, 548247874, 569557607, 579795837, 585588813, 588831425, 591716349, 596261799, 600746632, 603320658, 605140626, 607795715, 610201955, 610566020, 608808339, 609907508, 616473377, 622156501, 625143707, 625990808, 626264930, 626517832, 627048254, 629005730, 631245911, 633283734, 634650826, 634447575, 633948386, 633966684, 631978214, 628311217, 628759801, 632364452, 635786712, 637932658, 639168561, 640037298, 639975607, 638111830, 636000037, 639818549, 644794762, 647044003, 647694707, 647686422, 648561180, 649683654, 649125755, 648893654, 651058435, 653328240, 654784381]
1582.8F54784381J016677P40290N06877L74794K80500K93255L39150J20878k45154
1601.1F58211648l35276m09484o56783n68032l55721j054287k086818r80675L84569
1619.5F52149141q25703j543939p15018m51922n41151j491785l921866m691899n99504
1637.8F37366354J756967J366615J84417l68536J669407J748800k95460K614200N243123
1656.2F51285887K991497Q79169N31494J484156O97434q75235q2731J030445O31213
1674.5F58573329P87199K69592j610756l032804m80532K793669J679063K25961j328408
1692.9F57876313l453434l796160k585232j294792r48369k673626l688217m117667
1709.2F35318816n786121p505655p756174m068732J943111L376603K457202J962542
$$ y = [654784381, 655801058, 656541348, 657048225, 657423019, 657703519, 657996774, 658335924, 658456802, 658211648, 657876372, 657466888, 656810105, 656242073, 655886352, 654832065, 652745247, 651764572, 652149141, 651323438, 649779499, 649064481, 648612559, 648071408, 646579623, 642657757, 637965858, 637366354, 639123321, 640489936, 640674353, 640305817, 641975224, 643724024, 643428564, 646042764, 651285887, 654277384, 655156553, 655688047, 657172203, 657869637, 656994402, 656911671, 657942116, 658573329, 659360528, 659630120, 658019364, 654986560, 654506028, 657299697, 658978760, 659204721, 657876313, 654422879, 650626719, 648041487, 646746695, 645798326, 643124700, 639436483, 635318816, 629532695, 622027040, 614270866, 610202134, 612145245, 615521848, 617979050, 619941592]
1725.5F19941592J386404O37651J66595J266360L903210L780961L521562M794121N505859
1743.9F44904315M954100L942371M060030M583418L175437J492083J005292O98626
1760.2F68815672R46939J260162K89142q08716j182079Q0228J969874J624345L69668
1778.6F73365235m1425J44720J35303j82271j268566k344549j286447M32015K43485
1796.9F69197500k80380L85820J401544J256108M11630j26779J46210N94556L56317
1815.3F73342526J4186K1040j72674m91441k20358o4850J73032J236082J206874L46721
1835.7F75391138J40071n5314q40902q11636N98251J124561P04050L25382R5129k4915
1856.1F76645815p6770o2883j36078n38110j163781q03590P29382J105189L47615j02222
$$ y = [619941592, 621327996, 621965647, 622132242, 623398602, 627301812, 631082773, 634604335, 639398456, 644904315, 649858415, 653800786, 657860816, 662444234, 665619671, 667111754, 668117046, 668815672, 669762611, 671022773, 671311915, 670503199, 669321120, 669401348, 671371222, 672995567, 673365235, 673323810, 673468530, 673603833, 673421562, 672152996, 669808447, 668522000, 668954015, 669197500, 668917120, 669302940, 670704484, 671960592, 672372222, 672245443, 672391653, 672986209, 673342526, 673356712, 673377752, 673205078, 672713637, 672493279, 672428429, 672601461, 673837543, 675044417, 675391138, 675531209, 675475895, 674634993, 673823357, 674421608, 675546169, 676250219, 676575601, 676670730, 676645815, 676569045, 676506162, 676370084, 675831974, 674668193, 673864603, 674593985, 675699174, 676046789, 675944567]
1876.5F75944567j58608k25902l63231m96447q22365j076400o38068k61426k19107
1894.8F71683013J01150L31103L03150K52604J60396L1769J07110L51191K27808l25322
1915.2F73223972m68492L6478J78397K08079M48525K98858M1366k7180m7863r1076
1935.6F73801064j92463m74512n81325k6345L86298K12431r54j00493j39892j20104
1956F72763705j12056j03713k7895m4047l8028K80917M63664K31087K7180O735J7345
1978.5F73464894K1100L0041k3186j46687k67148k85208J3649K48313M4882j25765
1998.8F72974885j38522k53975m21822n25713o07371p79331j040697j124621o93619
2017.2F67389214J3590L95059M67420M92036M54009L81827L22044K53022J97470J50979
$$ y = [675944567, 675785959, 675560057, 675196826, 674700379, 673878014, 672801614, 672163546, 671902120, 671683013, 671784163, 672115266, 672418416, 672671020, 672831416, 672863185, 672970295, 673321486, 673549294, 673223972, 672755480, 672791958, 672970355, 673178434, 673626959, 673925817, 673967183, 673940003, 673892140, 673801064, 673608601, 673134089, 672552764, 672526419, 672912717, 673125148, 673124194, 673023701, 672883809, 672763705, 672651649, 672547936, 672520041, 672475994, 672437966, 672718883, 673182547, 673413634, 673440814, 673447549, 673464894, 673485994, 673516035, 673492849, 673346162, 673079014, 672793806, 672807455, 673055768, 673100650, 672974885, 672836363, 672582388, 672160566, 671634853, 671027482, 670248151, 669207454, 668082833, 667389214, 667402804, 667797863, 668265283, 668757319, 669211328, 669593155, 669915199, 670168221, 670365691, 670516670]
2037.6F70516670J11937J35780J68740J37985J05679J09613R2864L1173P034J9967
2058F71437442j371n9902p6413J9371Q2851L1769j5199k4319k3425m7922p3194l9935
2082.5F71209753k3485m3094m4524l3081k5749m3214n9127m5419k7180l5524n5433
2104.9F70773923q1658r5785n5730k3246l2604k8312k3424o4612j14381j26422j27792
2127.3F69999957j30415j39654j93595k43724k24292j88291j77205j57952j21594j10805
2147.7F68312430r4413Q523J04725Q6964M8160N9962Q7083Q4519N4777M9949M0769
2170.2F68843448j0490m5419l4392l1173n5730n6029m0889n4240Tj5557q404o5565
2194.6F68371320q3566k6822n305k4676m1425o6877p5519m4346l2842r3102j37687
$$ y = [670516670, 670628607, 670764387, 670933127, 671071112, 671176791, 671286404, 671379268, 671410441, 671417475, 671437442, 671436071, 671376169, 671299756, 671319127, 671401978, 671433747, 671418548, 671394229, 671370804, 671322882, 671249688, 671209753, 671186268, 671143174, 671098650, 671065569, 671039820, 670996606, 670937479, 670892060, 670864880, 670829356, 670773923, 670692265, 670596480, 670540750, 670517504, 670484900, 670456588, 670433164, 670368552, 670254171, 670127749, 669999957, 669869542, 669729888, 669536293, 669292569, 669068277, 668879986, 668702781, 668544829, 668423235, 668312430, 668218017, 668226540, 668331265, 668418229, 668466389, 668526351, 668613434, 668697953, 668752730, 668802679, 668843448, 668832958, 668787539, 668753147, 668721974, 668666244, 668610215, 668569326, 668515086, 668460846, 668445289, 668436885, 668371320, 668287754, 668260932, 668255627, 668230951, 668189526, 668122649, 668047130, 668002784, 667969942, 667876840, 667739153]
2217.1F67739153j15514q4042m0710J8179M3631j4246j35183k17319k87473l94821
2237.5F66511655m08888k73049p5161Q0585R1612n126m8458j9014q047l2663q1539
2259.9F65731907j40727j75118j88530k35140l09229l37124k79545j40071q94N424
2280.3F63930953q7977j30236r3937o3241r7274j39714j55925j85192j88649j60217
2300.7F62628591j92106k95579l59655l66568l65615l42071l85523n35190o53267o35862
2321.1F58497155n01514m41968m63188l06010k5928L1829r4295j47700j47164p4387
2341.5F56326830J85192N22435N05924J92642J26600L39210L41654L13461N37872N54681
2361.9F59946501L65079L05056L84569M51088L82066K79665K57373K36690J48296O3181
$$ y = [667739153, 667623639, 667539597, 667498887, 667517066, 667560697, 667546451, 667411268, 667193949, 666906476, 666511655, 666102767, 665829718, 665754557, 665835142, 665926754, 665921628, 665873170, 665854156, 665846109, 665813446, 665731907, 665591180, 665416062, 665227532, 664992392, 664683163, 664346039, 664066494, 663926423, 663925529, 663930953, 663842976, 663712740, 663618803, 663555562, 663458288, 663318574, 663162649, 662977457, 662788808, 662628591, 662436485, 662140906, 661781251, 661414683, 661049068, 660706997, 660321474, 659786284, 659133017, 658497155, 657995641, 657553673, 657090485, 656784475, 656758547, 656790376, 656696081, 656548381, 656401217, 656326830, 656512022, 657034457, 657540381, 657733023, 657859623, 658198833, 658540487, 658853948, 659391820, 659946501, 660311580, 660616636, 661001205, 661452293, 661834359, 662114024, 662371397, 662608087, 662756383, 662819564]
2382.3F62819564K2948l2902r3341r2148p7606j02818j00076o3777o0022r7632j53661
2404.7F61968529j78277j71006j97828k21312j65164o6221L0160J38223K25961K25365
2425.1F61588430J67847J01149M6790M2736N7757N2393K8968k504m3332p2480o0796
2447.6F61906958o4254j20819j44601r9599p8976j06931j64091k55108l46721m72128
2467.9F60053730n77450m59850j94311n1319q2493j64747k09094k23994k30849k65717
2488.3F57593906l29137l64304l86655m01854m03703m33445m59969m54962m52340m36961
2508.7F53470576m18008m44710m70519m43220m08471m00602l79622k13266Q9824K95580
2529.1F50677562L74794M21285L98338K65599j491l07083m86076m94062l52622j63734
$$ y = [662819564, 662842512, 662809610, 662716269, 662624121, 662546515, 662443697, 662343621, 662279844, 662219822, 662122190, 661968529, 661790252, 661619246, 661421418, 661200106, 661034942, 660968721, 660998881, 661137104, 661363065, 661588430, 661756277, 661857426, 661904216, 661946952, 662004709, 662057102, 662086070, 662083566, 662040234, 661967754, 661906958, 661842704, 661721885, 661577284, 661477685, 661398709, 661291778, 661127687, 660872579, 660525858, 660053730, 659476280, 659016430, 658822119, 658770800, 658688307, 658523560, 658314466, 658090472, 657859623, 657593906, 657264769, 656900465, 656513810, 656111956, 655708253, 655274808, 654814839, 654359877, 653907537, 653470576, 653052568, 652607858, 652137339, 651694119, 651285648, 650885046, 650505424, 650292158, 650381982, 650677562, 651052356, 651473641, 651871979, 652137578, 652136087, 651829004, 651342928, 650848866, 650496244, 650332510]
2549.5F50332510l7133N841n6088j23382j29640j78396k65539k91407k66254l15487
2569.9F48675025m05729m15743m02033m43101n07891n13911m40002m18603n39542o54041
2590.3F43934429o51777n72801m47035l52799l69549m78089o03616o66380o77586p22706
2610.7F38392091q26001r06229r28700r61483j018226j053512j071215j108944j117110
2629.1F29400671j016856p36057k69354J83463M03643L81350K76745J77264M0770j76251
2649.5F28665388l75748m23431l98815l49283k18153k3902K06828L94702M73321N31792
2669.9F28482699O32763O63698N56111M00901K85447K32577K01762J46925J03474R5904
2690.3F31802261L9279q3267j98782l46660n01156n84543n87106n10514m75764n00440
$$ y = [650332510, 650295377, 650301218, 650245130, 650121748, 649992108, 649813712, 649548173, 649256766, 648990512, 648675025, 648269296, 647853553, 647451520, 647008419, 646500528, 645986617, 645546615, 645128012, 644588470, 643934429, 643282652, 642709851, 642262816, 641910017, 641540468, 641062379, 640458763, 639792383, 639114797, 638392091, 637566090, 636659861, 635731161, 634769678, 633751452, 632697940, 631626725, 630517781, 629400671, 628383815, 627647758, 627378404, 627561867, 627965510, 628346860, 628623605, 628800869, 628841639, 628665388, 628289640, 627866209, 627467394, 627118111, 626899958, 626876056, 627082884, 627477586, 627950907, 628482699, 629115462, 629779160, 630335271, 630736172, 631021619, 631254196, 631455958, 631602883, 631706357, 631802261, 631841540, 631758273, 631559491, 631212831, 630711675, 630127132, 629540026, 629029512, 628553748, 628053308]
2710.7F28053308m86076m68374m88639n67257o63876o92726o85632o84142o72877p01845
2731.1F21941864p25150o39081n16593l96371k49565j30057j14083j61588j89424l05891
2751.4F18514061n50926p84516r09805r74954j087367j113594j008153j057744j355827
2769.8F09671175j650810j764297j842380k099991k418816k600252k817154l121019
2786.1E91356456l324747l479004l593266l609776l594399l607392l724337l922641
2802.4E62500894m090667m285156m600525m969418n408883n984009o625354p332504
2818.8E19204378q226514r428143j0976106j2880683j5202880j8119097k2084415k7549296
2835.1C94737244l4492910m2708546n1363200n7193607n4487586l9048665j4071047
$$ y = [628053308, 627567232, 627098858, 626610219, 626042962, 625379086, 624686360, 624000728, 623316586, 622643709, 621941864, 621216714, 620577633, 620061040, 619664669, 619415104, 619285047, 619170964, 619009376, 618819952, 618514061, 617963135, 617178619, 616268814, 615293860, 614206493, 613092899, 612084746, 611027002, 609671175, 608020365, 606256068, 604413688, 602313697, 599894881, 597294629, 594477475, 591356456, 588031709, 584552705, 580959439, 577349663, 573755264, 570147872, 566423535, 562500894, 558410227, 554125071, 549524546, 544555128, 539146245, 533162236, 526536882, 519204378, 510977864, 501549721, 490573615, 477692932, 462490052, 444370955, 422286540, 394737244, 360244334, 317535788, 266172588, 208978981, 154491395, 115442730, 101371683]
2849.3A01371683J0630317K7849555L7595526M2378664M2959511L9241701L2130629
2863.6C34157586K3460418J4901102P168293K70813n860507j1126548j5155167j7552882
2879.9C30263108j8296927j7802179j6684830j5398473j4133855j2893722j1638716
2894.2B23414406j0519564r713799r334415r683669j1014714j3257638j5956327j8115595
2910.5A25818685j8174134j4739335q281946j288474M267417Q439116J2016438J5453622
2926.8A23511389J9011900K2762060K6425823K9597685L1997532L3426374L3575922
2941.1C20308685L1964213K8434038K3723066J9253701J6107231J4289111J3076037
2955.4D67156082J2098670J1752576J2257040J3132989J3693154J3528645J2679160
$$ y = [101371683, 112002000, 139851555, 177447081, 219825745, 262785256, 302026957, 334157586, 357618004, 372519106, 379687399, 379958212, 374097705, 362971157, 347815990, 330263108, 311966181, 294164002, 277479172, 262080699, 247946844, 235053122, 223414406, 212894842, 203181043, 193846628, 184162959, 173148245, 159890607, 143934280, 125818685, 107644551, 92905216, 84623270, 83334796, 87602213, 96041329, 108057767, 123511389, 142523289, 165285349, 191711172, 221308857, 253306389, 286732763, 320308685, 352272898, 380706936, 404430002, 423683703, 439790934, 454080045, 467156082, 479254752, 491007328, 503264368, 516397357, 530090511, 543619156, 556298316]
2969.7E56298316J1442661J0054231Q642435P271587O052852N106926M331768L651499
2986F12852275L095746K578497K143443J900792J702666J444102J205027J023769R16720
3004.4F28863037Q33153O94096N03064L73125M06742M95553N06222M43161L72231L83377
3024.7F33873761M48405M39287M19140N33342P30991Q48890Q16345P43329P20680O94513
3045.1F40268683N96285M60565L70443L09527K64883L12150L36349J56224m5658m8279
3065.5F42981172N9723J05739O9440J370j19865k15768j74880k8491J17480K10703
3085.9F43006623L11851M88937O98984Q22663Q61943P98464O36697N35488M70817L77118
3106.3F49009585L12329K39014O0916q7738j8835L6836p1883j30296r9063j02580j59204
$$ y = [556298316, 567740977, 577795208, 586437643, 593709230, 599762082, 604869008, 609200776, 612852275, 615948021, 618526518, 620669961, 622570753, 624273419, 625717521, 626922548, 627946317, 628863037, 629696190, 630390286, 630893350, 631266475, 631673217, 632168770, 632674992, 633118153, 633490384, 633873761, 634322166, 634761453, 635180593, 635713935, 636444926, 637293816, 638110161, 638853490, 639574170, 640268683, 640864968, 641325533, 641695976, 642005503, 642270386, 642582536, 642918885, 643075109, 643029451, 642981172, 643040895, 643146634, 643216074, 643217444, 643097579, 642881811, 642706931, 642678440, 642795920, 643006623, 643318474, 643807411, 644506395, 645329058, 646191001, 646989465, 647626162, 648161650, 648632467, 649009585, 649321914, 649560928, 649621844, 649534106, 649515271, 649552107, 649480224, 649349928, 649250865, 649148285, 648989081]
3128.8F48989081k25484k39670j87755j54734j91450k61426l27646l46125l13997l33071
3149.2F46407723l85403l84033l91245l95238l45648l23951l73184m61817m94123m05967
3169.6F42447114l36111l87489m77374n04434m92752n00500m92752m46200m04656m34696
3189.9F37970150m76182m62532m64380m68433m16934l66986l98517m68790n09858m90785
3210.3F33446753m57346m62592m24564l84927m12881m63188n11408n06937m64022m83573
3230.7F28875315n49853n24997m72963n03242n39840n70833n63324m87804m51267m93586
3251.1F23717606n42104n35786n08428m74572m14431m43697o05464o81281n73516m75705
3271.5F18462622m92275n12778m59552m33028m92513n51820o06060o67155o79195o64293
$$ y = [648989081, 648763597, 648523927, 648336172, 648181438, 647989988, 647728562, 647400916, 647054791, 646740794, 646407723, 646022320, 645638287, 645247042, 644851804, 644506156, 644182205, 643809021, 643347204, 642853081, 642447114, 642111003, 641723514, 641246140, 640741706, 640248954, 639748454, 639255702, 638809502, 638404846, 637970150, 637493968, 637031436, 636567056, 636098623, 635681689, 635314703, 634916186, 634447396, 633937538, 633446753, 632989407, 632526815, 632102251, 631717324, 631304443, 630841255, 630329847, 629822910, 629358888, 628875315, 628325462, 627800465, 627327502, 626824260, 626284420, 625713587, 625150263, 624662459, 624211192, 623717606, 623175502, 622639716, 622131288, 621656716, 621242285, 620798588, 620193124, 619511843, 618938327, 618462622, 617970347, 617457569, 616998017, 616564989, 616072476, 615520656, 614914596, 614247441, 613568246, 612903953]
3291.9F12903953o47605o12318n25713l51012j50681m768J18017K21491K59042K76029
3312.3F11486435K94089K75076K51650K41280J55091J5617M5955K32100K74897J40846
3332.7F13413036N1498Q5175J52469J39415P5698Q6487J36077J06275O1750J07289
3353.1F14415169J45137Q8990M0650N5075K4617k1935M9651J88231K62737K43903J98662
3375.5F15690887J98305K70605L37898L23415L06845L01003K24173J93894L03984L95537
3395.9F18546546L67462L03745K94865L04877L21746L62814L90947M06265L66390K47240
3416.3F21912897J64687K05577K86579K91467K38835K34008L52860N27143N93305O04212
3436.7F25411570O09577N58972N21183M41373M59253P17938Q39114O86348N03182M38333
$$ y = [612903953, 612256348, 611644030, 611118317, 610767305, 610616624, 610611856, 610729873, 610951364, 611210406, 611486435, 611780524, 612055600, 612307250, 612548530, 612703621, 612719238, 612765193, 612997293, 613272190, 613413036, 613464534, 613549709, 613702178, 613841593, 613917291, 614003778, 614139855, 614246130, 614307880, 614415169, 614560306, 614649296, 614689946, 614745021, 614769638, 614747703, 614797354, 614985585, 615248322, 615492225, 615690887, 615889192, 616159797, 616497695, 616821110, 617127955, 617428958, 617653131, 617847025, 618151009, 618546546, 618914008, 619217753, 619512618, 619817495, 620139241, 620502055, 620893002, 621299267, 621665657, 621912897, 622077584, 622283161, 622569740, 622861207, 623100042, 623334050, 623686910, 624214053, 624807358, 625411570, 626021147, 626580119, 627101302, 627542675, 628001928, 628719866, 629558980, 630245328, 630748510, 631186843]
3457.1F31186843M63426N05984N75960O11364N87285N54621N45085N77032N46336M06206
3477.5F36560142K98858M23491N99801N35429N03123O52611O44326M33683L55602L93390
3497.9F41400456K72990K14994N30004P04408M89294N05031P58171P48992N05983L17395
3518.3F46447718J65224J550Q1301L01420N23627P71702O88314M07934M27783N27858
3538.7F50344431K20716k85565l56973K24233O34074M72546N64217P67589M23551l4094
3559.1F52974725k76983p00414j099229l159J722872J502872M74155J01506J50264
3577.5F54846609J13964j51873q02278j429439o15478P74742K34305r37104j168847
3595.8F50864601j082718j054943n43117j73748m23670j82867N63205P03156O81579
$$ y = [631186843, 631650269, 632156253, 632732213, 633343577, 633930862, 634485483, 635030568, 635607600, 636153936, 636560142, 636859000, 637282491, 637882292, 638417721, 638920844, 639573455, 640217781, 640651464, 641007066, 641400456, 641673446, 641888440, 642418444, 643122852, 643612146, 644117177, 644875348, 645624340, 646130323, 646447718, 646612942, 646614492, 646695793, 646997213, 647520840, 648292542, 648980856, 649388790, 649816573, 650344431, 650565147, 650279582, 649922609, 650146842, 650780916, 651253462, 651817679, 652585268, 653008819, 652974725, 652697742, 651997328, 650898099, 650894940, 652617812, 654120684, 654594839, 654696345, 654846609, 654960573, 654808700, 654006422, 652576983, 651961505, 652736247, 652970552, 652033448, 650864601, 649781883, 648726940, 648183823, 648010075, 647586405, 647403538, 647966743, 648669899, 649351478]
3614.2F49351478M12583K10583J293481J793742M39584j392961j390457J187027J795411
3632.5F53700471P84218K45929o3300l13163o53088j657248k837300j618147K132595
3650.9F49720967K814293J209855Q67426J244784Q27193K90096m04120j636147k036691
3669.2F52897656o62684n99921n38171J832962K410889J457036L61502j099408k214193
3687.6F53845668j035452J522958J875580Q71777R716n91517k78413O21259Q3506j329899
3708F55595183j628399L05236J941085J139939j62900p34687n73277j06037M07815
3726.4F56183958L12448r75311k305627j688898Q46148J959205M99606j496137j421988
3744.7F51913404l0040n27799j26779J937508J703441K56419N5790Q35956N51164k90037
$$ y = [649351478, 649764061, 649974644, 651268125, 653061867, 653501451, 652108490, 650718033, 651905060, 653700471, 654484689, 654730618, 654667318, 654354155, 653701067, 652043819, 649206519, 647588372, 649720967, 652535260, 653745115, 654612541, 655857325, 656684518, 656974614, 656570494, 654934347, 652897656, 652234972, 651635051, 651096880, 652929842, 655340731, 656797767, 657159269, 656059861, 653845668, 652810216, 654333174, 656208754, 657080531, 657090247, 656498730, 656220317, 656841576, 656925082, 655595183, 653966784, 654272020, 656213105, 657353044, 657190144, 656455457, 655882180, 655776143, 656183958, 656496406, 655521095, 653215468, 651526570, 652372718, 654331923, 654831529, 653335392, 651913404, 651883364, 651355565, 651228786, 653166294, 654869735, 655126154, 655181944, 656017900, 656569064, 656279027]
3765.1F56279027n10990j43647Q23915J050889L7611q73566o14464K21610K35379J61886
3785.5F56667650L94463K85864j05798q88109j480639j267791j237452n27799O17921
3803.9F52458310L40879P00474J106858n5671j476347j549661q59082p04050P83920
3822.2F50745630J635969P45296J90735k91347o95825r30846j269698n70893Q73744
3840.6F50432765J434803J336635O69419p07924k473235k542317J143396K517521R95696
3858.9F52806759m52519j057803m12464k11895q12948k71737O93619J104832N09798
3877.3F51895642p21574n45918Q285J14500N27918K9564k64644N48064L19064r48310
3897.7F50962591j474857q07285L65078J418173J450241P01904L7432m67599p29858
$$ y = [656279027, 655768037, 655624390, 656448305, 657499194, 657536805, 656663239, 656048775, 656270385, 656505764, 656667650, 657062113, 657347977, 657242179, 656354070, 654873431, 653605640, 652368188, 651840389, 652458310, 652799189, 653499663, 654606521, 654550850, 653074503, 651524842, 650665760, 649961710, 650745630, 652381599, 653126895, 653317630, 653026283, 652330458, 651399612, 650129914, 649559021, 650432765, 651867568, 653204203, 653873622, 653165698, 650692463, 648150146, 649293542, 651811063, 652806759, 652354240, 651296437, 650883973, 650672078, 649859130, 649587393, 650281012, 651385844, 651895642, 651174068, 650628150, 650636435, 650750935, 651278853, 651308417, 651043773, 651591837, 651910901, 650962591, 649487734, 648680449, 649045527, 650463700, 651913941, 652615845, 652653277, 652185678, 651455820]
3916F51455820k86937L29137K30789J5437K22564L338m42028K3127Q43525Q79108K68996
3938.5F53542876l44097l44277K8312k0921q6009K30670L45885J42456k4677q8155
3958.9F53382063r5308N901K6882j30892j80066j56104k11120j13606J11579J68682
3979.3F52808011J35481J37925N9068m8339p9393p2659N901R7156O4909
3997.6F53108060
$$ y = [651455820, 651168883, 651498020, 651728809, 651744246, 651966810, 651970148, 651528120, 651551247, 652394772, 653273880, 653542876, 653198779, 652854502, 652882814, 652861893, 652775884, 653006554, 653352439, 653494895, 653470218, 653382063, 653286755, 653292656, 653319538, 653188646, 653008580, 652852476, 652641356, 652527750, 652639329, 652808011, 652943492, 653081417, 653140485, 653092146, 653012753, 652940094, 652945995, 653043151, 653108060]
##END=$$ End of the data block
