##TITLE=Chaldo $$ Begin of the data block
##JCAMP-DX=5.00 $$ ACD/SpecManager v 10.08
##SPECTROMETER/DATA SYSTEM=Alpha
##DATE=25 Jun 2015 11:03:10
##DATA TYPE=INFRARED SPECTRUM
##DATA CLASS=XYDATA
##ORIGIN=
##OWNER=
##NPOINTS=1765
##FIRSTX=399.76428223
##LASTX=3997.64306641
##MAXX=3997.64306641
##MINX=399.76428223
##MAXY=0.84859085
##MINY=0.52364081
##XFACTOR=1.0000000000
##YFACTOR=1.000000000000000e-9
##FIRSTY=0.83302891
##DELTAX=2.03961372
##XUNITS=1/CM
##YUNITS=ARBITRARY UNITS
##XYDATA=(X++(Y..Y))
399.8H33028913l051043k012253l05414j972735j344144J217007O79613J188397K022326
$$ 833028913 829977870 827965617 827660203 825687468 824343324 825560331 826239944 827428341 829450667
418.1H29450667j698315k226413k42054j218498q07523R1850j365840j048803j67072
$$ 829450667 827752352 825525939 825283885 824065387 823257864 823349714 821983874 820935071 820767999
436.5H20767999j175106j97351J256704K90156L05712N10335q70705o75559j89602
$$ 820767999 819592893 819395542 820652246 820942402 821248114 821758449 820887744 820212185 820022583
454.8H20022583k494335m172802k389550P56621L830910L828346Q28445p6651J1086
$$ 820022583 817528248 813355446 810965896 811722517 815553427 819381773 820210218 820133567 820144653
473.2H20144653j645147j700581j089394k623558m142761n568624n986094j033783
$$ 820144653 818499506 816798925 815709531 813085973 808943212 803374588 797388494 796354711
489.5G96354711M545152L911197J330436k38002k719640l948152m407943o254196k807438
$$ 796354711 800899863 804811060 806141496 805903494 803183854 799235702 794827759 788573563 785766125
507.9G85766125O118178Q826375M892647J536012j072943l843963n282581k650499
$$ 785766125 791884303 800710678 805603325 807139337 806066394 802222431 796939850 794289351
524.2G94289351M257082P551432L125787j884759j601219J302719K530098K437830
$$ 794289351 798546433 806097865 809223652 807338893 805737674 807040393 809570491 812008321
540.5H12008321J444936L25978N23627J79112q16167m95493l92080j060545n59807
$$ 812008321 813453257 813779235 814302862 814481974 813665807 813170314 812778234 811717689 811157882
558.9H11157882n9843m55558j47224l0040p78139n96762l51965j071453r53138r09627
$$ 811157882 811098039 810642481 810495257 810465217 809687078 809090316 808738351 807666898 806713760 805804133
579.3H05804133k166628k605975l091455n950808p116139j745761N950809Q913577
$$ 805804133 803637505 801031530 797940075 791989267 784873128 783127367 789078176 797991753
595.6G97991753O876111L233254J071035M01021r83358k208769k134979j464367m36783
$$ 797991753 804867864 808101118 809172153 809573174 808589816 806381047 804246068 802781701 802344918
613.9H02344918k76446j279116k07543L335774M532099K539455O23465j203418k642035
$$ 802344918 802068472 800789356 800581813 803917587 808449686 810989141 811612606 810409188 807767153
632.3H07767153j496732P89284J624465J028359q93891l446817o151855j1957288k0364761
$$ 807767153 806270421 807059705 808684170 809712529 808818638 805371821 799219966 787262678 766897917
650.6G66897917j8114388K442479K2161901K3447037J3935804N087793M22478l392399
$$ 766897917 748783529 751226008 773387909 796834946 810770750 815858543 816281021 812888622
667H12888622q664787n372822R88901L578842J694679l273785q216679j0096848r592474
$$ 812888622 804223835 798851013 799839914 803418756 805113435 801839650 793622971 783526123 773933649
685.3G73933649k037466R583533J0249615P889032J0590732P295728q37505n616009
$$ 773933649 771896183 781479716 791729331 799618363 810209095 817504823 816667318 811051309
701.6H11051309r125531j8444419l2034873k6689590P196367L1879366K5376439J0840893
$$ 811051309 801925778 783481359 751446486 724756896 731953263 763832629 789209068 800049961
717.9H00049961L697931K251327K207041O15359j146436j986742k247751j662970j495420
$$ 800049961 803747892 805999219 808206260 808821619 807675183 805688441 803440690 801777720 800282300
736.3H00282300l215194n884648o044745q68261L184676p02321p872582j1817276j0941744
$$ 800282300 797067106 791182458 785137713 784269452 787454128 786751807 778879225 767061949 756120205
754.7G56120205n254865L418625R913146J0381341O582081K816558L498674R617686
$$ 756120205 750865340 754283965 764197111 774578452 781160533 783977091 787475765 797093451
771G97093451J3306558R100139K965510l52979k854466m840314n087257o518662r471833
$$ 797093451 810400009 819500148 822465658 822112679 819258213 814417899 809330642 802811980 793340147
789.3G93340147p510543Q03113P474243P225871K400339k903342o896794j1433840
$$ 793340147 785829604 786632717 794106960 801332831 803733170 800829828 793933034 782499194
805.6G82499194j7468393j7973602p405281K426267K001822J911581P218182Q689046
$$ 782499194 765030801 747057199 739651918 742078185 744080007 745991588 753209770 761898816
822G61898816J689076j1558652k9764652m8861444m5892060n393386L3852399L1303405
$$ 761898816 763587892 752029240 722264588 673403144 627511084 622117698 655970097 687273502
838.3F87273502P534385q80659J0542930K4359226K6728988J9372761J1153221O819427
$$ 687273502 694807887 693927228 704470158 728829384 755558372 774931133 786084354 792903781
854.6G92903781O362319Q424103J0284543R067297N985141M194379L335059K029120
$$ 792903781 799266100 807690203 817974746 827042043 833027184 837221563 840556622 842585742
870.9H42585742R39608O18279J000583J752019J553118J41502q78453j410902k489328
$$ 842585742 843525350 844143629 845144212 846896231 848449349 848590851 847712398 846301496 843812168
889.3H43812168l822506n394280p436454p776976l949284K260983O585121P001042
$$ 843812168 839989662 834595382 827158928 819381952 815432668 817693651 824278772 831279814
905.6H31279814M731179K593696J628279P35522n0009k41995n92947j119017j127839
$$ 831279814 836010993 838604689 840232968 840968490 840918481 840676486 840083539 838964522 837836683
923.9H37836683j188100j543939j588404j752674k284348k575875l135025m498720
$$ 837836683 836648583 835104644 833516240 831763566 829479218 826903343 823768318 819269598
940.3H19269598n775989n876004l801823p91013m56989l353477p830023j4542997k2098899
$$ 819269598 813493609 807617605 803815782 803024769 802567780 799214303 791384280 776841283 754742384
958.6G54742384k1124721l904879J5524030J6368747P581889P644654J1679411J1024713
$$ 754742384 733617663 729712784 745236814 761605561 769187450 776832104 788511515 799536228
974.9G99536228P914782N107581L023982J576126N59747j7881o19292j274646j488089
$$ 799536228 807451010 812558591 815582573 817158699 817718446 817700565 817081273 815806627 814318538
993.3H14318538j737714k331197k887845l717244n287886p423579q568049n138636
$$ 814318538 812580824 810249627 807361782 803644538 798356652 790933073 782365024 777226388
1009.6G77226388J840532N106569K086043l543019q869708j2982190j5181243j5300155
$$ 777226388 779066920 784173489 786259532 782716513 773846805 760864615 745683372 730383217
1025.9G30383217j3671934q562684L541410K0076334K9211998K4270475J2599945L366351
$$ 730383217 716711283 708148599 711690009 731766343 760978341 785248816 797848761 801215112
1042.2H01215112j930237n730569r112060j1331439j1711836r189010k816379O797970
$$ 801215112 799284875 793554306 784442246 773110807 761398971 752209961 749393582 756191552
1058.6G56191552J7278492K1965146J6390324O889343J131296q52525j605630j817882
$$ 756191552 773470044 795435190 811825514 818714857 819846153 818993628 817387998 815570116
1074.9H15570116j712620j743019j648962j333118j291096j469016j746416k350033
$$ 815570116 813857496 812114477 810465515 809132397 807841301 806372285 804625869 802275836
1091.2H02275836l006160l493249m257262n156875n640506o555438q460939p445097
$$ 802275836 799269676 795776427 791519165 786362290 780721784 774166346 765705407 758260310
1107.5G58260310m64619P175863J0438979R671509N711735Q01384k174020j909494
$$ 758260310 757795691 764971554 775410533 785082042 790793777 791595161 789421141 787511647
1123.8G87511647J044035L770709L946364K436042P63177q04007k010822k341986j400172
$$ 787511647 788555682 792326391 796272755 798708797 799471974 798667967 796657145 794315159 792914987
1142.2G92914987Q5830L70503q78453k174736k549767k589643k739847k499044k012312
$$ 792914987 793000817 793371320 792492867 790318131 787768364 785178721 782438874 779939830 777927518
1160.5G77927518k068937k727807l816664n206704o778955q697391j0617971j1622012
$$ 777927518 775858581 773130774 769314110 764107406 757328451 748631060 738013089 726391077
1176.9G26391077j1792004j1937559j2515485j4069021j6277671j5774488o117165
$$ 726391077 714599073 702661514 690146029 676077008 659799337 644024849 637907684
1191.1F37907684J3294518L0895114L4835577K4886727R705424l254771j1070967r847939
$$ 637907684 651202202 682097316 716932893 741819620 751525044 748270273 737199306 727351367
1207.5G27351367j543819J5199r695769j7612457j5686333p709920K906262J5746832
$$ 727351367 725807548 725822747 716126978 698514521 682828188 675118268 678024530 693771362
1223.8F93771362K6129186K5802255J4475703O00815p481277o643593m853666j2754202
$$ 693771362 719900548 745702803 760178506 760779321 753298044 746654451 741800785 729046583
1240.1G29046583k1893561j2989700J0340393K2959769J6948223P524431N320489P959724
$$ 729046583 707153022 694163322 704503715 727463484 744411707 751936138 757256627 765216351
1256.4G65216351Q279204L547907j545787k520263m45128J491666J916528M76181k935469
$$ 765216351 773495555 777043462 775497675 772977412 772532284 774023950 775940478 776416659 773481190
1274.8G73481190o944358r832859j1457026j2142182j1954128j0979176p296145J726151
$$ 773481190 766536832 756703973 745246947 733104765 721150637 710171461 702875316 704601467
1291.1G04601467J1426329J2458325N100369k719283p683039q069038p53880R166599
$$ 704601467 716027796 728486121 733586490 730867207 723184168 715115130 714361250 723527849
1307.4G23527849J2023389O897211j509249q136153m643560J1516810K3958623J8921316
$$ 723527849 735551238 742448449 740939200 732803047 728159487 739676297 763634920 782556236
1323.7G82556236N854487l173291p293284q622349p146597l633618k004504k346873
$$ 782556236 788410723 785237432 777944148 769321799 762175202 758541584 756537080 754190207
1340G54190207K693057J1401176J3103426R146988P240772N950809K893269l04401
$$ 754190207 756883264 768284440 781387866 790534854 797775626 803726435 806619704 806315303
1356.4H06315303k576649m445792p445573j1618853j5141070j6932130j4013529o253659
$$ 806315303 803738654 799292862 791847289 780228436 765087366 748155236 734141707 727888048
1372.7G27888048J845538P917822J2152493J3496935J2161672J0793150R153008N377412
$$ 727888048 729733586 737651408 749803901 763300836 775462508 786255658 795408666 800786078
1389H00786078K153575J683236J576483L06368j096607j958310k217531k822161l728330
$$ 800786078 802939653 804622889 806199372 806505740 805409133 803450823 801233292 798411131 794682801
1407.3G94682801m298568n357027o949306n975902j172185K030373N6088j393437J69992
$$ 794682801 790384233 785027206 778077900 772101998 770929813 772960186 773016274 771622837 771792829
1425.7G71792829L077269M746854L669321J785756J0550k036453j582622O07729J631737
$$ 771792829 774870098 779616952 783286273 785072029 785082579 783046126 781463504 782071233 783702970
1444.1G83702970O09159j609027l250957l181279k025365j523257l354311l980875
$$ 783702970 784312129 782703102 779452145 776270866 774245501 772722244 769367933 765387058
1460.4G65387058k853274l200471m662872m075467k824963m861712r747028j3580919
$$ 765387058 762533784 759333313 754670441 750594974 747770011 742908299 733161271 719580352
1476.7G19580352j5323579j3218939m404247J0018468K2554993K5290609J6524374
$$ 719580352 704256773 691037834 686633587 696652055 719207048 744497657 761022031
1491G61022031O566525K185166q74102m618824o014347n007625n054235r568095j1472106
$$ 761022031 767588556 769773722 768899620 764280796 758266449 753258824 748204589 738636494 727164388
1509.3G27164388r608686r153724j1035264j3787448j0212183K950549K0082176K9289305
$$ 727164388 717555702 708401978 697366714 683579266 673367083 676317632 696399808 725689113
1525.6G25689113K4805725J0949313r9063p899403r752095m789650J582622L084123
$$ 725689113 750494838 761444151 761345088 753445685 743693590 738903940 740486562 743570685
1542G43570685j041054n007208p252454q712769r391606r159028q479715j3005018
$$ 743570685 742529631 737522423 730269969 721557200 712165594 703006566 694526851 681521833
1558.3F81521833k1482825j7479897j4343440j3977707j0923803k647936R093642J5702665
$$ 681521833 660039008 642559111 628215671 614237964 603314161 600666225 609759867 625462532
1574.6F25462532Q486927q951247j3812482m297495J1079609K2360325K3173749J2271822
$$ 625462532 633949459 624998212 611185730 606888235 617967844 640328169 663501918 675773740
1590.9F75773740k561093j2389719j7311156k2138536k6596248k6522636k1268845
$$ 675773740 673212647 660822928 643511772 621373236 594776988 568254352 546985507
1605.2E46985507n589008K8136491N9988797O1536074M3047666K1275461M326761k335131
$$ 546985507 541396499 569532990 629521787 691057861 734105527 755380988 759707749 757372618
1621.5G57372618m460991l411650j409591k114415l113448l376484p074178j1899232
$$ 757372618 752911627 749499977 748090386 745975971 742862523 739486039 732411861 720512629
1637.8G20512629j3834298j6546190j8948853j7089724l974796J0960877K2149742
$$ 720512629 706678331 690132141 671183288 654093564 650118768 661079645 683229387
1652.1F83229387K7857542J7587244J2791217J2625158J0346531N330444J381039n46276
$$ 683229387 711086929 728674173 741465390 754090548 764437079 769767523 771148562 770602286
1668.4G70602286k795696l028751r14216J338959M002213P114113R663760Q793652
$$ 770602286 767806590 764777839 763863623 765202582 769204795 776318908 785982668 794776320
1684.7G94776320L810585K349377L650248N101621O546795N917728L399015P13646
$$ 794776320 798586905 800936282 804586530 809688151 816234946 822152674 825551689 826265335
1701.1H26265335p62999n89669r52720j235962m60446O31094J222133l9219k212644
$$ 826265335 825502336 824912667 823959947 822723985 822263539 822894633 824116766 824077547 821864903
1719.4H21864903k018809r09686l57032J08659P20501J179755M83274j470744j395405
$$ 821864903 819846094 818936408 818579376 818688035 819408536 820588291 821071565 819600821 818205416
1737.8H18205416o29365p18057n47171N8413M43875j72138j269996j087189k75910
$$ 818205416 817576051 816857994 816310823 816369236 816813111 816640973 815370977 814283788 814007878
1756.1H14007878m8756J3828l12150p08699j52290N43058P34687j72794j478493j270890
$$ 814007878 813959122 813972950 813660800 812952101 812799811 813342869 814077556 813904762 812426269 811155379
1776.5H11155379m17352k09629m22836n45025n84483j14023L18765n75781j486242
$$ 811155379 810738027 810528398 810105562 809560537 808976054 808862031 809180796 808605015 807118773
1794.9H07118773r33826k37524k67267m65513j53124M04000O84262L58522j45376j21772
$$ 807118773 806184947 805947423 805680156 805214643 805061519 805465519 806149781 806508303 806362927 806241155
1815.3H06241155K324q4996N9068L36170J90080O1094j22964q53956r26196m00961
$$ 806241155 806243479 806158483 806217551 806553721 806743801 806804895 806681931 805827975 804901779 804500818
1835.7H04500818k69234j69516K95759J35958q94547j214981r02235o75321n44250
$$ 804500818 804231584 804062068 804357827 804493785 803599238 802384257 801482022 800806701 800262451
1854H00262451m85182m52518m03583l33786m6671M21822K22564p54475j007915n41508
$$ 800262451 799777269 799324751 798921168 798587382 798540711 798962533 799185097 798430622 797422707 796881199
1874.4G96881199l27289l79086m52280n11050n03361l49760l32833o35504o95229n52952
$$ 796881199 796553910 796174824 795722544 795211494 794708133 794358373 794025540 793390036 792694807 792141855
1894.8G92141855o48380p27057p15733p98463q20220n73873j82510L7491Q6248J92285
$$ 792141855 791493475 790766418 790050685 789252222 788432002 787858129 787675619 787713110 787799358 787991643
1915.2G87991643J08719l19123m30584k70486k16067l6836J94431K92480K95937K93016
$$ 787991643 788100362 787781239 787350655 787080169 786864102 786827266 787021697 787314177 787610114 787903130
1935.6G87903130L37005M59730M44472K7955l27826k89321j54316j17183j50323k04027
$$ 787903130 788240135 788699865 789144337 789172292 788844466 788555145 788400829 788283646 788133323 787929296
1956G87929296k37882k24292j79231j09553j31667l28481m61281l97324k84136k17020
$$ 787929296 787691414 787467122 787287891 787178338 787046671 786718190 786256909 785859585 785575449 785358429
1976.4G85358429k18451k46286k46823k06471j42872q3327j14620l25024m71592m00543
$$ 785358429 785139978 784893692 784646869 784440398 784297526 784214199 784099579 783774555 783302963 782902420
1996.8G82902420l18408l04461l24905l34620k93076k71619k97904k72274k32816l61263
$$ 782902420 782584012 782279551 781954646 781620026 781326950 781055331 780757427 780485153 780252337 779891074
2017.2G79891074n78821o65367p19010n88537k6643L18348J01567j52350k51710k46048
$$ 779891074 779312253 778646886 777927876 777339339 777312696 777631044 777732611 777580261 777328551 777082503
2037.6G77082503j81973k09808k89739k92062k90871l05295k61545k06948j35839j8179
$$ 777082503 776900530 776690722 776400983 776108921 775818050 775512755 775251210 775044262 774908423 774890244
2058G74890244N9128Q9288J15513L8028j03950j53900j67191k16305k29537k14696
$$ 774890244 774949372 775038660 775154173 775192201 775088251 774934351 774767160 774550855 774321318 774106622
2078.4G74106622k36273k16425j46389j05023m7147j2338r8706j74820j53661j65403
$$ 774106622 773870349 773653924 773507535 773402512 773355365 773343027 773244321 773069501 772915840 772750437
2098.8G72750437k00450j54972j39356j82748j73211j83761k19226j66833r3639o0082
$$ 772750437 772549987 772395015 772255659 772072911 771899700 771715939 771496713 771329880 771236241 771176159
2119.2G71176159r834j3292r3580j01149q9526j69575j91391j46448j86086k00033
$$ 771176159 771166325 771153033 771059453 770958304 770868778 770699203 770507812 770361364 770175278 769975245
2139.6G69975245j49727j76787j91808j43766j63258j65164q6606r1552j36674j19388
$$ 769975245 769825518 769648731 769456923 769313157 769149899 768984735 768898129 768806577 768669903 768550515
2160G68550515j47343j98304k06590k53916k00688K1338O8784q1897j18494j01030
$$ 768550515 768403172 768204868 767998278 767744362 767543674 767565012 767633796 767551899 767433405 767332375
2180.4G67332375j82211k08617j73211k21431k32875j63257j73212j85072j37985j85072
$$ 767332375 767150164 766941547 766768336 766546905 766314030 766150773 765977561 765792489 765654504 765469432
2200.8G65469432k27988j70588j80781j99616j03176o1452j15216j25408j57118k10881
$$ 765469432 765241444 765070856 764890075 764690459 764587283 764525831 764410615 764285207 764128089 763917208
2221.2G63917208j71066j61588j98901j40011j25468k06172j77264j31965k02000k03312
$$ 763917208 763746142 763584554 763385653 763245642 763120174 762914002 762736738 762604773 762402773 762199461
2241.6G62199461j49488j80662j82509j51754j92046j71363p3433q8036j48773j45078
$$ 762199461 762049973 761869311 761686802 761535048 761343002 761171639 761098206 761010170 760861397 760716319
2262G60716319j89423k36094j98782j94728j95623j56939j93536k11418j33335j54496
$$ 760716319 760526896 760290802 760092020 759897292 759701669 759544730 759351194 759139776 759006441 758851945
2282.3G58851945k35974j84894j42395j81020j39892j45912k82884k99811k48909l13878
$$ 758851945 758615971 758431077 758288682 758107662 757967770 757821858 757538974 757239163 756990254 756676376
2302.7G56676376l50177l28362l69192l74019k85685k45452k42948k17319k61366l14355
$$ 756676376 756326199 755997837 755628645 755254626 754968941 754723489 754480541 754263222 754001856 753687501
2323.1G53687501k71916k92182l43800k59578k47061l82841m27187l80277k78652l8981
$$ 753687501 753415585 753123403 752779603 752520025 752272964 751890123 751462936 751082659 750804007 750765026
2343.5G50765026K36213L95000L15368k5809m10378m94540l92854l53336k36869j2934
$$ 750765026 751001239 751396239 751711607 751685798 751275420 750780880 750388026 750034690 749797821 749784887
2363.9G49784887J85311L28004L18825J69993J03593J38104J31189J42694J55270L0220
$$ 749784887 749970198 750298202 750617027 750787020 750890613 751028717 751159906 751302600 751457870 751488090
2384.3G51488090j03951j55985k57492l16620k36929k06053k38121j92999j68562k01941
$$ 751488090 751384139 751228154 750970662 750654042 750417113 750211060 749972939 749779940 749611378 749409437
2404.7G49409437j57893j27971j89125j92225j50562j86443k25425k14338k31802k29955
$$ 749409437 749251544 749123573 748934448 748742223 748591661 748405218 748179793 747965455 747733653 747503698
2425.1G47503698j68622j36971j28627j04010j11997j26779j22309j46270j51992j27971
$$ 747503698 747335076 747198105 747069478 746965468 746853471 746726692 746604383 746458113 746306121 746178150
2445.5G46178150j60098k18809k44319k77400k84910k06828j57357j82330j49906j22011
$$ 746178150 746018052 745799243 745554924 745277524 744992614 744785786 744628429 744446099 744296193 744174182
2465.9G44174182j86324j89066j34825j62304k03550j80006j47342j08004q6725j59025
$$ 744174182 743987858 743798792 743663967 743501663 743298113 743118107 742970765 742862761 742776036 742617011
2486.3G42617011k57373l07798l57032l87907l61264l62217l68655k84791j89125j23382
$$ 742617011 742359638 742051840 741694808 741306901 740945637 740583420 740214765 739929974 739740849 739617467
2506.7G39617467k3842L8564N126m589J0073o2108j49071j83523k18689k16246j64271
$$ 739617467 739593625 739632189 739637315 739632726 739642799 739580691 739431620 739248097 739029408 738813162 738648891
2529.1G38648891j34408j05441q0585j08361j27495j16586j71245k55525k57432k55585
$$ 738648891 738514483 738409042 738328457 738220096 738092601 737976015 737804770 737549245 737291813 737036228
2549.5G37036228k89500k76625k72572l01480k59817k07722k25425k07603j45852j19865
$$ 737036228 736746728 736470103 736197531 735896051 735636234 735428512 735203087 734995484 734849632 734729767
2569.9G34729767q6606m9948r9600j92463k50280l03090l30209l23117l42846l19600
$$ 734729767 734643161 734593213 734493613 734301150 734050870 733747780 733417571 733094454 732751608 732432008
2590.3G32432008k14815j58370j70469j44184r2983o4254l8266m3154p7247p0394o3836
$$ 732432008 732217193 732058823 731888354 731744170 731651187 731586933 731548667 731505513 731428266 731357872 731294036
2612.8G31294036j11580j21534r3102q9348o4432n0128p9155p5519m3154l5286j1444
$$ 731294036 731182456 731060922 730967820 730878472 730814040 730763912 730684757 730609238 730566084 730530798 730519354
2635.2G30519354J2577n8353j62303k07782k42055k42769j79708j71543k02775j73509
$$ 730519354 730531931 730473578 730311275 730103493 729861438 729618669 729438961 729267418 729064643 728891134
2655.6G28891134j61469j87158j68562j46747j67966j78635j74343j82629j71125j62423
$$ 728891134 728729665 728542507 728373945 728227198 728059232 727880597 727706254 727523625 727352500 727190077
2676G27190077j99198k15769k04683k36213k54571k27928k42412k66433k48492k62678
$$ 727190077 726990879 726775110 726570427 726334214 726079643 725851715 725609303 725342870 725094378 724831700
2696.4G24831700l05354l33548l85046m24206l93033l71099l80814l24964j87099j4723
$$ 724831700 724526346 724192798 723807752 723383546 722990513 722619414 722238600 721913636 721726537 721711814
2716.8G21711814J22011R7275n3644j40548k06351k97547k48074j40071j33872j08242
$$ 721711814 721833825 721931100 721877456 721736908 721530557 721233010 720984936 720844865 720710993 720602751
2737.2G20602751l5644l0398n4717k4855K086k2710n0187j03473j60218j59621j82390
$$ 720602751 720567107 720536709 720481992 720457137 720459223 720436513 720386326 720282853 720122635 719963014 719780624
2759.6G19780624k21610k33054k96951l66509l39925k81691k53737k80977l68476l88384
$$ 719780624 719559014 719325960 719029009 718662500 718322575 718040884 717787147 717506170 717137694 716749310
2780G16749310k49803r2804l338J12832J24395m9293j32084p2539j09196k35915k52128
$$ 716749310 716499507 716406703 716403365 716516197 716640592 716591299 716459215 716386676 716277480 716041565 715789437
2802.4G15789437j91152j55031j31250k03490l39747l34501k50459k09033j61052j51515
$$ 715789437 715598285 715443254 715312004 715108514 714768767 714434266 714183807 713974774 713813722 713662207
2822.8G13662207j80721j58608j49131j89722k13980k37644k64466l61860n70356o73175
$$ 713662207 713481486 713322878 713173747 712984025 712770045 712532401 712267935 711906075 711335719 710662544
2843.2G10662544n91040n26011n60403n15759l44634j95086o0320K0802m0590q9705
$$ 710662544 710071504 709545493 708985090 708469331 708124697 707929611 707869291 707890093 707849503 707759798
2863.6G07759798o1095q2791o1691O1929l4690l34560m19796l20196k69234k71499
$$ 707759798 707698703 707615912 707554221 707616150 707581460 707246900 706827104 706506908 706237674 705966175
2884G05966175l01123l03984k50339k00629j55628j44601k26021k69532k24650k21670
$$ 705966175 705665052 705361068 705110729 704910100 704754472 704609871 704383850 704114318 703889668 703667998
2904.4G03667998k73466k91884k58744k87532m75884o92427p58827o64591m67003k63274
$$ 703667998 703394532 703102648 702843904 702556372 702080488 701388061 700629234 699964643 699497640 699234366
2924.8F99234366n3703J19209N4657p4565l1114L9161O0081J16289J46329K2054k08795
$$ 699234366 699180663 699299872 699354529 699279964 699248850 699288011 699348092 699464381 699610710 699632764 699423969
2947.2F99423969l65973l75747l87192m82202m90486l64840k66850k26021j39237l8683
$$ 699423969 699057996 698682249 698295057 697812855 697322369 696957529 696690679 696464658 696325421 696286738
2967.6F96286738j6630m053L0398J0670J4245M2856n6446j91331k26020k22981j77920
$$ 696286738 696270108 696266055 696296453 696307123 696321368 696364224 696307778 696116447 695890427 695667446 695489526
2990.1F95489526j67191l13580m04001m08470n18561o03497o12735o36042n75900m31060
$$ 695489526 695322335 695008755 694604754 694196284 693677723 693074226 692461491 691825449 691249549 690818489
3010.5F90818489m14133n81444p55489q27312q09372p41899p09235p42019p76648r16064
$$ 690818489 690404356 689822912 689067423 688240111 687430739 686688840 685979605 685237586 684460938 683544874
3030.9F83544874j272380j649916j712978j290560p07149l27766J6570N19633J026690
$$ 683544874 682272494 680622578 678909600 677619040 676911891 676584125 676600695 677120328 678147018
3049.2F78147018J333058J424968J337826J025260O33180L58164J08481j87755m47512
$$ 678147018 679480076 680905044 682242870 683268130 683901310 684259474 684367955 684180200 683732688
3067.6F83732688n03242j88708K81274N70834O12438M34816K19404J31190O2049j3054
$$ 683732688 683229446 683040738 683322012 683892846 684505284 684940100 685159504 685290694 685352743 685339689
3088F85339689r2506k97666n28216p10487r28939j228332j605988j922905k140701
$$ 685339689 685247183 684949517 684421301 683710814 682781875 681553543 679947555 678024650 675883949
3106.3F75883949k341867k271771j477599k41161N83768Q65042R64940Q14021J15156
$$ 675883949 673542082 671270311 669792712 669551551 670135319 671000361 671965301 672779322 672894478
3124.7F72894478j294434l139675m151583k423465J997590N800545O324530M476786
$$ 672894478 671600044 668460369 664308786 661885321 663882911 669683456 676007986 680484772
3141F80484772K445221J178026M65453j6332l66688o27100p16925n23031k50935j74642
$$ 680484772 682929993 684108019 684573472 684557140 684190452 683563352 682846427 682323396 682072461 681897819
3161.4F81897819k69294m00662m99427n65053o40869p18891p40052p41243p85649q18193
$$ 681897819 681628525 681227863 680728436 680163383 679522514 678803623 678063571 677322328 676536679 675718486
3181.8F75718486p94410p94769q22186q09610q09431q13902p99059q29995q67188q35300
$$ 675718486 674924076 674129307 673307121 672497511 671688080 670874178 670075119 669245124 668377936 667542636
3202.2F67542636p60257o98566o78540o78718p00056p58290q05736q55088r45092j018464
$$ 667542636 666782379 666083813 665405273 664726555 664026499 663268209 662462473 661607385 660662293 659643829
3222.6F59643829j044691j044273r79781q05974o96600q93295j141190j089275r13322
$$ 659643829 658599138 657554865 656575084 655769110 655072510 654179215 653038025 651948750 651035428
3240.9F51035428p87973o87361p16269q51393q46684o96421o39379p15196p64191p50720
$$ 651035428 650247455 649560094 648843825 647992432 647145748 646449327 645809948 645094752 644330561 643579841
3261.3F43579841p03156o30379n28634l83973m43220p41005r20951r22203q61287q00670
$$ 643579841 642876685 642246306 641717672 641333699 640890479 640149474 639228523 638306320 637445033 636644363
3281.7F36644363p86185p60436o79016n67317n25713o69360q91149j045406j105249
$$ 636644363 635858178 635097742 634418726 633851409 633325696 632656336 631765187 630719781 629614532
3300.1F29614532j031876r10222r57489j221478j503229j603186j519382j459301j507342
$$ 629614532 628582656 627672434 626714945 625493467 623990238 622387052 620867670 619408369 617901027
3318.4F17901027j533329j468361j428663j609028j860440j941025j928866j840353
$$ 617901027 616367698 614899337 613470674 611861646 610001206 608060181 606131315 604290962
3334.8F04290962j694619j784265k069951k217173k227366k142787k010703k133429
$$ 604290962 602596343 600812078 598742127 596524954 594297588 592154801 590144098 588010669
3351.1E88010669k459705k577722k459467k344191k397477k478063k323330k185285
$$ 588010669 585550964 582973242 580513775 578169584 575772107 573294044 570970714 568785429
3367.4E68785429k424419k796709k790869k465665k223790k101958k056181k016544
$$ 568785429 566361010 563564301 560773432 558307767 556083977 553982019 551925838 549909294
3383.7E49909294j859129j616895j318395j261890j605868j718045j302123j028597
$$ 549909294 548050165 546433270 545114875 543852985 542247117 540529072 539226949 538198352
3400E38198352j381576j779914j588225j172841j003146j036465j129151j103997q79169
$$ 538198352 536816776 535036862 533448637 532275796 531272650 530236185 529107034 528003037 527123868
3418.4E27123868p27474p57516o84082m35174k40266k21372j33514Q2612L7611k12908
$$ 527123868 526396394 525638878 524954796 524519622 524279356 524057984 523924470 524007082 524044693 523831785
3438.8E23831785j90974Q8573L51548M65632L99887L93748N50449O96302Q10802R58919
$$ 523831785 523640811 523729384 524080932 524546564 524946451 525340199 525890648 526586950 527397752 528356671
3459.2E28356671R62675Q93295J092016J254023R23335N24640O13988R18865J158297
$$ 528356671 529319346 530212641 531304657 532558680 533482015 534006655 534620643 535539508 536697805
3477.5E36697805J240373R78112P85291R82821J053572R00268R47833J121462J200437
$$ 536697805 537938178 538916290 539701581 540684402 541737974 542638242 543586075 544707537 545907974
3495.9E45907974J185358J245320J316845J066148Q28445R75430J164675J272917J320302
$$ 545907974 547093332 548338652 549655497 550721645 551550090 552525520 553690195 554963112 556283414
3514.2E56283414J243115J244128J429617J630664J542747J243532J120686J200199
$$ 556283414 557526529 558770657 560200274 561830938 563373685 564617217 565737903 566938102
3530.6E66938102J362562J527906J481712J324475J499593J858413J837254J355111
$$ 566938102 568300664 569828570 571310282 572634757 574134350 575992763 577830017 579185128
3546.9E79185128J107335J305700J342117J259864J426101J672327J818359J938105
$$ 579185128 580292463 581598163 582940280 584200144 585626245 587298572 589116931 591055036
3563.2E91055036K035081J810968J286149J131892J420021J719952J870096K018094
$$ 591055036 593090117 594901085 596187234 597319126 598739147 600459099 602329195 604347289
3579.5F04347289K227842K477825K589882K118170J502275J644373K050936K091885
$$ 604347289 606575131 609052956 611642838 613761008 615263283 616907656 618958592 621050477
3595.8F21050477J996219J949430J876712K009987K307415K324582K055823J909197
$$ 621050477 623046696 624996126 626872838 628882825 631190240 633514822 635570645 637479842
3612.1F37479842J846254J828610J819671J379668R70483J390040K116442J986682
$$ 637479842 639326096 641154706 642974377 644354045 645324528 646714568 648831010 650817692
3628.5F50817692P90358L11434O12319P96079Q55744R52423J251817J854538K312363
$$ 650817692 651608050 651919484 652531803 653327882 654183626 655136049 656387866 658242404 660554767
3646.8F60554767J602411j88351p60138j29044K50518J70231J02699J72258N95927
$$ 660554767 662157178 661968827 661208689 661079645 661330163 661500394 661603093 661775351 662371278
3665.2F62371278J204908J202702N54621L74020O139r83834j050413m46081L08335
$$ 662371278 663576186 664778888 665333509 665707529 665713668 664729834 663679421 663233340 663541675
3683.5F63541675J160740J598180O98864p08580q30352k47300K10166M05789K12907
$$ 663541675 664702415 666300595 666999459 666290879 665460527 665213227 665423393 665829182 666042089
3701.9F66042089n6684K83182Q79705P89762k24352q82149n19872N9903L50654K55525
$$ 666042089 665985405 666268587 667148292 667938054 667713702 666831553 666311681 666371584 666722238 666977763
3722.3F66977763n3525k60949m0293O26564J180113P15434n72562r51707j45912N41448
$$ 666977763 666924238 666663289 666622996 667249560 668429673 669145107 668572545 667620838 667474926 668016374
3742.7F68016374L06308m4524J27971l44277j196861r39250k82287k16842m68254k76208
$$ 668016374 668322682 668278158 668406129 668061852 666864991 665925741 665643454 665426612 664958358 664682150
3763.1F64682150R4473J48952j42216n83709n96344j16468K91825J55508l11494m25160
$$ 664682150 664776623 664925575 664783359 664199650 663603306 663486838 663778663 663934171 663622677 663197517
3783.5F63197517l28719k83599j80125j431L04401N71907N60581L82066q6009n19395
$$ 663197517 662868798 662585199 662405074 662403643 662708044 663279951 663840532 664222598 664136589 663617194
3803.9F63617194n37217p21872o76632N245N73993N11348L32654J04725o85692r26792
$$ 663617194 663079977 662358105 661681473 661686718 662260711 662772059 663104713 663209438 662523746 661596954
3824.3F61596954m43697o4492K08795M07576N43654M34757k03252p39277p79986o66440
$$ 661596954 661153257 661088765 661297560 661705136 662248790 662683547 662480295 661741018 660961032 660294592
3844.6F60294592k63214N49555J200378N14746j210153j274467m37021J41322K55347
$$ 660294592 660031378 660580933 661781311 662296057 661085904 659811437 659374416 659515738 659771085
3863F59771085j3888k1994N5551l01957o36220n86092j76192J83583R6321J2398j00971
$$ 659771085 659757197 659735203 659790754 659488797 658852577 658266485 658090293 658273876 658370197 658382595 658281624
3885.4F58281624l44991k16544k31206m75288j01745N59449O66797J30773n92947j013279
$$ 658281624 657936633 657720089 657488883 657013595 656911850 657471299 658138096 658268869 657675922 656662643
3905.8F56662643q27074m10855p8678K05874K64407m2439k80201j71721p9394j37984
$$ 656662643 655835569 655424714 655346036 655551910 655816317 655773878 655493677 655321956 655242562 655104578
3926.2F55104578j02878n2750j88351l27587k76625r7752M7684j9968j59621j36793
$$ 655104578 655001700 654948950 654760599 654433012 654156387 654058635 654106319 654086351 653926730 653789937
3946.6F53789937j00731j80006k41638k00390j01567n1021r3580j39773j07705o2764
$$ 653789937 653689206 653509200 653267562 653067172 652965605 652914584 652821004 652681231 652573526 652510762
3967F52510762q6009j02341q4818r8646j23560j26541q6784n8711j21235j77563j25289
$$ 652510762 652424753 652322412 652237594 652138948 652015388 651888847 651802063 651743352 651622117 651444554 651319265
3989.5F51319265p3552j34289j85668j43528
$$ 651319265 651245713 651111424 650925756 650782228
3997.6F50782228
$$ 650782228
##END=$$ End of the data block
