##TITLE=Chalcona 2 $$ Begin of the data block
##JCAMP-DX=5.00 $$ ACD/SpecManager v 10.08
##SPECTROMETER/DATA SYSTEM=Alpha
##DATE=25 Jun 2015 13:07:00
##DATA TYPE=INFRARED SPECTRUM
##DATA CLASS=XYDATA
##ORIGIN=
##OWNER=
##NPOINTS=1765
##FIRSTX=399.76428223
##LASTX=3997.64306641
##MAXX=3997.64306641
##MINX=399.76428223
##MAXY=0.87979132
##MINY=0.61974752
##XFACTOR=1.0000000000
##YFACTOR=1.000000000000000e-9
##FIRSTY=0.86911035
##DELTAX=2.03961372
##XUNITS=1/CM
##YUNITS=ARBITRARY UNITS
##XYDATA=(X++(Y..Y))
$$ plain form
399.8 869110346 870651901 868664205 866920352 868609667 869591057 867312551 866119266 868130565 868996143
418.1 868996143 866536736 866070032 868336558 868202209 865106821 863916814 865608990 866004884 864357531
436.5 864357531 864781380 867340386 867501915 865380168 865479410 867490172 867397070 865637302 866135597
454.8 866135597 868154824 867396414 865097106 865477204 867290139 866507530 864362359 865030646 866989732
473.2 866989732 865950108 863629103 864007413 865369499 863377273 858629584 855124414 853764713 852423072
491.5 852423072 851774633 854650974 858768523 859183609 856412172 853747666 852091312 851873219 853780389
509.9 853780389 857198477 859209776 856877506 852062166 849891007 851683676 854367197 856498599
526.2 856498599 858948767 860013723 857253075 853208005 852633059 855388761 857427180 857993007 859449863
$$ packed form
399.8H69110346J541555j987696j743853J689315R81390k278506j193285K011299Q65578
418.1H68996143k459407m66704K266526j34349l095388j190007J692176L95894j647353
436.5H64357531M23849K559006J61529k121747R9242K010762r3102j759768M98295
454.8H66135597K019227p58410k299308L80098J812935p82609k145171O68287J959086
473.2H66989732j039624k321005L78310J362086j992226m747689l505170j359701j341641
491.5H52423072o48439K876341M117549M15086k771437k664506j656354k18093J907170
509.9H53780389L418088K011299k332270m815340k171159J792669K683521K131402
526.2H56498599K450168J064956k760648m045070n74946K755702K038419N65827J456856
$$ plain form
544.6 859449863 860790431 859523118 857634187 858030438 858881533 857487142 855770648 856611252 858171761
562.9 858171761 857418418 855893314 856443346 857535899 856470048 854802430 855193615 856112480 854678988
581.3 854678988 851939142 849969804 846510649 839306355 833945870 837432742 846275032 852272153
597.6 852272153 854373038 856236994 857630551 855638862 851107121 848617136 849919021 851233602
613.9 851233602 851275861 853916466 858234584 859625518 859074891 860059738 861820817 861518383 860116303
632.3 860116303 860386133 861382306 860348225 858297586 858311832 859539449 858328402 853950500 847555816
650.6 847555816 836748838 820478559 807873428 813406885 836092532 855930567 863107920 865150392
667 865150392 865875065 862385571 856789589 852672458 850706577 845457613 836255431 832432091 835247755
$$ packed form
544.6H59449863J340568j267313j888931L96251Q51095j394391j716494Q40604J560509
562.9H58171761p53343j525104N50032J092553j065851j667618L91185R18865j433492
581.3H54678988k739846j969338l459155p204294n360485L486872Q842290N997121
597.6H52272153K100885J863956J393557j991689m531741k489985J301885J314581
613.9H51233602M2259K640605M318118J390934n50627R84847J761079l02434j402080
632.3H60116303K69830R96173j034081k050639J4246J227617j211047m377902o394684
650.6H47555816j0806978j6270279j2605131N533457K2685647J9838035P177353K042472
667H65150392P24673l489494n595982m117131j965881n248964r202182l823340K815664
$$ plain form
685.3 835247755 830549479 811139405 789231360 780710578 789315224 807420433 826317906 842179358
701.6 842179358 851994574 853246391 846590161 829170644 793002248 740874529 710619152 742276728
717.9 742276728 806620479 844985545 854198694 859558105 868222356 874692500 877551675 879431188
734.3 879431188 879791319 877821147 875898421 875532031 874198854 869756997 862658560 850630164 830899477
752.6 830899477 814430535 817058086 835341454 851949930 856839180 854046464 852485716 854258478
768.9 854258478 854448020 850873053 845191061 838849545 837572217 847130060 861820877 871052444
785.3 871052444 872192025 870126128 869749963 870344877 869652867 869516075 871812463 874056458 873472095
803.6 873472095 871613026 870892525 869687259 864674330 855164945 845205367 843162656 849209249 852200687
$$ packed form
685.3H35247755m698276j9410074k1908045q520782Q604646J8105209J8897473J5861452
701.6H42179358R815216J251817o656230j7419517l6168396n2127719l0255377L1657576
717.9G42276728O4343751L8365066R213149N359411Q664251O470144K859175J879513
734.3H79431188L60131j970172j922726l66390j333177m441857p098437j2028396j9730687
752.6H30899477j6468942K627551J8283368J6608476M889250k792716j560748J772762
768.9H54258478J89542l574967n681992o341516j277328R557843J4690817R231567
785.3H71052444J139581k065897l76165N94914o92010j36792K296388K243995n84363
803.6H73472095j859069p20501j205266n012929r509385r959578k042711O046593K991438
$$ plain form
822 852200687 849535406 849125445 851284027 849562407 841496706 824177384 787460446 725589037
838.3 725589037 667218685 661827624 711668015 769030869 802116573 815083504 821676314 830072701
854.6 830072701 842036307 853915930 861732960 866308689 870958030 875890732 878600419 878773987
870.9 878773987 878771007 879582882 879780114 878915489 878585517 879280329 879339099 878130436 877150834 876952708
891.3 876952708 876054108 874125838 872990191 873157561 872824132 871329546 870835900 872563243 874306440
909.7 874306440 874269128 873716176 873887181 873781681 872485161 870966971 870056272 868825674 866902351
928 866902351 865835190 866067052 865426004 862939477 861193120 862112284 863420844 862466991 860086918
946.4 860086918 858072460 856120110 852937579 847923756 840600431 831867993 823620558 816256642
$$ packed form
822H52200687k665281m09961K158582j721620q065701j7319322l6716938o1871409
838.3G25589037n8370352n391061M9840391N7362854L3085704J2966931O592810Q396387
854.6H30072701J1963606J1879623P817030M575729M649341M932702K709687J73568
870.9H78773987k980Q11875J97232q64625l29972O94812N8770j208663r79602j98126
891.3H76952708q98600j928270j135647J67370l33429j494586m93646J727343J743197
909.7H74306440l7312n52952J71005j05500j296520j518190r10699j230598j923323
928H66902351j067161K31862o41048k486527j746357R19164J308560r53853k380073
946.4H60086918k014458j952350l182531n013823p323325q732438q247435p363916
$$ plain form
962.7 816256642 809613526 802455008 795087814 792451441 798272610 810595334 824253500 835508525
979 835508525 843785346 849351585 852152646 852971673 853198767 853232741 852630675 851140261 848481536
997.4 848481536 845483840 843963802 842946649 840001225 834754050 827076435 815968513 800770879
1013.7 800770879 781916499 763391495 757445216 776362598 811487138 839216828 848456562 843078673
1030 843078673 829500675 816653788 815488994 827185392 841530383 850799501 854828358 855795979
1046.3 855795979 855227232 853860855 852853298 853595436 855592310 857146084 857637823 857443392 857106745
1064.7 857106745 856690884 855715513 854120791 852797627 852570355 853078961 853486776 853665411 853895843
1083 853895843 853935003 853405535 852633715 852186561 851989567 851678312 851405144 851483345 851634085 851363420
$$ packed form
962.7H16256642o643116p158518p367194k636373N821169J2322724J3658166J1255025
979H35508525Q276821N566239K801061Q19027K27094L3974o02066j490414k658725
997.4H48481536k997696j520038j017153k945424n247175p677615j1107922j5197634
1013.7H00770879j8854380j8525004n946279J8917382L5124540K7729690R239734n377889
1030H43078673j3577998j2846887j164794J1696398J4344991R269118M028857R67621
1046.3H55795979n68747j366377j007557P42138J996874J553774M91739j94431l36647
1064.7H57106745m15861r75371j594722j323164k27272N08606M07815J78635K30432
1083H53895843L9160n29468p71820m47154j96994l11255k73168P8201J50740k70665
$$ plain form
1103.4 851363420 850893378 850817919 851137877 851340353 851246178 851234555 851352215 851113796 850515842 850153863
1123.8 850153863 850098729 849808156 849318504 849248827 849493265 848980606 846892536 844409108 844240069 846274495
1144.2 846274495 847543657 847249269 846318841 844433427 841357112 838627696 837692916 838024020 838326454
1162.6 838326454 838163733 837596774 836061120 833030760 828921556 824015915 818115711 812113523 808360159
1180.9 808360159 808386147 810777426 813598990 817690849 823527992 828230619 828996778 825972974 820292413
1199.3 820292413 811433375 798343360 783321559 772727609 769516945 767074347 758492827 748681903
1215.6 748681903 749568641 766229033 791767418 815027893 829921782 836538553 837609112 835679412
1231.9 835679412 831874430 825736284 815010905 798834503 785850167 789614320 808906674 828501403
$$ packed form
1103.4H51363420m70042p5459L19958K02476r4175j1623J17660k38419n97954l61979
1123.8H50153863n5134k90573m89652o9677K44438n12659k088070k483428j69039K034426
1144.2H46274495J269162k94388r30428j885414l076315k729416r34780L31104L02434
1162.6H38326454j62721n66959j535654l030360m109204m905641n900204o002188l753364
1180.9H08360159K5988K391279K821564M091859N837143M702627P66159l023804n680561
1199.3H20292413q859038j3090015j5021801j0593950l210664k442598q581520r810924
1215.6G48681903Q86738J6660392K5538385K3260475J4893889O616771J070559j929700
1231.9H35679412l804982o138146j0725379j6176402j2984336L764153J9292354J9594729
$$ plain form
1248.2 828501403 839937627 845108092 846934080 847011805 846438527 845446348 843950033 842277169 840418816
1266.6 840418816 837537527 832865477 826219976 817073941 804742038 791405559 782721817 782274008
1282.9 782274008 788405299 797575057 807054639 815643251 822906137 827768624 829788327 830465257
1299.2 830465257 831240118 831441820 829691529 825966477 820559919 811820030 797968388 784293175
1315.6 784293175 783542395 799193561 817490637 826596856 827184796 823603809 819176137 815932333
1331.9 815932333 813458145 811139166 810212970 812867284 820978582 832405210 841662228 846745610
1348.2 846745610 849418342 850425243 849769533 848196685 846237242 843237162 837824523 828958869
1364.5 828958869 815807760 799856186 790946066 799205005 818705857 833875835 840361238 842365682
$$ packed form
1248.2H28501403J1436224N170465J825988P7725n73278r92179j496315j672864j858353
1266.6H40418816k881289m672050o645501r146035j2331903j3336479q683742m47809
1282.9G82274008O131291R169758R479582Q588612P262886M862487K019703O76930
1299.2H30465257P74861K01702j750291l725052n406558q739889j3851642j3675213
1315.6G84293175p50780J5651166J8297076R106219N87940l580987m427672l243804
1331.9H15932333k474188k318979r26196K654314Q111298J1426628R257018N083382
1348.2H46745610K672732J006901o55710j572848j959443l000080n412639q865654
1364.5H28958869j3151109j5951574q910120Q258939J9500852J5169978O485403K004444
$$ plain form
1380.8 842365682 842830896 843147874 843491852 843550920 843990803 845080912 845876992 846034646 846027613 845791161
1401.2 845791161 845130205 843998969 842555404 840730488 837553859 832482040 828459203 830376744
1417.5 830376744 837147772 841369569 841609776 840294063 838680089 837039769 835103452 832551777
1433.9 832551777 828590155 824342132 822439909 820371687 814367950 809707165 815542459 827221990
1450.2 827221990 834277809 836619914 837681532 837701976 836851656 836335421 836277962 836220860 836382747 837117732
1470.6 837117732 837840319 837601006 836549520 835209012 833883762 832947731 833000183 833938718 834664166
1488.9 834664166 834541440 834278584 834281802 833929539 832881331 831731439 831216931 831350684 830888331 829539657
1509.3 829539657 828405380 827784121 827502489 827012300 825980723 824059308 821277797 818045974 813966453
$$ packed form
1380.8H42365682M65214L16978L43978N9068M39883J090109P96080J57654p033k36452
1401.2H45791161o60956j131236j443565j824916l176629n071819m022837J917541
1417.5H30376744O771028M221797K40207j315713j613974j640320j936317k551675
1433.9H32551777l961622m248023j902223k068222o003737m660785N835294J1679531
1450.2H27221990P055819K342105J061618K0444q50320n16235n7459n7102J61887P34985
1470.6H37117732P22587k39313j051486j340508j325250r36031N2452R38535P25448
1488.9H34664166j22726k62856L218l52263j048208j149892n14508J33753m62353j348674
1509.3H29539657j134277o21259k81632m90189j031577j921415k781511l231823m079521
$$ plain form
1527.7 813966453 809400320 804212987 797048271 790293336 788704753 794354677 801597178 803829014
1544 803829014 802032113 798178911 792748868 785779715 777820647 770014763 759982705 745520890
1560.3 745520890 732287347 718802154 702569902 683599055 664163947 653071284 657313287
1574.6 657313287 676116526 688952208 682483375 664388180 652349472 665299118 700736344
1588.9 700736344 731788278 740972817 734351635 725230753 721943557 728076577 746780813 774370313
1605.2 774370313 798206151 810546696 813994825 813440740 810789585 806582391 802878916 799788654
1621.5 799788654 796600819 794613898 793558359 792028666 790744603 790333092 788972676 785744667
1637.8 785744667 781695187 776198149 767177939 749562204 721435189 691945374 669249594 676603258
$$ packed form
1527.7H13966453m566133n187333p164716o754935j588583N649924P242501K231836
1544H03829014j796901l853202n430043o969153p959068p805884j0032058j4461815
1560.3G45520890j3233543j3485193j6232252j8970847j9435108j1092663M242003
1574.6F57313287J8803239J2835682o468833j8095195j2038708J2949646L5437226
1588.9G00736344L1051934R184539o621182r120882l287196O133020J8704236K7589500
1605.2G74370313K3835838J2340545L448129n54085k651155m207194l703475l090262
1621.5G99788654l187835j986921j055539j529693j284063m11511j360416l228009
1637.8G85744667m049480n497038r020210j7615735k8127015k9489815k2695780P353664
$$ plain form
1654.1 676603258 714784622 756447792 789941370 811806381 824056327 830443740 834400773 836724102
1670.5 836724102 837961137 839032114 840039194 841277540 843295634 845662296 846866369 846527159
1686.8 846527159 846240222 846378446 847036421 848274887 849506140 850281715 849972069 849119127 848572671
1705.1 848572671 848034382 847491920 847374201 847821116 848533988 848564684 847527802 846546292 846054852 845896363
1725.5 845896363 846026957 846485853 847193658 847472012 846755028 846086264 845730305 845257521 844872475 844870090
1745.9 844870090 845188439 845194876 844481468 843692839 843349278 843343794 843493342 843417287 843104362 843018770 843140304
1768.4 843140304 843213737 842826366 841991246 841328442 841032386 840924025 840873539 840761662 840553820 840602756
1788.8 840602756 840925932 840802908 840053797 839346111 838921607 838631630 838430583 838488162 838842511 839219809
$$ packed form
1654.1F76603258L8181364M1663170L3493578K1865011J2249946O387413L957033K323329
1670.5H36724102J237035J070977J007080J238346K018094K366662J204073l39210
1686.8H46527159k86937J38224O57975J238466J231253P75575l09646q52942n46456
1705.1H48572671n38289n42462j17719M46915P12872L0696j036882r81510m91440j58489
1725.5H45896363J30594M58896P07805K78354p16984o68764l55959m72784l85046k385
1745.9H44870090L18349O437p13408p88629l43561n484J49548p6055l12925q5592J21534
1768.4H43140304P3433l87371q35120o62804k96056j08361n0486j11877k07842M8936
1788.8H40602756L23176j23024p49111p07686m24504k89977k01047N7579L54349L77298
$$ plain form
1809.2 839219809 839291573 839144528 839129150 839231312 839277864 839365423 839609981 839792073 839794040 839594066 839151263
1831.6 839151263 838765204 838515639 838262320 838177025 838398159 838394701 837781608 837152123 836817682 836513042
1852 836513042 836072862 835588574 835141599 834737420 834461153 834463000 834699929 834733486 834328711 833998442
1872.4 833998442 833999217 833991706 833742261 833344221 832967758 832739115 832771420 832945585 832944930 832686663 832237244
1894.8 832237244 831676126 831151783 830649436 830110490 829715967 829603195 829543650 829265237 828823805 828330576
1915.2 828330576 827659965 826963246 826865673 827380061 827863097 828067124 828218699 828466237 828636169 828525782
1935.6 828525782 828319788 828419030 828832030 829156280 829255760 829294860 829303086 829178631 828914583 828614235
1956 828614235 828289449 827853978 827336550 826919913 826683104 826501369 826340318 826339066 826458275 826459169 826272130
$$ packed form
1809.2H39219809P1764j47045j5378J02162M6552Q7559K44558J82092J967j99974m42803
1831.6H39151263l86059k49565k53319q5295K21134l458o13093o29485l34441l04640
1852H36513042m40180m84288m46975m04179k76267J847K36929L3557m04775l30269
1872.4H33998442P75p511k49445l98040l76463k28643L2305J74165o55k58267m49419
1894.8H32237244n61118n24343n02347n38946l94523j12772n9545k78413m41432m93229
1915.2H28330576o70611o96719r7573N14388M83036K04027J51575K47538J69932j10387
1935.6H28525782k05994R9242M13000L24250R9480L9100Q226j24455k64048l00348
1956H28614235l24786m35471n17428m16637k36809j81735j61051j252J19209Q94j87039
$$ plain form
1978.5 826272130 826039076 825847089 825664282 825504065 825468540 825556099 825558186 825395942 825263619 825243235
1998.8 825243235 825186312 824995875 824777365 824618340 824427068 824148834 823936224 823872268 823735833 823317051
2019.2 823317051 822745621 822164893 821675777 821555376 821720302 821822047 821803868 821697354 821569681 821535230
2039.6 821535230 821527243 821364343 821059346 820794940 820631325 820473790 820322454 820301592 820367277 820317745
2060 820317745 820147157 820034027 819989085 819883585 819734395 819688678 819732010 819677114 819504857 819380164 819341302
2082.5 819341302 819256902 819092691 818990767 818983436 818907082 818735540 818628907 818627059 818606734 818493128 818361580
2104.9 818361580 818290293 818198502 818008900 817837834 817780852 817741513 817641854 817556143 817538381 817490757 817340672
2127.3 817340672 817192018 817132175 817080259 816954553 816809833 816724539 816651285 816518605 816391826 816357017
$$ packed form
1978.5H26272130k33054j91987j82807j60217l5525Q7559K087j62244j32323k0384
1998.8H25243235n6923j90437k18510j59025j91272k78234k12610o3956j36435m18782
2019.2H23317051n71430n80728m89116j20401J64926J01745j8179j06514j27673l4451
2039.6H21535230p987j62900l04997k64406j63615j57535j51336k0862O5685m9532
2060H20317745j70588j13130m4942j05500j49190m5717M3332n4896j72257j24693l8862
2082.5H19341302q4400j64211j01924p331p6354j71542j06633j848k0325j13606j31548
2104.9H18361580p1287r1791j89602j71066n6982l9339r9659q5711j7762m7624j50085
2127.3H17340672j48654n9843n1916j25706j44720q5294p3254j32680j26779l4809
$$ plain form
2147.7 816357017 816336811 816234469 816123247 816081882 816040874 815929770 815788805 815678775 815569401 815394282
2168.1 815394282 815255761 815256953 815246761 815107107 814917326 814778090 814681828 814554513 814412177 814320028
2188.5 814320028 814235210 814086378 813925982 813845575 813811958 813735366 813635588 813560784 813452423 813288689 813139617
2211 813139617 813022554 812891603 812740028 812597871 812451422 812261045 812047660 811885715 811786950 811685383
2231.4 811685383 811560690 811450481 811364591 811260521 811130047 811016738 810912430 810767651 810604393 810513794
2251.8 810513794 810501873 810463250 810369432 810301483 810263455 810176015 810035825 809914231 809814274 809666991 809480429
2274.2 809480429 809315920 809135973 808867812 808596134 808536887 808732212 808946848 809031487 809074879 809127450
2294.6 809127450 809116840 809072614 809152305 809369564 809566021 809693277 809859812 810065150 810141206 810114622
$$ packed form
2147.7H16357017k0206j02342j11222m1365m1008j11104j40965j10030j09374j75119
2168.1H15394282j38521J192j0192j39654j89781j39236r6262j27315j42336r2149
2188.5H14320028q4818j48832j60396q0407l3617p6592r9778p4804j08361j63734j49072
2211H13139617j17063j30951j51575j42157j46449j90377k13385j61945r8765j01567
2231.4H11685383j24693j10209q5890j04070j30474j13309j04308j44779j63258r0599
2251.8H10513794j1921l8623r3818o7949l8028q7440j40190j21594r9957j47283j86562
2274.2H09480429j64509j79947k68161k71678n9247J95325K14636Q4639M3392N2571
2294.6H09127450j0610m4226P9691K17259J96457J27256J66535K05338P6056k6584
$$ plain form
2315 810114622 810288906 810740709 811144829 811308980 811430991 811619043 811688244 811571181 811512709 811602771
2335.4 811602771 811583519 811373711 811177850 810866117 810107708 809500039 809816897 810980320 812358975
2353.7 812358975 813381553 813914180 814014196 813688099 812941611 812051892 811176360 810124695 808845520
2372.1 808845520 807613194 806588948 805645883 804715097 803938270 803426266 803098679 802831769 802628100
2390.4 802628100 802516341 802424550 802294850 802169859 802092075 802029908 801923454 801782429 801670432 801573753
2410.8 801573753 801432550 801294744 801234007 801175833 801025450 800831914 800681651 800570965 800446332 800317943
2431.2 800317943 800236940 800153375 799966037 799699664 799463630 799263239 799036980 798812032 798656344 798568904
2451.6 798568904 798478186 798321605 798138142 798006952 797913790 797804892 797705591 797633946 797536194 797394156
$$ packed form
2315H10114622J74284M51803M04120J64151J22011J88052O9201j17063n8472R0062
2335.4H11602771j9252k09808j95861l11733p58409o07669L16858J163423J378655
2353.7H12358975J022578N32627J00016l26097p46488q89719q75532j051665j279175
2372.1H08845520j232326j024246r43065r30786p76827n12004l27587k66910k03669
2390.4H02628100j11759r1791j29700j24991p7784o2167j06454j41025j11997r6679
2410.8H01573753j41203j37806o0737n8174j50383j93536j50263j10686j24633j28389
2431.2H00317943q1003q3565j87338k66373k36034k00391k26259k24948j55688q7440
2451.6G98568904r0718j56581j83463j31190r3162j08898r9301p1645r7752j42038
$$ plain form
2472 797394156 797240019 797106862 797003746 796919942 796882212 796892345 796871185 796742678 796515763 796280503 796092749
2494.5 796092749 795907915 795714855 795591414 795521975 795374334 795127273 794900954 794774652 794696212 794596255
2514.9 794596255 794502616 794427872 794299006 794085681 793868184 793724418 793624818 793513060 793410897 793368042
2535.3 793368042 793325424 793172479 792963505 792831481 792714953 792500198 792284548 792200327 792172611 792047560
2555.6 792047560 791870415 791795433 791776478 791657686 791469336 791364074 791297436 791093349 790779293 790524900
2576 790524900 790349483 790128350 789867401 789690256 789549351 789297640 788966298 788721800 788599312 788472116
2596.4 788472116 788350821 788421035 788646638 788719416 788560033 788412452 788345635 788209617 788034379 788005650
2616.8 788005650 788115680 788146496 788043618 787994444 788042843 788011074 787887394 787860990 787934303 787872672 787585676
$$ packed form
2472G97394156j54137j33157j03116q3804l7730J0133k1160j28507k26915k35260j87754
2494.5G96092749j84834j93060j23441o9439j47641k47061k26319j26302p8440r9957
2514.9G94596255r3639p4744j28866k13325k17497j43766r9600j11758j02163m2855
2535.3G93368042m2618j52945k08974j32024j16528k14755k15650q4221k7716j25051
2555.6G92047560j77145p4982j8955j18792j88350j05262o6638k04087l14056k54393
2576G90524900j75417k21133k60949j77145j40905k51711l31342k44498j22488j27196
2596.4G88472116j21295P0214K25603P2778j59383j47581o6817j36018j75238k8729
2616.8G88005650J10030L0816j02878m9174M8399l1769j23680k6404P3313o1631k86996
$$ plain form
2639.3 787585676 787259221 787033558 786834478 786606193 786460042 786450922 786409259 786231160 786084473 786053121
2659.7 786053121 785963237 785756052 785605192 785589218 785575449 785452008 785286963 785171092 785042465 784828722
2680.1 784828722 784625590 784499705 784338236 784088671 783871830 783748627 783623636 783453643 783322215 783273101
2700.5 783273101 783206642 783030510 782839239 782705069 782541692 782326043 782173812 782141626 782110929 781992435
2720.9 781992435 781868875 781797349 781672418 781448781 781260550 781175911 781110287 780991554 780840814 780700147
2741.2 780700147 780556321 780397534 780236959 780056536 779831767 779587686 779398561 779262960 779090226 778875709
2761.6 778875709 778695166 778561354 778418720 778241277 778057873 777885258 777654171 777339637 777058780 776875734
2782 776875734 776751637 776673734 776632667 776545346 776356936 776132882 775971055 775851727 775661170 775438368
$$ packed form
2639.3G87585676l26455k25663j99080k28285j46151r120m1663j78099j46687l1352
2659.7G86053121q9884k07185j50860j5974j3769j23441j65045j15871j28627k13743
2680.1G84828722k03132j25885j61469k49565k16841j23203j24991j69993j31428m9114
2700.5G83273101o6459j76132j91271j34170j63377k15649j52231l2186l0697j18494
2720.9G81992435j23560p1526j24931k23637j88231q4639o5624j18733j50740j40667
2741.2G80700147j43826j58787j60575j80423k24769k44081j89125j35601j72734k14517
2761.6G78875709j80543j33812j42634j77443j83404j72615k31087l14534k80857j83046
2782G76875734j24097p7903m1067q7321j88410k24054j61827j19328j90557k22802
$$ plain form
2802.4 775438368 775289059 775192201 775117397 775010288 774812102 774592042 774409890 774261177 774142146 773999929
2822.8 773999929 773822010 773679733 773571670 773443818 773313820 773221433 773146868 772926927 772435069 771856070
2843.2 771856070 771401167 771017730 770578146 770148516 769864023 769681334 769557178 769488871 769385338 769228816
2863.6 769228816 769077837 768932998 768819630 768783510 768664479 768307447 767914712 767653227 767431319 767196417
2884 767196417 766964436 766746700 766537130 766338348 766174495 765981495 765685856 765392125 765201271 765022218
2904.4 765022218 764780223 764560103 764467180 764418244 764179587 763690948 763123751 762630284 762279868 762073040
2924.8 762073040 762019098 762109995 762145400 762064457 762059867 762158215 762253761 762370169 762533844 762596488 762426138
2947.2 762426138 762154281 761988819 761845231 761551738 761169732 760787785 760407269 760055542 759775519 759569526
$$ packed form
2802.4G75438368j49309r6858p4804j07109j98186k20060j82152j48713j19031j42217
2822.8G73999929j77919j42277j08063j27852j29998r2387p4565k19941m91858n78999
2843.2G71856070m54903l83437m39584m29630k84493j82689j24156o8307j03533j56522
2863.6G69228816j50979j44839j13368l6120j19031l57032l92735k61485k21908k34902
2884G67196417k31981k17736k09570j98782j63853j93000k95639k93731j90854j79053
2904.4G65022218k41995k20120r2923m8936k38657m88639n67197m93467l50416k06828
2924.8G62073040n3942R0897L5405q0943m590R8348R5546J16408J63675O2644j70350
2947.2G62426138k71857j65462j43588k93493l82006l81947l80516l51727k80023k05993
$$ plain form
2967.6 759569526 759399295 759266615 759176552 759054363 758939683 758883357 758732200 758469343 758274257 758159220
2988 758159220 758021414 757786214 757383466 756927073 756496668 756040454 755672157 755393207 755047381 754667282
3008.4 754667282 754341424 753941000 753259122 752278388 751125932 749929786 748829961 747906446 747045219
3026.8 747045219 745979548 744360507 742167532 740191579 739752531 741301239 743483305 744829953
3043.1 744829953 745460570 746203542 747298062 748337448 748942494 749098182 748873532 748374462 747884452
3061.5 747884452 747869432 748858929 750752509 752698421 754021704 754629374 754786968 754715562 754389942
3079.8 754389942 753941894 753723800 753883660 754382372 755004406 755391240 755487800 755468905 755390763 755227327
3100.2 755227327 754990697 754814982 754816949 754874110 754829586 754804850 754948795 755079031 754954517 754543364
$$ packed form
2967.6G59569526j70231j32680r0063j22189j14680n6326j51157k62857j95086j15037
2988G58159220j37806k35200m02748m56393m30405m56214l68297k78950l45826l80099
3008.4G54667282l25858m00424o81878r80734j152456j196146j099825r23515q61227
3026.8G47045219j065671j619041k192975j975953m39048J548708K182066J346648
3043.1G44829953O30617P42972J094520J039386O05046J55688k24650m99070m90010
3061.5G47884452j5020R89497J893580J945912J323283O07670J57594p1406l25620
3079.8G54389942m48048k18094J59860M98712O22034L86834R6560j8895p8142j63436
3100.2G55227327k36630j75715J967N7161m4524k4736J43945J30236j24514m11153
$$ plain form
3120.6 754543364 753970623 753444135 753046334 752726734 752425313 752092957 751756787 751474440 751217186 750909209
3141 750909209 750559688 750236988 749945521 749658048 749370575 748972356 748393714 747805417 747349858 746986091 746628344
3163.4 746628344 746266544 745947778 745657980 745295167 744796097 744206846 743571520 742910564 742282450 741723955
3183.8 741723955 741178930 740598977 740015805 739468336 738936663 738355637 737711012 737041950 736356199 735665858
3204.2 735665858 734975457 734232247 733421266 732609272 731883228 731261015 730639696 729927599 729214191 728612363
3224.6 728612363 728034854 727429986 726940930 726510942 725813866 724884868 724046230 723334730 722672582 722079813
3245 722079813 721486330 720773757 720042765 719457209 718956590 718382299 717738688 717131615 716595352 716142118
3265.4 716142118 715807140 715548694 715134799 714480162 713770092 713081956 712437928 711861372 711276412 710627615
$$ packed form
3120.6G54543364n72741n26488l97801l19600l01421l32356l36170k82347k57254l07977
3141G50909209l49521l22700k91467k87473Tl98219n78642n88297m55559l63767l57747
3163.4G46628344l61800l18766k89798l62813m99070n89251o35326o60956o28114n58495
3183.8G41723955n45025n79953n83172n47469n31673n81026o44625o69062o85751o90341
3204.2G35665858o90401p43210q10981q11994p26044o22213o21319p12097p13408o01828
3224.6G28612363n77509o04868m89056m29988o97076r28998q38638p11500o62148n92769
3245G22079813n93483p12573p30992n85556n00619n74291o43611o07073n36263m53234
3265.4G16142118l34978k58446m13895o54637p10070o88136o44028n76556n84960o48797
$$ plain form
3285.8 710627615 709966302 709382892 708794653 708018601 707128346 706344068 705763340 705373824 705057204 704586446
3306.2 704586446 703798831 702720165 701460004 700154006 698893309 697655678 696401775 695179045
3322.5 695179045 693976462 692605555 691049635 689506710 688030183 686625838 685311735 683880031
3338.8 683880031 682168186 680328548 678507924 676813245 675306678 673676670 671663463 669532657
3355.2 669532657 667534292 665616930 663651586 661655843 659853220 658221900 656353116 654034555
3371.5 654034555 651607275 649482906 647633493 645841599 644040346 642318249 640737772 639341116
3387.8 639341116 638233483 637133539 635640740 634065866 632956684 632167757 631016850 629426062
3404.1 629426062 628048658 627092361 626228929 625320196 624393046 623495281 622769713 622156799 621510386
$$ packed form
3285.8G10627615o61313n83410n88239p76052q90255p84278n80728l89516l16620m70758
3306.2G04586446p87615j078666j260161j305998j260697j237631j253903j222730
3322.5F95179045j202583j370907j555920j542925j476527j404345j314103j431704
3338.8F83880031j711845j839638j820624j694679j506567j630008k013207k130806
3355.2F69532657j998365j917362j965344j995743j802623j631320j868784k318561
3371.5F54034555k427280k124369j849413j791894j801253j722097j580477j396656
3387.8F39341116j107633j099944j492799j574874j109182p88927j150907j590788
3404.1F29426062j377404r56297q63432r08733r27150q97765p25568o12914o46413
$$ plain form
3422.5 621510386 620956242 620639801 620500207 620353878 620227337 620262861 620251298 620000422 619747519 619758189
3442.9 619758189 620041013 620414019 620748878 621151984 621660590 622178555 622751236 623432994 624088466 624750972
3463.2 624750972 625675380 626763880 627558351 627928555 628270030 628883779 629768252 630740941 631533086
3481.6 631533086 632199883 632959664 633731961 634445965 635267615 636251092 637246251 638169587 639158845 640233457
3502 640233457 641090155 641738892 642530262 643524706 644641697 645770431 646804988 647849143 649026573
3520.4 649026573 650319397 651500344 652443945 653347313 654382348 655592620 656951547 658243537 659374356
3538.7 659374356 660630584 662086070 663431287 664464056 665386796 666459262 667581856 668668568
3555 668668568 669824183 671072006 672413528 673849583 675316095 676676750 677787840 678790092 679962695
$$ packed form
3422.5F21510386n54144l16441j39594j46329j26541L5524j1563k50876k52903J0670
3442.9F19758189K82824L73006L34859M03106N08606N17965N72681O81758O55472O62506
3463.2F24750972R24408J088500P94471L70204L41475O13749Q84473R72689P92145
3481.6F31533086O66797P59781P72297P14004Q21650R83477R95159R23336R89258J074612
3502F40233457Q56698O48737P91370R94444J116991J128734J034557J044155J177430
3520.4F49026573J292824J180947R43601R03368J035035J210272J358927J291990J130819
3538.7F59374356J256228J455486J345217J032769R22740J072466J122594J086712
3555F68668568J155615J247823J341522J436055J466512J360655J111090J002252J172603
$$ plain form
3573.4 679962695 681337953 682775199 684316933 686072290 687992096 689850330 691349328 692625761
3589.7 692625761 694030046 695532382 697042584 698626935 700178027 701566041 702968776 704524100
3606 704524100 706106246 707530677 708852410 710272312 711744547 713016629 713984609 714900136 716079414
3624.4 716079414 717460096 718594253 719214082 719654381 720154643 720730245 721391201 722071290 722791433
3642.7 722791433 723753154 724937916 725821793 725945771 725779176 725862086 726170778 726436853 726548791 726659298
3663.1 726659298 727030456 727606416 728016376 728210032 728390217 728234470 727643609 727223337 727197886 727540374
3683.5 727540374 728232801 729074001 729488730 729277313 729030252 729044259 729221165 729447424 729570031 729578137
3703.9 729578137 729744673 730129719 730347157 730070114 729631305 729478538 729610622 729815245 729942262 729957759
$$ packed form
3573.4F79962695J375258J437246J541734J755357J919806J858234J498998J276433
3589.7F92625761J404285J502336J510202J584351J551092J388014J402735J555324
3606G04524100J582146J424431J321733J419902J472235J272082R67980R15527J179278
3624.4G16079414J380682J134157O19829M40299N00262N75602O60956O80089P20143
3642.7G22791433R61721J184762Q83877J23978j66595Q2910L08692K66075J11938J10507
3663.1G26659298L71158N75960M09960J93656J80185j55747n90861m20272k5451L42488
3683.5G27540374O92427Q41200M14729k11417k47061J4007J76906K26259J22607Q106
3703.9G29578137J66536L85046K17438k77043m38809j52767J32084K04623J27017J5497
$$ plain form
3724.3 729957759 729896426 729968667 730350018 730860889 731020927 730621755 730160654 730059266 730114460 730028152
3744.7 730028152 729967535 729944468 729572594 728953004 728603959 728497148 728298903 728010833 727887213 727927506
3765.1 727927506 727949321 727815449 727513909 727232099 727175355 727289259 727275670 727044463 726817906 726640701
3785.5 726640701 726475954 726376891 726352990 726403832 726566970 726830482 726971149 726788640 726492345 726197958
3805.9 726197958 725762486 725406289 725429416 725708008 725943744 726058602 725907743 725391269 724958181 724810600
3826.3 724810600 724802911 724873424 725040376 725314856 725459933 725239992 724849701 724468410 724125922 724007845
3846.7 724007845 724320352 724863470 724805832 723945916 723383129 723302066 723373115 723383009 723293185 723234832 723133981
3869.1 723133981 722894847 722631156 722397625 722266614 722279370 722365379 722387075 722168028 721856892 721704304
$$ packed form
3724.3G29957759o1333P2241L81351N10871J60038l99172m61101j01388N5194q6308
3744.7G30028152o0617k3067l71874o19590l49045j06811j98245k88070j23620M0293
3765.1G27927506K1815j33872l01540k81810n6744J13904j3589k31207k26557j77205
3785.5G26640701j64747r9063k3901N0842J63138K63512J40667j82509k96295k94387
3805.9G26197958m35472l56197K3127K78592K35736J14858j50859n16474m33088j47581
3826.3G24810600p689P0513J66952K74480J45077k19941l90291l81291l42488j18077
3846.7G24007845L12507N43118n7638q59916n62787q1063P1049R894q9824n8353j00851
3869.1G23133981k39134k63691k33531j31011J2756Q6009K1696k19047l11136j52588
$$ plain form
3889.5 721704304 721535444 721291780 721268892 721501589 721696675 721600652 721215785 720776498 720450580 720205069
3909.9 720205069 720075250 720136821 720260918 720235109 720095873 720020533 719965696 719798684 719621122 719565392
3930.3 719565392 719509542 719331324 719127238 719030619 719010592 718931258 718796551 718713284 718659699 718515813 718290031
3952.7 718290031 718127966 718087316 718065321 717971385 717833579 717723370 717650771 717572033 717482507 717387378 717257619
3975.2 717257619 717096388 716947913 716865659 716838062 716774106 716653585 716535807 716415584 716263413 716154695
3995.6 716154695 716132820
3997.6 716132820
$$ packed form
3889.5G21704304j68860k43664k2888K32697J95086r6023l84867m39287l25918k45511
3909.9G20205069j29819O1571J24097k5809j39236p5340n4837j67012j77562n5730
3930.3G19565392n5850j78218k04086r6619k0027p9334j34707q3267n3585j43886k25782
3952.7G18290031j62065m0650k1995r3936j37806j10209p2599p8738q9526r5129j29759
3975.2G17257619j61231j48475q2254k7597o3956j20521j17778j20223j52171j08718
3995.6G16154695k1875
3997.6G16132820
##END=$$ End of the data block
