##TITLE=ChalcH $$ Begin of the data block
##JCAMP-DX=5.00 $$ ACD/SpecManager v 10.08
##SPECTROMETER/DATA SYSTEM=Alpha
##DATE=25 Jun 2015 11:03:10
##DATA TYPE=INFRARED SPECTRUM
##DATA CLASS=XYDATA
##ORIGIN=
##OWNER=
##NPOINTS=1765
##FIRSTX=399.76428223
##LASTX=3997.64306641
##MAXX=3997.64306641
##MINX=399.76428223
##MAXY=0.85372746
##MINY=0.34201115
##XFACTOR=1.0000000000
##YFACTOR=1.000000000000000e-9
##FIRSTY=0.82399005
##DELTAX=2.03961372
##XUNITS=1/CM
##YUNITS=ARBITRARY UNITS
##XYDATA=(X++(Y..Y))
399.8H23990047K692759j393557p34090J713097m31061l222466j225531N18978j642883
418.1H20265293q79168K971887J963496j773655j930058O6757j473784m083574j624882
436.5H13502312K293527J265406q02576R31084K069295m72010j838028N6684J93655
454.8H17199349k405285j885772R46820L01361k233446k290070j126587k779961m940450
473.2H00785959m044235m145622q710623j4593482j8363774k1917283k6736916j8048763
489.5F84225261J6478420M6481013M0862441J9479513O735981J318991j773656k027213
505.8H11780751p48575j346529l346741l820002l628015m487336m081011o04987K844691
524.2G92562246L351391K494216K483368J952767j50740j240969k95818j73628j940012
$$ y = [823990047, 826682806, 825289249, 824555159, 826268256, 825837195, 822614729, 821389198, 821908176, 820265293, 819386125, 822358012, 824321508, 822547853, 820617795, 820684552, 819210768, 815127194, 813502312, 815795839, 817061245, 816258669, 817189753, 819259048, 818787038, 816949010, 817005694, 817199349, 814794064, 812908292, 813855112, 814156473, 811923027, 809632957, 808506370, 805726409, 800785959, 796741724, 792596102, 783885479, 769291997, 750928223, 729010940, 702274024, 684225261, 700703681, 747184694, 788047135, 807526648, 814262629, 815581620, 813807964, 811780751, 811032176, 809685647, 806338906, 802518904, 798890889, 794403553, 790322542, 789717555, 792562246, 795913637, 798407853, 800891221, 802843988, 802693248, 801452279, 801156461, 800982833, 799042821]
542.5G99042821k893567k072811k277196m447043o244659p528603j0988414j7062784
558.9G45527744k3765742k9746533l0886650j8137932J1915505M3143511N0983727
573.1G49033630L5238206J7180264P409156K150654q22842q92102m84467j984239l325522
591.5H03502738k186179n13255n09084o42240K30849N2989j871288k789199k358795
609.8G92916536m459858j0197818j0412454J364707J1355162Q289218J974046J30236
626.2G90959775q84175k270520j951336j072944j992046l289462k710759j905144k926230
644.5G71957159m127502l803850m191041o881654r764790j1624277j5051484k1263182
660.8F95249379k7732313k9875040k3619175M93288J7006040J7325878J7379343Q803368
$$ y = [799042821, 796149254, 794076443, 791799247, 787352204, 781107545, 773578942, 762590528, 745527744, 721762002, 692015469, 661128819, 642990887, 654906392, 698049903, 749033630, 784271836, 801452100, 808861256, 811011910, 810189068, 809296966, 808812499, 806828260, 803502738, 801316559, 800803304, 800294220, 799651980, 799882829, 799935818, 798064530, 795275331, 792916536, 788456678, 778258860, 767846406, 769211113, 780566275, 788855493, 790829539, 790959775, 790075600, 787805080, 785853744, 784780800, 782788754, 779499292, 776788533, 774883389, 771957159, 767829657, 764025807, 759834766, 752953112, 743188322, 731564045, 716512561, 695249379, 667517066, 637642026, 614022851, 614516139, 631522179, 648848057, 666227400, 675030768]
677.2F75030768q302271k7759135n1526547p0373475n7226062m754603N1465511P6593817
693.5E83148003P3281347N5456460L1652629J3464809O652176P614613J0822236J1338294
709.8G93430567P699191K521515j990139m447639m617393n393923q466959j1233687
726.1G67501533j2779713j6139090k2377252k9549897l8395166n2485288p0812523
740.4E24962604q1654876o7338497k3395389L2955944P9664737J00484968R2266023
754.7F57945514O9453120M7795415L2023549K0057559J1287034P127165N402923K635181
771H53727460q9109n88775j152456m402577q702159j2795627j5604496j1445761l80933
789.3G98565567J0268449J5620649J3235808P313251L803253J496017j041770j693606
$$ y = [675030768, 666728497, 638969362, 587442815, 517069340, 459843278, 455088675, 506554186, 583148003, 656429350, 711885810, 743538439, 757003248, 763655424, 771270037, 782092273, 793430567, 801129758, 803651273, 801661134, 797213495, 792596102, 787202179, 778735220, 767501533, 754721820, 738582730, 716205478, 686655581, 648260415, 595775127, 524962604, 443307728, 375969231, 352573842, 385529786, 465194523, 565679491, 657945514, 727398634, 775194049, 807217598, 827275157, 838562191, 845689356, 851092279, 853727460, 853638351, 853049576, 851897120, 847494543, 838792384, 825996757, 810392261, 798946500, 798565567, 808834016, 824454665, 837690473, 845003724, 848806977, 850302994, 849261224, 847567618]
805.6H47567618m97878l72171j392067r94980L69847o0320j452863j061678l0458r22978
826H41152072k404511k199829j735568l148794m907071m552484l233433k690673j839995
844.4H14439714p36296k196849o455958r607017j0069489j3332844k2743702k7411341
860.7G21886218q646906K7404189M4029832L0441940J2293279K935648j147091k019644
877H27177465j102805j171589k273440k399445k049983k115368p21932K199948L197134
895.4H20739985J328349n61536m85003m0173r34124j830578j422167j192987k268016
913.7H13333750k846599k077520k099097l598988l914296k096117j015186k497196
930.1G93188751m215896l087402M98176K728939J727343l11375k169490l759623m268169
$$ y = [847567618, 847069740, 846697569, 845305502, 844310522, 844680369, 844620049, 843167186, 842105508, 842075050, 841152072, 838747561, 836547732, 834812164, 831663370, 826756299, 822203815, 818970382, 816279709, 814439714, 813703418, 811506569, 805050611, 795443594, 785374105, 772041261, 749297559, 721886218, 713239312, 740643501, 784673333, 815115273, 827408552, 830344200, 829197109, 827177465, 826074660, 824903071, 822629631, 820230186, 818180203, 816064835, 815342903, 817542851, 820739985, 822068334, 821506798, 821021795, 820981622, 820047498, 818216920, 816794753, 815601766, 813333750, 810487151, 808409631, 806310534, 802711546, 798797250, 796701133, 795685947, 793188751, 788972855, 785885453, 786383629, 789112568, 790839911, 790528536, 788359046, 784599423, 780331254]
948.4G80331254m118085m816353o166578o913244p589698r590924j2897611j7088472
964.7G11150289k2802413k7756333k7047396k2633970k1773815j8460035M306078L8732648
981.1F13715053N1899373L4588874P521986j4276444k8038383k8974593j3415396Q943260
997.4F31963730K9640794M0933907K8852403K919972j6833425l0526101m3904722n1628947
1013.7E91417611l5432577J2865185O0433805O4363361L1227171M421890K834320L02136
1030G32432902k0721316l2405377j1026025K3858249M0254653L3780634K0800352J1587143
1046.3G98561215O113172K621591Q01742o2406j262546k716898k903939k626776m294098
1064.7G94231057p327497r322703q759737m515648K069176O236791N888283L538490
$$ y = [780331254, 776213169, 771396816, 765230238, 758316994, 750727296, 741136372, 728238761, 711150289, 688347876, 660591543, 633544147, 610910177, 589136362, 570676327, 574982405, 613715053, 665614426, 700203300, 707725286, 693448842, 665410459, 636435866, 623020470, 631963730, 661604524, 702538431, 731390834, 734310806, 717477381, 686951280, 643046558, 591417611, 555985034, 568850219, 629284024, 693647385, 724874556, 729296446, 732130766, 732432902, 711711586, 679306209, 668280184, 692138433, 732393086, 766173720, 786974072, 798561215, 804674387, 807295978, 808097720, 808035314, 806772768, 804055870, 801151931, 798525155, 794231057, 786903560, 777580857, 768821120, 764305472, 766374648, 772611439, 778499722, 782038212]
1081G82038212K026617K493739L930510L857612J929164P9393j050651k000570k451002
1099.4G90853024j880050q85129j80364K49148N01155K84255l18289n72979l24965
1117.7G87725806l60548r56774j306593j059652q60095r49383p74085m40955o76871
1136.1G80340850j388609j785219j850903k405822l796339o325781j0412693j1569918
1152.4G40805566l970086N698621P361352L486097j78873k697945m774272p526100
1168.7G38204360j1624515j5704393j6380132j1554181k629400O088794R470880P451713
1185G03323126M691541K572477j112223o686330j2206316j6521930j9723237k1581292
1201.3F32755816k0846486j7207921j4919758j9519448k9424548l6582231l2993049
$$ y = [782038212, 784064829, 786558568, 790489078, 794346690, 796275854, 796355247, 795304596, 793304026, 790853024, 788972974, 788087845, 787907481, 788156629, 788657784, 788942039, 788623750, 788050771, 787725806, 787365258, 786408484, 785101891, 784042239, 783182144, 782232761, 781458676, 781017721, 780340850, 778952241, 777167022, 775316119, 772910297, 769113958, 762788177, 752375484, 740805566, 736835480, 742534101, 749895453, 753381550, 753202677, 750504732, 745730460, 738204360, 726579845, 710875452, 694495320, 682941139, 680311739, 686400533, 695871413, 703323126, 708014667, 710587144, 709474921, 702788591, 690582275, 674060345, 654337108, 632755816, 611909330, 594701409, 579781651, 560262203, 530837655, 494255424, 461262375]
1215.6D61262375j4782041J4704913M5288592O4763189O6705823N5369377L9735198
1229.9G33047426K5335788J4478505Q155048N377054L515184J036644j131236k426744
1246.2G87387669l622115m609704m536092l762960l376723l382027l119707k868175
1262.5G58110166l384471m305423n047321n955636p338703q912921j1063755j5222549
1278.8F96879387k1954000k8717578k8892159j3636589J5850246L8145125L4911632
1293.1F92586064J4992655k972126j2993932j8757403k3937881k8740585l0660987
1307.4E89515805k6654243j2551844J5580654M6319365N3748668L2352030M143834
1321.7G02454269j4070988k3015439k6717246k8524756l2720030l8633108l9568394
$$ y = [461262375, 446480334, 461185247, 506473839, 571237028, 637942851, 693312228, 733047426, 758383214, 772861719, 781016767, 786393821, 789909005, 790945649, 789814413, 787387669, 783765554, 779155850, 774619758, 770856798, 767480075, 764098048, 760978341, 758110166, 754725695, 750420272, 745372951, 739417315, 732078612, 723165691, 712101936, 696879387, 674925387, 646207809, 617315650, 603679061, 619529307, 657674432, 692586064, 707578719, 704606593, 691612661, 672855258, 648917377, 620176792, 589515805, 562861562, 550309718, 565890372, 612209737, 665958405, 698310435, 702454269, 688383281, 665367842, 638650596, 610125840, 577405810, 538772702, 499204308]
1336D99204308l0369252q916229K1132678M7503352N9833348N7860612M8731029L6462248
1352.3G31442094K3360550J3004542O202519J669049p33256j080037j361906k232909
1368.6G70270646k870381l239453l160238k773762k935588l378690l446102k743602
1384.9G45722830j229405K8849l69847j590550j230300P27892K248764K550006J774073
1403.3G48632312J290679J179158O09279J37985p0572j085579k560318k502561j556098
1421.6G44074285k225041l424466m463911n726516o693185q899569j4469087j9723595
1437.9F78448915k3132264l4502030n1177561n4078162j2437939O4416110R5818699
1452.2F63355768O3575268K3292303N895376K519131J45077j937806k074063k179444
$$ y = [499204308, 468835056, 459918827, 481051505, 528554857, 588388205, 646248817, 694979846, 731442094, 754802644, 767807186, 774009705, 775678754, 774945498, 773865461, 772503555, 770270646, 767400265, 764160812, 761000574, 758226812, 755291224, 751912534, 748466432, 745722830, 744493425, 744522274, 744152427, 742561877, 741331577, 742059469, 744308233, 746858239, 748632312, 749922991, 751102149, 751711428, 751849413, 751778841, 750693262, 748132944, 745630383, 744074285, 741849244, 738424778, 733960867, 728234351, 721541166, 712641597, 698172510, 678448915, 655316651, 620814621, 569637060, 515558898, 503120959, 567537069, 663355768, 726931036, 750223339, 756118715, 758637846, 758782923, 756845117, 754771054, 752591610]
1468.5G52591610l973186n527854m769206l684282l036082j778662k73407r8646k334296
1486.9G27115989o614864j2257397j7659307j7740786K006471L0637920L0252576J1991858
1503.2G47732460j049399l594041R97484K217591L92616j646460k401888k672791l036738
1521.6G36938834k146482j705826k043187k644181m235089m845441l893315n391121
1537.9G10034192p986546n632341l305316m426479o416798q081376q571804r084523
1554.2F56529009j0353088j3760567j3555050r920358j3314486j9010126k5670112
1568.5E50945222l3956050l3617348k0086139J4440864N1555067N8334291L3019006
1582.8F20634913r454727l7465512m7375679m5363993l0763715j3701857q682012j7304212
$$ y = [752591610, 748618424, 743090570, 738321364, 734637082, 731601000, 729822338, 729548931, 729450285, 727115989, 720501125, 708243728, 690584421, 672843635, 674850106, 705488026, 735740602, 747732460, 746683061, 743089020, 744086504, 746304095, 746696711, 745050251, 742648363, 739975572, 736938834, 734792352, 733086526, 731043339, 728399158, 724164069, 719318628, 715425313, 710034192, 702047646, 696415305, 693109989, 688683510, 682266712, 674185336, 665613532, 656529009, 646175921, 632415354, 618860304, 608939946, 595625460, 576615334, 550945222, 516989172, 483371824, 463285685, 477726549, 529281616, 587615907, 620634913, 611180186, 573714674, 526338995, 480975002, 450211287, 436509430, 427827418, 410523206]
1599.1D10523206k9276997k9821366r413689K6445955O1471432P6017618O4807356
1613.4E70753515M5759439L3325136K5936186K1199465J6348004Q646191J808881k032280
1629.7G21744537m418730p668913j1024058j0043800q897185j0282993j2251079j6516269
1646F40641510j9184708j8439531k8168798m3590307m1516751m4475317m2997748j1535525
1662.3C90732825L9950400P2260350Q4937811Q0389738N2913964L0704558J9224286
1676.6G71113932J0541380M904806K677918O643533J0967851R457111O649375L058613
1692.9H26014519q2910j468778j414180O23763K446592J545369J281023J298011L8683
1711.3H30282092j979113l476381k168417J148641J800835P71761O04809K08616q72910
$$ y = [410523206, 381246209, 351424843, 342011154, 368457109, 429928541, 505946159, 570753515, 616512954, 649838090, 675774276, 696973741, 713321745, 721967936, 723776817, 721744537, 717325807, 709656894, 698632836, 688589036, 679691851, 669408858, 657157779, 640641510, 621456802, 603017271, 574848473, 531258166, 489741415, 445266098, 402268350, 390732825, 430683225, 502943575, 587881386, 668271124, 721185088, 751889646, 771113932, 781655312, 786560118, 789238036, 795881569, 806849420, 816306531, 822955906, 826014519, 825931609, 824462831, 823048651, 823672414, 826119006, 827664375, 828945398, 830243409, 830282092, 828302979, 824826598, 822658181, 823806822, 825607657, 826379418, 826984227, 827192843, 826319933]
1729.6H26319933j879275j302838J217305J115084k08676l1113j9133j106382j865208
1748H22239697j344383p3194k33352j124621j025379j078248j308083q65817j363933
1766.3H13822687k713919l403366k345383O9142O72757L4332L88802J326143J475513
1784.7H09326708J048148K26557o88612k97487O26922K80440o43433r57548n79000
1803H08342695l77834p88688j435995j626194j533449k010941k501905j830757p04884
1821.4G95532048l23296k74360j06096L58343J255095J254797P19368R56297J060963
1839.8H00433159J98007o0380J133323J375436N46158K30133L49999K32100p0214p9930
1860.2H04287791m7147n70297j425803j317561n2750K55466n77152r94205r66728j195908
$$ y = [826319933, 824440658, 823137820, 824355125, 825470209, 825261533, 825230420, 825211287, 824104905, 822239697, 820895314, 820822120, 820588768, 819464147, 818438768, 817360520, 816052437, 815186620, 813822687, 811108768, 807705402, 805360019, 805429161, 806101918, 806136250, 806525052, 807851195, 809326708, 810374856, 810601413, 809912801, 809615314, 810242236, 810522676, 809879243, 808921695, 808342695, 807964861, 807176173, 805740178, 804113984, 802580535, 800569594, 798067689, 796236932, 795532048, 795208752, 794934392, 794828296, 795186639, 796441734, 797696531, 798415899, 799372196, 800433159, 800631166, 800570786, 801704109, 803079545, 803625703, 803855836, 804205835, 804437935, 804367721, 804287791, 804240644, 803670347, 802244544, 800926983, 800874233, 801129699, 800552547, 799558342, 798591614, 797395706]
1880.5G97395706j436651j223146j001061j161038j055539r52244j498282k091169
1896.9G86976576k189696j832485j316190p71224R0301J243531J897693J533210P70509
1915.2G86402225N47708P32243M32908K78294Q73149J178503Q84533O05702M51386
1933.6G92386651M3333n73635j018048j187444j136362j157940j204073j072943j109600
1951.9G83969939j314879j328587j442373k089620k753734k550721j320839K85029
1968.3G71454215J407623J923621K008736J578331J036465R19164J010596Q57711O08981
1986.6G82805443N49972M97520M21882M51028M07874J36435k81989n24581m51445m09067
2007G83603072n14626m43340j74761p1227r6440j0491o4671n31316r53674o90639k05457
$$ y = [797395706, 795959055, 794735909, 793734848, 792573810, 791518271, 790566027, 789067745, 786976576, 784786880, 782954395, 781638205, 780866981, 780957282, 782200813, 784098506, 785631716, 786402225, 786949933, 787682176, 788115084, 788393378, 789266527, 790445030, 791329563, 791935265, 792386651, 792429984, 791856349, 790838301, 789650857, 788514495, 787356555, 786152482, 785079539, 783969939, 782655060, 781326473, 779884100, 777794480, 775040746, 772490025, 771169186, 771454215, 772861838, 774785459, 776794195, 778372526, 779408991, 780328155, 781338751, 782196462, 782805443, 783355415, 783852935, 784274817, 784725845, 785133719, 785270154, 784988165, 784463584, 784012139, 783603072, 783088446, 782645106, 782470345, 782399118, 782302678, 782292187, 782227516, 781696200, 780742526, 780051887, 779846430]
2029.4G79846430j16348K443M53055O71804K31683l32593m39823l64244n21183o20067
2049.8G78811157k80917J11222N1916k00212j96040j42634l23891m29034k39015j13785
2070.2G77048767k73943l91782k01225k3663j23084j94907p4863q9407l30091l79681
2090.6G74966121j59025j20938l39866l62456j13368l4273k03192j92165L3140L8207
2111G73512185j67191j99616j01924k11060m15385l68595j94967k23517l28839j57476
2131.4G71143615J27375R6321q9824l2425O5089j10329k96652k16842j42335l17812
2151.8G70226181m51386l02017j53840k34425k70426r6142o8665l21090l54231n8293
2172.2G67915666L994k45095l17692j42217j28508l36528l64542j70409j51694l36349
$$ y = [779846430, 779730082, 779732525, 780185580, 780857384, 781089067, 780756474, 780316651, 779952407, 779431224, 778811157, 778530240, 778641462, 778693378, 778493166, 778297126, 778154492, 777830601, 777401567, 777162552, 777048767, 776774824, 776383042, 776181817, 776158154, 776035070, 775840163, 775765300, 775675893, 775345802, 774966121, 774807096, 774686158, 774346292, 773983836, 773870468, 773836195, 773633003, 773440838, 773473978, 773512185, 773344994, 773145378, 773043454, 772832394, 772417009, 772048414, 771853447, 771629930, 771301091, 771143615, 771270990, 771367311, 771277487, 771245062, 771310151, 771199822, 770903170, 770686328, 770543993, 770226181, 769774795, 769472778, 769318938, 769084513, 768814087, 768717945, 768649280, 768328190, 767973959, 767915666, 767919660, 767674565, 767356873, 767214656, 767086148, 766749620, 766385078, 766214669, 766062975, 765726626]
2192.6G65726626l35276j35899j32203l10004k90215j32322j76191l54290l47376j94252
2213G63318598k29656l82841l12567j64568k62499m34876l64422j88888k08973k70367
2233.4G60498941j06156L0875j39475l31699k55645j65879l03686m12643k71082j31488
2253.8G58412063k47776l93749l19361k40326l37363l70800j81973m3333j24931j75595
2274.2G55976856q4639q6307k20478k39015j24692j53840l41773m11213l30328l60787
2294.6G53623784n20766n59092n10275o34194r35316j144230j202106j285553j297117
2312.9G45535135j058817q30471r14633j063049r36091q03232j046777j311898j087428
2331.3G36482739p52508q33929q94785m93705O2943O61492J663148K003134N95271
$$ y = [765726626, 765391350, 765255451, 765123248, 764813244, 764523029, 764390707, 764214516, 763860226, 763512850, 763318598, 763088942, 762706101, 762393534, 762228966, 761966467, 761531591, 761167169, 760978281, 760769308, 760498941, 760392785, 760423660, 760284185, 759952486, 759696841, 759530962, 759227276, 758814633, 758543551, 758412063, 758164287, 757770538, 757451177, 757210851, 756873488, 756502688, 756320715, 756277382, 756152451, 755976856, 755892217, 755805910, 755585432, 755346417, 755221725, 755067885, 754726112, 754314899, 753984571, 753623784, 753103018, 752543926, 752033651, 751399457, 750464141, 749319911, 748117805, 746832252, 745535135, 744476318, 743645847, 742731214, 741668165, 740732074, 739928842, 738882065, 737570167, 736482739, 735730231, 734896302, 734001517, 733507812, 733570755, 734232247, 735895395, 737898529, 738493800]
2349.7G38493800j508117k689600k304434j343191n99742L7730P75218J316845J493037
2368G33671546J609504J788736J817762J661838J580655J559138J287163P96675M18604
2386.4G46191621K58446Q0049j84715k62857j38044j56403l35693l45886k11715k23220
2406.8G44671583l57985l35813j69873j61708l00586k97427j59621j81616l15487k46823
2427.2G42144644p7247r8050j77264n0009J10329N722j73867j38462n3644j55747l01182
2449.6G41035223k92480k62797l62396m70817m15147k94208k74479k23935p1883n2810
2470G38314271k53558l91126l15845k96831m47273m82321l15130k28882l11553l12507
2490.4G34959245j67132j25706k49505l27051k97427l00169l20434j78397N3048Q1837
$$ y = [738493800, 736985683, 734296083, 731991649, 730648458, 730048716, 730086446, 730861664, 732178509, 733671546, 735281050, 737069786, 738887548, 740549386, 742130041, 743689179, 744976342, 745773017, 746191621, 746450067, 746530116, 746345401, 746082544, 745944500, 745788097, 745452404, 745106518, 744894803, 744671583, 744313598, 743977785, 743807912, 743646204, 743345618, 743048191, 742888570, 742706954, 742391467, 742144644, 742067397, 741969347, 741792083, 741742074, 741852403, 741858125, 741684258, 741545796, 741492152, 741336405, 741035223, 740742743, 740479946, 740117550, 739646733, 739231586, 738937378, 738662899, 738438964, 738367081, 738314271, 738060713, 737669587, 737353742, 737056911, 736609638, 736127317, 735812187, 735583305, 735271752, 734959245, 734792113, 734666407, 734416902, 734089851, 733792424, 733492255, 733171821, 732993424, 733046472, 733128309]
2510.8G33128309r5904j87575j40131j62125k40087j89424o6697q0407j50800p0572
2531.2G31744587K7121o7056k00808j72794j19805k27570l61324l05474j86443j97291
2551.6G29933143k19405j27375o7115j80066l06785k76804k37941l40462m19080l03805
2572G27454305j42098j39057k32399k94030m11629o41167p80046o51956l73662j47342
2592.4G23640919N305R6678L4452j66774k91109k68459l15786m35233l73125j83046
2612.8G21743822j23858j44959O437K83480M03881L45528L02852K81691J35958p4923
2633.2G23159909j32501n1260l3021q8632p1228l0457r6620j45435p1764k9504j34826
2655.6G22274661k63095k51055j72674j84715k35081j96397j39952k02715k53976r9957
$$ y = [733128309, 733032405, 732844830, 732704699, 732542574, 732302487, 732113063, 732046366, 731965959, 731815159, 731744587, 731771708, 731704652, 731503844, 731331050, 731211245, 730983675, 730622351, 730316877, 730130434, 729933143, 729713738, 729586363, 729519248, 729339182, 729032397, 728755593, 728517652, 728177190, 727758110, 727454305, 727312207, 727173150, 726940751, 726646721, 726235092, 725593925, 724813879, 724161923, 723788261, 723640919, 723646224, 723742902, 723777354, 723610580, 723319471, 723051012, 722735226, 722299993, 721926868, 721743822, 721619964, 721475005, 721481442, 721764922, 722168803, 722514331, 722817183, 723098874, 723234832, 723159909, 723027408, 722976148, 722943127, 722854495, 722783267, 722752810, 722656190, 722510755, 722438991, 722409487, 722274661, 722011566, 721760511, 721587837, 721403122, 721168041, 720971644, 720831692, 720628977, 720375001, 720275044]
2676G20275044R0242Q0049j6511n0246j13607k75969m10438m08828l81410m33088m42385
2698.4G17912853l44098l00526l79086l76225j74105R775O557l2485Q226j2219j57058
2720.9G16161609k63155k41101k92539m64499m36664j94549j01328k38300l27706k74122
2741.2G13327646k74241l45230l15785k48790l20017l93629k45691n6863j29819l37898
2761.6G10659683l78490l26991m07815m82321l21984j51157k90215m81963l53277j26124
2782G07339346j70946l60191m08291m44711o21557o53624m03941k60949m22359n58197
2802.4G03034580m59492k86937j67072o199K46704L68416J97709p75R298K3663j26064
2824.9G02833831k33292j80245j91211l46959l95775k80559l71814o99281p67827n94736
$$ y = [720275044, 720365286, 720445335, 720428824, 720378578, 720264971, 719989002, 719578564, 719169736, 718788326, 718355238, 717912853, 717568755, 717268229, 716889143, 716512918, 716338813, 716348588, 716355145, 716322660, 716330886, 716318667, 716161609, 715898454, 715657353, 715364814, 714900315, 714463651, 714269102, 714167774, 713929474, 713601768, 713327646, 713053405, 712708175, 712392390, 712143600, 711823583, 711429954, 711184263, 711127400, 710997581, 710659683, 710281193, 709954202, 709546387, 709064066, 708742082, 708590925, 708300710, 707818747, 707465470, 707339346, 707168400, 706808209, 706399918, 705955207, 705333650, 704680026, 704276085, 704015136, 703592777, 703034580, 702575088, 702288151, 702121079, 702114880, 702361584, 702730000, 702927709, 702926934, 702936232, 702959895, 702833831, 702600539, 702420294, 702229083, 701882124, 701486349, 701205790, 700833976, 700134695, 699366868, 698772132]
2845.3F98772132o44147q56102q09133n26428l64721l13103j64628l8981j35839l31581
2865.7F94587469l92079l35098l42726m45724m61101l84570m24742m81189l37779j98245
2886.1F90784216k82168l60072k38359j91748m37141p08580p52568p30753p83384p28607
2906.5F85570836n07116m03106n81027q41975r69469r77516q78454n76317k12908m6074
2926.8F79576874m2439o079J71840L25441L15488L53038N13196N01513K18511n8413
2947.2F81868970j71184k52307m13715m72129l56734l53992m42206m03882l90946n37098
2967.6F78074777o04689m00126j72853j95742k48253k10047m12405q15034r71555q69215
2988F73174858r19044j373947k072036k659201k762914j761019L17573J832903J493394
$$ y = [698772132, 698127985, 697271883, 696462750, 695936322, 695571601, 695258498, 695093870, 695054889, 694919050, 694587469, 694195390, 693860292, 693517566, 693071842, 692610741, 692226171, 691801429, 691320240, 690982461, 690784216, 690502048, 690141976, 689903617, 689711869, 689274728, 688566148, 687813580, 687082827, 686299443, 685570836, 685063720, 684660614, 684079587, 683237612, 682268143, 681290627, 680412173, 679835856, 679622948, 679576874, 679534435, 679528356, 679700196, 680025637, 680341125, 680694163, 681207359, 681708872, 681927383, 681868970, 681697786, 681445479, 681031764, 680559635, 680202901, 679848909, 679406703, 679002821, 678611875, 678074777, 677470088, 677069962, 676897109, 676701367, 676453114, 676243067, 675830662, 675015628, 674044073, 673174858, 672255814, 670881867, 668809831, 666150630, 663387716, 661626697, 661944270, 663777173, 665270567]
3006.4F65270567J7464j382768k456248l269970l349185k555669j652479j079976n35488
3024.7F49006248Q8572K60055l7074j17064k13623o39677o17683K04623Q88229J45673
3045.1F48968279k067983m420697o067217p110178p157863n430102j710772L943026
3061.5F18946493R935915J2859464J1429548P734776M262566K051950P74741j20878
3077.8F67874575n40078j57177P28905J312077J257062Q40246L07084l06547q66175
3096.1F70449972j162231j142621o91950K81453J306474J655102J203835N69880K53618
3114.5F72723532R5606j60218m41014n64456m98713m18961m10556m14670m27365m66109
3134.9F69017076m58836l71933l93987n89609p58111q00074p50243n87940k69056M6849
$$ y = [665270567, 665288031, 663905263, 661449015, 658179045, 654829860, 652274191, 650621712, 649541736, 649006248, 649094820, 649354875, 649317801, 649200737, 648987114, 648347437, 647729754, 647934377, 648822606, 648968279, 646900296, 642479599, 636412382, 629302204, 622144341, 616714239, 615003467, 618946493, 628882408, 641741872, 653171420, 660906196, 665168762, 667220712, 667995453, 667874575, 667334497, 667177320, 667906225, 669218302, 670475364, 671315610, 671622694, 671316147, 670449972, 669287741, 668145120, 667453170, 667734623, 669041097, 670696199, 671900034, 672469914, 672723532, 672819138, 672658920, 672217906, 671653450, 671154737, 670735776, 670325220, 669910550, 669483185, 669017076, 668558240, 668186307, 667792320, 667202711, 666444600, 665644526, 664894283, 664306343, 664037287, 664084136]
3155.3F64084136Q0586k01643n45680p33078p77423p70509o92845n20110l75092l49223
3175.7F59199119l18528k51650l56675o00159p32064To96481o15119m46678k31445
3196.1F54218256p8856n7102j22130k08139l37541m87745n47886n80251o75142p62343
3216.5F50361121q05795q40605r17256j026690j072049j001477q05676n41687l96490
3234.8F42953396l65138l19958l47018m88401o33359p73429q74699p22348l67284j96755
3255.2F37865007l21210m08053k83241j19448k861Q2553N7518j83284m41671m97102
3275.6F35748208m80235m39704l93867m42624n16296n07891m42624m63128o08861p57158
3296F30695820q33094q40783q45254r30250j126766j342833j413941j266480r14812
$$ y = [664084136, 664164722, 663963079, 663417399, 662684321, 661906898, 661136389, 660443544, 659923434, 659548342, 659199119, 658880591, 658628941, 658272266, 657672107, 656940043, 656207979, 655511498, 654896379, 654449701, 654218256, 654139400, 654082298, 653960168, 653752029, 653414488, 652926743, 652378857, 651798606, 651123464, 650361121, 649555326, 648714721, 647797465, 646770775, 645698726, 644697249, 643891573, 643349886, 642953396, 642588258, 642268300, 641921282, 641432881, 640799522, 640026093, 639151394, 638429046, 638061762, 637865007, 637543797, 637135744, 636852503, 636733055, 636730194, 636812747, 636870265, 636686981, 636245310, 635748208, 635267973, 634828269, 634434402, 633991778, 633475482, 632967591, 632524967, 632061839, 631452978, 630695820, 629862726, 629021943, 628176689, 627246439, 626119673, 624776840, 623362899, 622096419, 621181607]
3314.4F21181607m31597l040J11938j34826n09441q04365j010120j174449j303435
3332.7F15922272j363039j345515j390100j504063j537502j533687j465321j298666
3349F04484379j383304j726270j836121j668334j540542j611173j702428j544237j368642
3367.4E90103328j558006j925826j990318j722991j514972j500308j533926j500725
3383.7E76856256j347065j080692q21650q85666j216829j229822q20160o09696r71913
3402.1E67872763j313269j098395p56562o43789o86765q35836q71956o95467n55337
3420.4E60415387m75466l30925j75715r7453j38283q5473R3579J2219k42710k32398
3440.8E58742762k5154R4831J99199L92795N19097N22852N23507N71013O07967N61655
$$ y = [621181607, 620750010, 620746970, 620858908, 620724082, 620214641, 619410276, 618400156, 617225707, 615922272, 614559233, 613213718, 611823618, 610319555, 608782053, 607248366, 605783045, 604484379, 603101075, 601374805, 599538684, 597870350, 596329808, 594718635, 593016207, 591471970, 590103328, 588545322, 586619496, 584629178, 582906187, 581391215, 579890907, 578356981, 576856256, 575509191, 574428499, 573606849, 572721183, 571504354, 570274532, 569454372, 568844676, 567872763, 566559494, 565461099, 564704537, 564060748, 563373983, 562538147, 561666191, 560970724, 560415387, 559939921, 559608996, 559433281, 559335828, 559197545, 559112072, 559205651, 559217870, 558975160, 558742762, 558717608, 558812439, 559011638, 559404433, 559923530, 560446382, 560969889, 561540902, 562148869, 562710524]
3461.2E62710524O17861Q98123J041353P36713K97606K44260N22435P95483P80881
3479.6E68645239N37574N73516P98225P83921P28965P77423P89344Q17895P90477O83248
3500E75925827O66261P02202P06554P51554R80497J241147J159788Q79883P56860P86781
3520.4E84557354Q66652Q45611P55906Q94249J152992J199901J160979J143039J038611
3538.7E93615294R47713Q84176Q04782Q57055R93728J018644J064658J143157J066089
3557.1F02395296R59873Q23081L97444K2173P18832K011656K096117J404345J138270
3575.4F11967087J252472J364351J317441R21726L73006O61314J727223J829743J275003
3593.8F22689366J324594J629353J601219J503468J207590N89967M40359R28938J201868
$$ y = [562710524, 563328385, 564226508, 565267861, 566004574, 566302180, 566546440, 567068875, 567864358, 568645239, 569182813, 569756329, 570554554, 571338475, 572067440, 572844863, 573634207, 574452102, 575242579, 575925827, 576592088, 577294290, 578000844, 578752398, 579732895, 580974042, 582133830, 583013713, 583770573, 584557354, 585424006, 586269617, 587025523, 587919772, 589072764, 590272665, 591433644, 592576683, 593615294, 594563007, 595447183, 596251965, 597109020, 598102748, 599121392, 600186050, 601329207, 602395296, 603355169, 604178250, 604575694, 604597867, 605316699, 607328355, 609424472, 610828817, 611967087, 613219559, 614583910, 615901351, 616823077, 617196083, 617857397, 619584620, 621414363, 622689366, 624013960, 625643313, 627244532, 628748000, 629955590, 630545557, 630985916, 631914854, 633116722]
3612.1F33116722J204968R56177Q10743J605868K058506J085043l77476n20468J457989
3630.5F41398072K296329J558542R76861O69956M52399J16825p41899j680076q50320
3648.8F44196689J862288K665281J494706J107812J452922J000762K66075l34322j186371
3667.2F52525842j519143n66900l88920n48065J073956J914025J301884N21124m13418
3685.6F53900385j170397o60121Q70704J428545Q39770K3245m91499k62320L98159
3703.9F54876471J58906q70586j331389j79529J257181R75132q7798o50048n58138
3722.3F53590202j78873K54333L37601m73679j450240j087249O26922J537502M24147
3740.6F53580666j391709j426935J06632j16825l72529J132071J562536N61535N0187
$$ y = [633116722, 634321690, 635277867, 636088610, 637694478, 639752984, 640838027, 640460551, 639940083, 641398072, 643694401, 645252943, 646229804, 646899760, 647352159, 647468984, 646727085, 645047009, 644196689, 646058977, 648724258, 650218964, 651326776, 652779698, 653780460, 654046535, 653712213, 652525842, 651006699, 650439799, 650050879, 649502814, 650576770, 652490795, 653792679, 654313803, 653900385, 652729988, 652069867, 652940571, 654369116, 655208886, 655232131, 654740632, 654478312, 654876471, 655035377, 654164791, 652833402, 652653873, 653911054, 654886186, 654798388, 654148340, 653590202, 653411329, 653665662, 654003263, 653529584, 652079344, 650992095, 651619017, 653156519, 653580666, 652188957, 650762022, 650868654, 650751829, 650379300, 651511371, 653073907, 653635442, 653685629]
3759F53685629M39525L54767k57731m57584k31088M27962Q22842K78175m57645n11944
3779.4F54092908o2823K2888O497K31802K37167q7500o45577r95398q40724r20713
3799.8F51038527o15656L73244L68715M03881Q02338J63674j007914j285255p02024
3818.1F49539530n52416K86639J149893N87225m1425m15504o92785p63297r56118o44028
3838.5F47497714L89993R66251R60052M64081o74188k151966k474248L66866K281964
3856.9F47626519J227975k44915q60811l91662j28448n68270k10166N75244P08342
3875.2F47733808K37941n51521n07355r5129m2856K46882L5525j93536L65912K23876
3895.6F47453547q39949j379371q94010R0182J078606J274705O39379n067m18842o38187
$$ y = [653685629, 654125154, 654479921, 654222190, 653764606, 653533518, 653961480, 654784322, 655062497, 654604852, 654092908, 654030085, 654052973, 654059470, 654291272, 654528439, 654440939, 653795362, 652799964, 651959240, 651038527, 650422871, 650796115, 651164830, 651568711, 652371049, 652534723, 651526809, 650241554, 649539530, 648987114, 649273753, 650423646, 651010871, 650969446, 650553942, 649861157, 649097860, 648141742, 647497714, 647887707, 648853958, 649814010, 650278091, 649603903, 647451937, 644977689, 645344555, 647626519, 648854494, 648609579, 647748768, 647357106, 647228658, 646660388, 646450222, 647025466, 647733808, 647971749, 647420228, 646912873, 646817744, 646774888, 647021770, 647057295, 646863759, 647229671, 647453547, 646613598, 645234227, 644340217, 644430399, 645509005, 646783710, 647423089, 647418022, 646999180, 646360993]
3916F46360993l62932R2983N0187j70231l1292m053k66731j28508K95103K40743j52469
3938.5F45923793m45902m59433j99854r1016j05202L2305P0453q9526j44303l0816
3958.9F44460499O8128J64152J73151M172j27673j34885j23203o8784k2530q4400j25707
3981.3F44182920r9241j38104k38836k68757k16961j64926j20342q3387
3997.6F42852366
$$ y = [646360993, 645998061, 646091044, 646141231, 645971000, 645939708, 645935655, 645668924, 645540416, 645835519, 646076262, 645923793, 645477891, 645018458, 644818604, 644727588, 644622386, 644654691, 644725144, 644635618, 644491315, 644460499, 644528627, 644692779, 644865930, 644870102, 644742429, 644607544, 644484341, 644415557, 644393027, 644308627, 644182920, 644083679, 643945575, 643706739, 643437982, 643221021, 643056095, 642935753, 642852366]
##END=$$ End of the data block
