##TITLE=Cerejeira Imperial $$ Begin of the data block
##JCAMP-DX=5.00 $$ ACD/SpecManager v 10.08
##SPECTROMETER/DATA SYSTEM=Alpha
##DATE=20 Feb 2015 13:16:36
##DATA TYPE=INFRARED SPECTRUM
##DATA CLASS=XYDATA
##ORIGIN=
##OWNER=
##NPOINTS=1667
##FIRSTX=599.57470703
##LASTX=3997.16503906
##MAXX=3997.16503906
##MINX=599.57470703
##MAXY=0.03022745
##MINY=0.02021329
##XFACTOR=1.0000000000
##YFACTOR=1.000000000000000e-10
##FIRSTY=0.03022745
##DELTAX=2.03937006
##XUNITS=1/CM
##YUNITS=ABSORBANCE
##XYDATA=(X++(Y..Y))
599.6C02274488j908895l043357k950374j518875j581200l325213k944842j565627
$$ 302274488 300365593 297322236 294371862 292852987 291271787 287946574 285001732 283436105
615.9B83436105j123082O19944J218039j085139r05320M18797j649820j682303R11615
$$ 283436105 282313023 282932967 284151006 283065867 282160547 282579344 280929524 279247221 280158836
634.2B80158836p69719l493242k768803j053457N8152j26772j214351j453646r04668
$$ 280158836 279389117 275895875 273127072 272073615 272131767 272004995 270790644 269336998 268432330
652.6B68432330j145359j751613r65502N5302j279954k517830j817700o75861J88742
$$ 268432330 267286971 265535358 264569856 264625158 263345204 260827374 259009674 258333813 258522555
671B58522555L70071K22027j100339k167430j016054k92883n05577o44364m74974N50430
$$ 258522555 258892626 259114653 258014314 255846884 254830830 254537947 254032370 253388006 252913032 253463462
691.3B53463462Q23066l40604q36718n01555m37312p94679j420565j068134n32045
$$ 253463462 254286528 253945924 253109206 252607651 252170339 251375660 249955095 248886961 248354916
709.7B48354916j455192k024956j33105J662411L40007j101028l78825J10381l96595
$$ 248354916 246899724 244874768 244741663 246404074 246744081 245643053 245264228 245374609 244978014
728.1B44978014p6145J265780J457966q1397j253560j86842J166649P85421J73226
$$ 244978014 244901869 246167649 247625615 247544218 246290658 246103816 247270465 248055886 248229112
746.4B48229112n21559j476351j312066n66076p07545q44039p9926L71747M12576L52934
$$ 248229112 247707553 246231202 244919136 244353060 243645515 242801476 242721550 243093297 243505873 243858807
766.8B43858807L29949N54826K01575J12281P25872M55007L10690J483038K286099
$$ 243858807 244188756 244743582 244945157 245057438 245783310 246238317 246549007 248032045 250318144
785.2B50318144J904591J290404J238920J429822J337435K072640L918279M978273
$$ 250318144 252222735 253513139 254752059 256181881 257519316 259591956 263510235 268488508
801.5B68488508M593637K536810r05152l883764o790031j0265615j2970511j3564471
$$ 268488508 273082145 275618955 274713803 270830039 264040008 253774393 240803882 227239411
817.8B27239411j1143423p145629l466382j30534J707132J661350K250019L927946
$$ 227239411 216095988 208950359 205483977 205353443 207060575 208721925 210971944 214899890
834.1B14899890M276708L252812L025382L323276L009066K795849L168676K656318
$$ 214899890 219176598 222429410 225454792 228778068 231787134 234582983 237751659 240407977
850.4B40407977J264457J697931L004950K413243Q32304J45324N52516R94429P85888
$$ 240407977 241672434 243370365 246375315 248788558 249620862 249766186 250318702 251313131 252099019
868.8B52099019J55270J32508J112614J395922L14880j03768M39808l036j203716j572165
$$ 252099019 252254289 252386797 253499411 254895333 255210213 255106445 255546253 255543217 254339501 252767336
889.2B52767336q28263L15495O97691L21046l4851l21306j76709L6228R7398N71571
$$ 252767336 251939073 252254568 252952259 253273305 253238454 252917148 252740439 252776667 252874065 253445636
909.6B53445636O52615M69611P20862R27746J026821J051500J015495J031403J056660
$$ 253445636 254098251 254567862 255288724 256216470 257243291 258294791 259310286 260341689 261398349
927.9B61398349J388825J417622P16411P52304J169163P35019N69913O79885N8934
$$ 261398349 262787174 264204796 264921207 265673511 266842674 267577693 268147606 268827491 268886425
946.3B68886425m96228l64557k2035L75305N71683M40664K44305R8068n59k64700j09058
$$ 268886425 268390197 268025640 268003605 268378910 268950593 269391257 269635562 269733630 269733071 269468371 269359313
968.7B69359313J50651m97960p73240k1215L45576q1509k63788j48676l44180n15356
$$ 269359313 269509964 269012004 268238764 268217549 268563125 268481616 268217828 268069152 267724972 267209616
989.1B67209616n24112o60289q54451j193750j506359r47229j55326k54829p22669
$$ 267209616 266685504 266025215 265170764 263977014 262470655 261523426 261368100 261113271 260390602
1007.4B60390602r01427o84466m32432o53528j238398j406036q40221o01299j364238
$$ 260390602 259489175 258804709 258372277 257718749 256480351 255074315 254234094 253632795 252268557
1025.8B52268557k030209j791883j173541p36248p42693r97819q44262j46758K27261
$$ 252268557 250238348 248446465 247272924 246536676 245793983 244796164 243951902 243805144 244032405
1044.2B44032405j43200n55813k49949L58094J88369o28587j037959o28903k51755
$$ 244032405 243889205 243333392 243083443 243441537 243629906 243001319 241963360 241334457 241082702
1062.5B41082702l42019k18079O2660m1034l06424k44845J51284M64283L09460k87294
$$ 241082702 240740683 240522604 240585264 240544230 240237806 239992961 240144245 240608528 240917988 240630694
1082.9B40630694l14638N28861P82366N57229R03868J042876M48562J31447O50473
$$ 240630694 240316056 240844917 241627283 242184512 243088380 244131256 244579818 244711265 245361738
1101.3B45361738J105908N51809l46061k66861K34265J55624M7125J93994J39754L6434
$$ 245361738 246467646 247019455 246673394 246406533 246640798 246796422 246843547 247037541 247177295 247213729
1121.7B47213729P953k45515n88801o71726l75546N6159J71195J04905M97754Q66335
$$ 247213729 247221682 246976167 246387366 245715640 245340094 245396253 245567448 245672353 246170107 247036442
1142.1B47036442M43384L7272J26324R1810j04681q6333k74032o10762m97810o33058
$$ 247036442 247479826 247517098 247643422 247735232 247630551 247544218 247270186 246659424 246161614 245528556
1162.4B45528556j165904j289602j105592r52612q04402p91662j086890j090430l57032
$$ 245528556 244362652 243073050 241967458 241014846 240210444 239418782 238331892 237241462 236884430
1180.8B36884430M84176N21131n4408j98241k94745m90435j82073Q2832q20l22834
$$ 236884430 237368606 237889737 237835329 237637088 237342343 236851908 236669835 236752667 236751847 236429013
1201.2B36429013o83292n53411J22972J06040o62934o40694j61994L00240Q56593R36557
$$ 236429013 235745721 235192310 235315282 235421322 234758388 234117694 233955700 234255940 235112533 236049090
1221.6B36049090O96461N91055P96225J219194J347605J320373J549125J497083J063905
$$ 236049090 236745551 237336606 238132831 239352025 240699630 242020003 243569128 245066211 246130116
1239.9B46130116J029372J133476P62325O29741Q03955N09285J82651R3523K62782
$$ 246130116 247159488 248292964 249055289 249685030 250488985 250998270 251180921 251274444 251537226
1258.3B51537226O97859O80145N41098Q09878P23843K60248K04519N80158O58482O2622
$$ 251537226 252235085 252915230 253456328 254266206 254990049 255250297 255454816 256034974 256693456 256756078
1278.7B56756078j37854J95522j3448j12877K35904K97986J18111l018K26591N35920
$$ 256756078 256618224 256813746 256800298 256687421 256923325 257221311 257339422 257336404 257562995 258098915
1299.1B58098915N08260K20891J08537N09712Q33534P06688L96687K94447N19660L98177
$$ 258098915 258607175 258828066 258936603 259446315 260279849 260986537 261383224 261677671 262197331 262595508
1319.5B62595508j43815n59575n84219l82662n30779n69746j90716l9023q1342p49304
$$ 262595508 262451693 261892118 261307899 260925237 260394458 259824712 259633996 259594973 259513631 258764327
1339.9B58764327j871493j785029r29963o54272p37589o01374m89391p16709n36963
$$ 258764327 256892834 255107805 254177842 253523570 252785981 252184607 251695216 250978507 250441544
1358.2B50441544K94540M6622j336485j591500j179129o46021J14236j70116j050457
$$ 250441544 250736084 250782706 249446221 247854721 246675592 246029571 246143807 245973691 244923234
1376.6B44923234j097564p09928j80677N61513P10525k41790l34867P99019J006239
$$ 244923234 243825670 243115742 242935065 243496578 244207103 243965313 243630446 244429465 245435704
1394.9B45435704J02706m32208m31091J33924M86151L46228O05136J013503J536719
$$ 245435704 245538410 245106202 244675111 244809035 245295186 245641414 246246550 247260053 248796772
1413.3B48796772K468620L024973J822039J57878K96030O94283R50954J083892P74432
$$ 248796772 251265392 254290365 256112404 256270282 256566312 257260595 258211549 259295441 260069873
1431.6B60069873J246538J526047m84810j441482l69158J94051L01823J38562j45976
$$ 260069873 261316411 262842458 262357648 260916166 260547008 260741059 261042882 261181444 261035468
1450B61035468M43161J778007K362113o19125k654623r76082J02278o61407o79735
$$ 261035468 261478629 263256636 265618749 264999624 262345001 261368919 261471197 260809790 260130055
1468.4B60130055P77040J215991m92707j749043j612641p28219j46125K87574J293681
$$ 260130055 260907095 262123086 261630379 259881336 258268695 257540476 257394351 257681925 258975606
1486.7B58975606J234971j255292j950115m675M80655j027435j152642K93218K695564
$$ 258975606 260210577 258955285 257005170 257000495 257481150 256453715 255301073 255594291 258289855
1505.1B58289855L273711j505800l482383k048146k69804L24696M10658q233j018047
$$ 258289855 261563566 260057766 256575383 254527237 254257433 254582129 254992787 254984554 253966507
1523.4B53966507o68224n74310q07121N2396N02598n7891M47761J655649P14530q64398
$$ 253966507 253298283 252723973 251916852 251969248 252471846 252413955 252861716 254517365 255231895 254367497
1543.8B54367497j219046l79197M93340j918k46410J004115J700837k007112l216546
$$ 254367497 253148451 252769254 253262594 253260676 253014266 254018381 255719218 253712106 250495560
1562.2B50495560j418348o49393m72236q53650j208782q39271r82583j595840j478940
$$ 250495560 249077212 248427819 247955583 247101933 245893151 245053880 244071297 242475457 240996517
1580.5B40996517r51309m22652j69035l32334p32410q08016r27057j473948j673419
$$ 240996517 240045208 239622556 239453521 239121187 238388777 237580761 236653704 235179756 233506337
1598.9B33506337j226589p55545o30952p15182j022610j137797o60420p0929k00756
$$ 233506337 232279748 231524203 230893251 230178069 229155459 228017662 227357242 227286313 227085557
1617.2B27085557p20825n92005o89812j073219o28195r5666j71959J89412P28760m56516
$$ 227085557 226364732 225772727 225082915 224009696 223381501 223285835 223113876 223303288 224032048 223575532
1637.6B23575532j243669p52453J41375J152493K49594q80640Q52850P26022k793838
$$ 223575532 222331863 221579410 221720785 222873278 223122872 222242232 223095082 223821104 221027266
1656B21027266k372823q51453m54504p98665o10258K44304K08412r72040j264457r42722
$$ 221027266 218654443 217802990 217348486 216549821 215939563 216183867 216392279 215420239 214155782 213213060
1676.4B13213060l69213L47998P63516j45211j764410j756921j404472q26437K99532
$$ 213213060 212843847 213191845 213955361 213810150 212045740 210288819 208884347 208057910 208357442
1694.7B08357442J001172R85917M880j416449j037176p65175j068227m68213N59408
$$ 208357442 209358614 210344531 210349411 208932962 207895786 207130611 206062384 205594171 206153579
1713.1B06153579J349282Q60840j453534j948327r86867o37788o0499R10722J161955
$$ 206153579 207502861 208363701 206910167 204961840 203974973 203337185 203276686 204187408 205349363
1731.4B05349363J222808K31564p06892k18228J67210N4818J46851N73080M73223q24239
$$ 205349363 206572171 206803735 206096843 205878615 206045825 206100643 206247494 206820574 207293797 206469558
1751.8B06469558j300387p12052q32919n43632L44236q7358j45659O53788P74898K28211
$$ 206469558 205169171 204457119 203624200 203080568 203424804 203337446 203191787 203845575 204620473 204848684
1772.2B04848684q18632r21264K07778N58029m13451q84253m43981L64502J179408
$$ 204848684 204030052 203108788 203316566 203874595 203461144 202576891 202132910 202497412 203676820
1790.6B03676820Q73916k94671l89609J60075N4799q11703r12156j3020N91539M29135
$$ 203676820 204550736 204256065 203866456 204026531 204081330 203269627 202357471 202344451 202935990 203365125
1811B03365125j12858l07858j40499j54060K0340P55433Q35862J31596K48272J24015
$$ 203365125 203252267 202944409 202803910 202649850 202670190 203425623 204261485 204393081 204641353 204765368
1831.4B04765368n78221m92148j40536n1540K72375Q23997M80581m39864q01235n90291
$$ 204765368 204187147 203694999 203554463 203502923 203775298 204599295 205079876 204640012 203838777 203248486
1851.8B03248486k9299M08254L51872K01315L64948K94969K80309O75246Q8494r08114
$$ 203248486 203219187 203627441 203979313 204180628 204545576 204840545 205120854 205796100 205884594 204976480
1872.2B04976480p43214j69295k981L8520K21934L21548L33488L77503K61906K19569
$$ 204976480 204233266 204063971 204060990 204099510 204321444 204642992 204976480 205353983 205615889 205835458
1892.6B05835458J93808l72678p18627k79769J15856K83849N66132N33350j76970n81648
$$ 205835458 206029266 205656588 204937961 204658192 204774048 205057897 205624029 206157379 205980409 205398761
1913B05398761n961N14854M18834L28757k0358m81848k8778L10540k03587k45105K30725
$$ 205398761 205392800 205907654 206326488 206655245 206634887 206153039 206124261 206434801 206231214 205986109 206216834
1935.4B06216834K16067K61981P40104M05945o12568p37906k53003m0978J17812K85022
$$ 206216834 206432901 206694882 207434986 207840931 207228363 206490457 206237454 206196476 206314288 206599310
1955.8B06599310K30223L4738j25691N8375O04093N66971j42828l18791K1178K90815
$$ 206599310 206829533 206864271 206738580 206796955 207401048 207968019 207825191 207506400 207527578 207818393
1976.2B07818393K60695q4992k90833j40109Q0914L06572N73025J67302o60754o57402
$$ 207818393 208079088 207994096 207703263 207563154 207644068 207950640 208523665 208690967 208030213 207372811
1996.6B07372811P2494M91217K05021K2538K17538R2890j13528J60244M29675K65911
$$ 207372811 207445305 207936522 208141543 208164081 208381619 208474509 208360981 208521225 208950900 209216811
2017B09216811j24946k58033J20327M40311K33073j91778l49880j84159R4529J44243
$$ 209216811 209091865 208833832 208954159 209394470 209627543 209435765 209085885 208901726 208996255 209140498
2037.4B09140498k6356J62981N58533L97470n0534n6792k8517j42362L4776O0312j08406
$$ 209140498 209114142 209277123 209835656 210233126 210182592 210125800 210097283 209954921 209989697 210050009 209941603
2059.8B09941603N4334L28756K83663K3637k07592l85270l59974k1179L37679L56753
$$ 209941603 209995937 210324693 210608356 210631993 210424401 210039131 209679157 209657978 209995657 210352410
2080.2B10352410J56760J04625P9069l0976L1795M7274j71456j24183J55978K29068
$$ 210352410 210509170 210613795 210692864 210661888 210693683 210740957 210569501 210445318 210601296 210830364
2100.6B10830364J55699P8548J53537J44579j40239j90492K0377J23642M359j82614
$$ 210830364 210986063 211064611 211218148 211362727 211222488 211031996 211052373 211176015 211180374 210997760
2121B10997760o9029L13595M46811J43237J0040K28062J63354k38921k28323J28299
$$ 210997760 210928731 211242326 211689137 211832374 211842414 212070476 212233830 211994909 211766586 211894885
2141.4B11894885L259l39206l62806o5230K29646J62255J98669N52591M77620j59033
$$ 211894885 211898144 211558938 211196132 211130902 211360548 211522803 211721472 212274063 212751683 212592650
2161.8B12592650l06088K78372M77377J10120j57431l87113m01773j918K41119L81414
$$ 212592650 212286562 212564934 213042311 213152431 212995000 212607887 212206114 212204196 212445315 212826729
2182.2B12826729N44563J80006l94806l21344Q6445J59052o3070j80527J1958J63950
$$ 212826729 213371292 213551298 213156492 212835148 212921593 213080645 213017575 212837048 212849006 213012956
2202.5B13012956N5991K6915J49273J3858j92486k179M26601N01145K1216m29377l44497
$$ 213012956 213068947 213095862 213245135 213258993 213066507 213064328 213490929 213992074 214013290 213583913 213239416
2225B13239416J71029N36218K41753l51612l64911M5412K44174L04021J89263o9067
$$ 213239416 213410445 213946663 214188416 213836804 213471893 213517305 213761479 214065500 214254763 214185696
2245.4B14185696j07139Q8643L0194r1382K81204L64985j96099l72585P2066K56728
$$ 214185696 214078557 214167200 214197394 214106012 214387216 214752201 214556102 214183517 214255583 214512311
2265.8B14512311j49570k08039K50190K55108j99359n04460j32434N85765P65640O00088
$$ 214512311 214362741 214154702 214404892 214660000 214460641 213956181 213823747 214409512 215175152 215775240
2286.2B15775240K19271k66060k60342r6560o8005L5632K5295p5344L1274K81278L97451
$$ 215775240 215994511 215728451 215468109 215371549 215303544 215339176 215364471 215289127 215320401 215601679 215999130
2308.6B15999130K89753q5160k87834k66340n31245l66382K25752K92957k6394k99196
$$ 215999130 216288883 216203723 215915889 215649549 215118304 214751922 214977674 215270631 215244237 214945041
2329B14945041l22312n27595n54714L03183R88021P31703O92364R21078m359j234486
$$ 214945041 214622729 214095134 213540420 213843603 214831624 215563327 216255691 217176769 217172410 215937924
2349.4B15937924j875423k212748j802463l39598Q69409J509413J436770L80147N30295
$$ 215937924 214062501 211849753 210047290 209707692 210577101 212086514 213523284 213903431 214433726
2367.7B14433726J790132J575332N09527Q3577q8737k41994k10125j93231k30242j74455
$$ 214433726 216223858 217799190 218308717 218392294 218303557 218061563 217851438 217658207 217427965 217253510
2388.1B17253510j90754l82047l38219J52104L90187J70618j1977j29789j00136M1891
$$ 217253510 217062756 216680709 216342490 216494594 216884781 217055399 217043422 216913633 216813497 216855388
2408.5B16855388K06269L24119J83434R0897J88891P1041l30154n56260j88835L05045
$$ 216855388 217061657 217385776 217569210 217660107 217848998 217920039 217589885 217033625 216844790 217149835
2428.9B17149835J09933k61515k440L78266J84234m0810K27242L56287K76286M4108
$$ 217149835 217259768 216998253 216995813 217374079 217558313 217517503 217744745 218101032 218377318 218421426
2449.3B18421426l80539k27540M22969N12041j09430k97819Q1938J83750J61976M8186
$$ 218421426 218040887 217813347 218236316 218748357 218638927 218341108 218423046 218606796 218768772 218816958
2469.7B18816958k52630j33384L85474M89224J10287j46217k28417l46843k33557J17868
$$ 218816958 218564328 218430944 218816418 219305642 219415929 219269712 219041295 218694452 218460895 218578763
2490.1B18578763K84743L63197L27807O1542j70991l03313j78330J21165L54201K60584
$$ 218578763 218863506 219226703 219554510 219616052 219445061 219141748 218963418 219084583 219438784 219699368
2510.5B19699368k11839l59937j85129N1447L80352K80719K9691J32322J99061O0182
$$ 219699368 219487529 219127592 218942463 218993910 219374262 219654981 219684672 219816994 220016055 220076237
2530.9B20076237j7695N5544J7974j63652m17977n03157j00452L45483N63898O42687
$$ 220076237 220058542 220114086 220132060 219968408 219550431 219047274 218946822 219292305 219856203 220498890
2551.3B20498890N18020J51992m18909o11674j53035K01240O7540o9719O9178M19114
$$ 220498890 221016910 221168902 220749993 220138319 219985284 220186524 220254064 220184345 220253523 220672637
2571.7B20672637M53498j69687n80120j49776L07747l2690l86704o4540J27982l5930
$$ 220672637 221126135 220956448 220376328 220226552 220534299 220501609 220114905 220050365 220178347 220142417
2592.1B20142417O9439K16216J14124J21184J96379K86269J57152j57152j2256J03228
$$ 220142417 220211856 220428072 220542196 220663380 220859759 221146028 221303180 221146028 221133772 221237000
2612.4B21237000k14092l17041q5235J99359N31692O19460M4405n60637k51141M58174
$$ 221237000 221022908 220705867 220620632 220819991 221351683 221971143 222015548 221454911 221203770 221661944
2632.8B21661944M83021j03265n12693k16551N03138O24172j80639p01789l22797K70494
$$ 221661944 222144965 222041700 221529007 221312456 221815594 222439766 222259127 221557338 221234541 221505035
2653.2B21505035N88428L74094l8967o2939K05711J49589k15527j04364K91821L79588
$$ 221505035 222093463 222467557 222428590 222365651 222571362 222720951 222505424 222401060 222692881 223072469
2673.6B23072469J83676j81496k64049J20979J95112j91294k31881R2090K96477L40920
$$ 223072469 223256145 223074649 222810600 222931579 223126691 222935397 222703516 222795606 223092083 223433003
2694B23433003K96235J34651k8071M6883J53166K5630k40673l53213J15558N81630
$$ 223433003 223729238 223863889 223835818 223882701 224035867 224061497 223820824 223467611 223583169 224164799
2714.4B24164799J62180m00133j75517O8396j43628L5166O15996O64051j88648p58618
$$ 224164799 224326979 223926846 223751329 223819725 223676097 223711263 224327259 224991310 224802662 224044044
2734.8B24044044J4714Q03601M76558n718J7714J16154O817j28149K3450J68774k25491
$$ 224044044 224058758 224862359 225338917 225333199 225350913 225467067 225473884 225345735 225369185 225537959 225312468
2757.2B25312468p17808m55212N2061K59225O25643Q79579N26588k18991m27030Q6445
$$ 225312468 224594660 224139448 224191509 224450734 225076377 225955956 226482544 226263553 225836523 225922968
2777.6B25922968R6523l47924l77092j88388J19693L23355M2543J29230P16374O89737
$$ 225922968 226019491 225671567 225294475 225106087 225225780 225549135 225591678 225720908 226437282 227127019
2798B27127019J7193k23667K71127M15705k54773p29337m58155J51899N81723M44315
$$ 227127019 227144212 226920545 227191672 227607377 227352604 226623267 226165112 226317011 226898734 227343049
2818.4B27343049L38536N72893N70249J67825m81066o12214m5020M65438Q74791J107790
$$ 227343049 227681585 228254478 228824727 228992552 228511486 227899272 227854252 228319690 229194481 230302271
2838.8B30302271O33299J59982M31110N65480q5477n64661J78852R85227M95166n23292
$$ 230302271 230935570 231095552 231526662 232092142 232006665 231442004 231620856 232606083 233101249 232577957
2859.2B32577957q29324k45999K20611K2389j9111L39412J26157l81749k67309K1030
$$ 232577957 231748633 231502634 231723245 231745634 231726523 232065935 232192092 231810343 231543034 231564064
2879.6B31564064J72015K60491M69703O43730O4187l22033Q1398K11131J45584M07007
$$ 231564064 231736079 231996570 232466273 233110003 233174190 232852157 232933555 233144686 233290270 233697277
2900B33697277L62787k70736j00247J156479J590829L36785p22166K14558J487173
$$ 233697277 234060064 233789328 233689081 234845560 236436389 236773174 236051008 236265566 237752739
2918.3B37752739J190398K26461k00477R2983P91885O77649p19242j464635o44512
$$ 237752739 238943137 239169598 238969121 239062104 239853989 240531638 239812396 238347761 237703249
2936.7B37703249J9688l02400m16097p1078j27666m51580n08092k74125j8310j06581
$$ 237703249 237722937 237420537 237004440 236933362 236805696 236354116 235846024 235571899 235553589 235447008
2957.1B35447008J12597N82133K11559o09495j217928o25904N07868P1861o98566m38970
$$ 235447008 235559605 236141738 236353297 235743802 234525874 233899970 234407838 234479699 233781133 233342163
2977.5B33342163J4212J68532l8519m21740m85052l30712m21610k88598L07709N23757
$$ 233342163 233356375 233524907 233486388 233064648 232579596 232248884 231827274 231538676 231846385 232370142
2997.9B32370142K86475L67332L20133k65762l44683J07046K02936O8824O7465J93939
$$ 232370142 232656617 233023949 233344082 233078320 232733637 232840683 233043619 233112443 233179908 233373847
3018.3B33373847L24510J1753m69275j26473M93582N19585M42062K98917j77324n55459
$$ 233373847 233698357 233710110 233240835 233114362 233607944 234127529 234569591 234868508 234691184 234135725
3038.7B34135725m17699L1144K45869K98340L70759L55747K08505O2305J68607K80123
$$ 234135725 233718026 233749170 233995039 234293379 234664138 235019885 235228390 235290695 235459302 235739425
3059.1B35739425j07940o41644m70803k179J93715L71076L61540O4485j19694j6950
$$ 235739425 235631485 234989841 234519038 234516859 234710574 235081650 235443190 235507675 235387981 235371031
3079.4B35371031N0571K43485M71733J61547j98446l6619K92453L38406L97209M83096
$$ 235371031 235421602 235665087 236136820 236298367 236099921 236063302 236355755 236694161 237091370 237574466
3099.8B37574466J55586J0655L26223L09814j64900l88287q19M85908N96735N32270
$$ 237574466 237730052 237740707 238066930 238376744 238211844 237823557 237822738 238308646 238905381 239437651
3120.2B39437651L37548L5018l70927o19516k8442N67268K10628o6478J11871P7970
$$ 239437651 239775199 239810217 239439290 238819774 238791332 239358600 239569228 239502750 239614621 239692591
3140.6B39692591j0133J09151M08162L67444k30912l75081K83960R22345Q38246M35207
$$ 239692591 239682458 239791609 240199771 240567215 240336303 239961222 240245182 241167527 242005773 242440980
3161B42440980J94609k41976l82904J23978J43144j00713K09119K17054l08473l26540
$$ 242440980 242635589 242393613 242010709 242134687 242277831 242177118 242386237 242603291 242294818 241968278
3181.4B41968278M19319O26035K27224K00960O6534j3690K16849K72970J81552p4487
$$ 241968278 242387597 243013632 243240856 243441816 243508350 243494660 243711509 243984479 244166031 244091544
3201.8B44091544m15370m04920J15521M69834L12440K63434J45137j41039K18544J38581
$$ 244091544 243676174 243271254 243386775 243856609 244169049 244432483 244577620 244436581 244655125 244793706
3222.2B44793706p26525j65105Q59033M05349L558K52537o8750o09942l54107K20462
$$ 244793706 244067181 243902076 244761109 245166458 245170016 245422553 245353803 244743861 244389754 244610216
3242.6B44610216K73586J46795J28727L8073K5201J33124O7651k59653m56571j89227
$$ 244610216 244883802 245030597 245159324 245197397 245222598 245355722 245423373 245163720 244707149 244517922
3263B44517922L35202O21192M80749K29832K01370J54525j69314j85203J27945J90959
$$ 244517922 244853124 245474316 245955065 246184897 246386267 246540792 246371478 246186275 246314220 246505179
3283.4B46505179K35904K39200K459k11522l99202j75331M29861M27980j37556o50696
$$ 246505179 246741083 246980283 246982742 246771220 246372018 246196687 246626548 247054528 246916972 246266276
3303.8B46266276p58823n6420R59337P78977k27709n54267n44637k42424L92553M00524
$$ 246266276 245507453 245451033 246410370 247189347 246961638 246407371 245862734 245620310 246012863 246413387
3324.2B46413387r0673j68495J18073p9721m35300k70084J3690K57772L40510j0133
$$ 246413387 246322714 246154219 246272292 246192571 245757271 245487187 245500877 245758649 246099159 246089026
3344.6B46089026k07387m7385J12857K35867n6978o14971l19108L88398n196m01270
$$ 246089026 245881639 245834254 245947111 246182978 246126000 245511029 245191921 245580319 245575123 245173853
3364.9B45173853j3709k94969o79977l98401o3256R3375j378n0925l03090q96547q93082
$$ 245173853 245160144 244865175 244185198 243786797 243723541 243816916 243815538 243764613 243461523 242564976 241671894
3387.4B41671894r9354N36144N19790K14074l75305q74717p90562l80315L38722N61494
$$ 241671894 241572540 242108684 242628474 242842548 242467243 241592526 240801964 240421649 240760371 241321865
3407.8B41321865J01254j62553l75956m16171m5151J06432n66859j086462l37754N08409
$$ 241321865 241423119 241260566 240884610 240468439 240423288 240529720 239962861 238876399 238538645 239047054
3428.2B39047054M56237j31839o61890o21304k80552o0163Q1770K46633L25962k35457
$$ 239047054 239503291 239371452 238709562 238088258 237807706 237747543 237829313 238075946 238401908 238166451
3448.6B38166451j051016r82172j97050L67891O6143m52902j32267M21722L26093k17855
$$ 238166451 237115435 236133263 235936213 236304104 236370247 235917345 235785078 236206800 236532893 236315038
3469B36315038o09215n75539l96743k70512l94509p32373m47389M76893P65436O3926
$$ 236315038 235705823 235130284 234733541 234463029 234068520 233336147 232888758 233365651 234131087 234195013
3489.3B34195013j97236L11993L30862p0501l87673k82209J24574n5731j91237l58671
$$ 234195013 233997777 234309770 234640632 234570131 234182458 233900249 234024823 233969092 233777855 233419184
3509.7B33419184j037307q31467n196M3418O6347M14774R3933m01940l21641j29417
$$ 233419184 232381877 231550410 231545214 231588632 231654979 232069753 232163686 231761746 231440105 231310688
3530.1B31310688k53897l36059l12011m83115k05244O95735J265369K59671j096744
$$ 231310688 231056791 230720732 230408721 229925606 229720362 230416097 231681466 231941137 230844393
3548.5B30844393o39297j9371l80483n09247m27328k66582O18585K227071K032090
$$ 230844393 230205096 230185725 229805242 229295995 228868667 228602085 229220670 231447741 233479831
3566.8B33479831j382231k560094p81268K82414M59012M6119j021102j087152N89788
$$ 233479831 232097600 229537506 228756238 229038652 229497664 229543783 228522681 227435529 228025317
3585.2B28025317K042763M78756j638066j291838k01054K85879M36772l06089p25873
$$ 228025317 230068080 230546836 228908770 227616932 227415878 227701757 228138529 227832440 227106567
3603.5B27106567K12752R20147L65339q9761M8559j22506K47471K98247q65478j217965
$$ 227106567 227319319 228239466 228604805 228515044 228563603 228441097 228688568 228986815 228121337 226903372
3623.9B26903372j90381K130828J989380j394488k649892j956169n98617N41639P84360
$$ 226903372 226712991 228843819 230833199 229438711 226788819 224832650 224234033 224775672 225560032
3642.3B25560032P99242J268555J834910P68565j645331j847613m51617n10477j160074
$$ 225560032 226359274 227627829 229462739 230231304 228585973 226738360 226286743 225776266 224616192
3660.6B24616192p52043j13640N00698J536775J138579m15928K82004M33121j003370
$$ 224616192 223864149 223750509 224251207 225787982 226926561 226510633 226792637 227225758 226222388
3679B26222388j373104j228787k91318J447573J604352p26170j320597l37176o5956
$$ 226222388 224849284 223620497 223329179 224776752 226381104 225654934 224334337 223997161 223931205
3697.4B23931205j51266N15692Q03359j67936m13545M22281J144055L30787l90764
$$ 223931205 223779939 224295631 225098990 224931054 224517509 224939790 226083845 226414632 226023868
3715.7B26023868m2543k13776l2727N90366L37362m49438r02283Q84290L323015J652502
$$ 226023868 225981325 225767549 225734822 226325188 226662550 226213112 225310829 226195119 229518134 231170636
3736.1B31170636j646225k933871j725182J447834J370572j66409J030155R71984j046471
$$ 231170636 229524411 226590540 224865358 226313192 227683764 227517355 228547510 229519494 228473023
3754.5B28473023j486186l49936j5273r60697p39675k00644k35811M04008p1693j226869
$$ 228473023 226986837 226636901 226621628 225660931 224921256 224720612 224484801 224888809 224817116 223590247
3774.8B23590247m42303J023393M10508m24143J21575J76914L0790L4347l08007j91629
$$ 223590247 223147944 224171337 224581845 224157702 224279277 224456191 224486981 224521328 224213321 224021692
3795.2B24021692l12068r7025J486950M47407q15447L24137m39994j630932j85017
$$ 224021692 223709624 223612599 225099549 225546956 224731509 225055646 224615652 222984720 222799703
3813.6B22799703J987145Q97795M23472J786240n32214j968686p30641l5446J09598
$$ 222799703 224786848 225684643 226108115 227894355 227362141 225393455 224662814 224627368 224736966
3831.9B24736966P36639J444221J458879M13098o48555j191776j202654n41490R5964
$$ 224736966 225473605 226917826 228376705 228789803 228141248 226949472 225746818 225205328 225301292
3850.3B25301292J492705K269503n80382j781843n77346M93880k53357j286994o0518
$$ 225301292 226793997 229063500 228483118 226701275 226123929 226617809 226364452 225077458 225016940
3868.7B25016940J327340N44097k17370n57974J4174N39981n2638L71728o4355r42777
$$ 225016940 226344280 226888377 226671007 226113033 226127207 226667188 226614550 226986278 226921923 225979146
3889.1B25979146K01519M94961o07036j14814J135599R61032L84953j56593j240112
$$ 225979146 226180665 226675626 226068590 225953776 227089375 228050407 228435360 228278767 227038655
3907.4B27038655j423545q72705k82954Q61752R14261l82848l29651O33151N93978
$$ 227038655 225615110 224742405 224459451 225321203 226235464 225852616 225522965 226156116 226750094
3925.8B26750094k31005o5733K06195r79546j181569R9223J112614J472942j56294
$$ 226750094 226519089 226453356 226659551 225680005 224498436 224597659 225710273 227183215 227026921
3944.1B27026921j446698O2436O42724k43261l85289l47904k98526k2911n998n16586
$$ 227026921 225580223 225642659 226285383 226042122 225656833 225308929 225010403 224987492 224981494 224464908
3964.5B24464908p61281k45553K22661M04734L03108p08122j159236j2256N22360R6187
$$ 224464908 223703627 223458074 223680735 224085469 224388577 223680455 222521219 222508963 223031323 223127510
3984.9B23127510N55404R46373R9223p6872L4627j004711
$$ 223127510 223682914 224629287 224728510 224651638 224686265 223681554
3997.1B23681554
$$ 223681554
##END=$$ End of the data block
