##TITLE=Cera Carnauba $$ Begin of the data block
##JCAMP-DX=5.00 $$ ACD/SpecManager v 10.08
##SPECTROMETER/DATA SYSTEM=Alpha
##DATE=01 Sep 2014 15:03:16
##DATA TYPE=INFRARED SPECTRUM
##DATA CLASS=XYDATA
##ORIGIN=
##OWNER=
##NPOINTS=1667
##FIRSTX=599.64648438
##LASTX=3997.64306641
##MAXX=3997.64306641
##MINX=599.64648438
##MAXY=0.98191845
##MINY=0.48421231
##XFACTOR=1.0000000000
##YFACTOR=1.000000000000000e-9
##FIRSTY=0.98125100
##DELTAX=2.03961372
##XUNITS=1/CM
##YUNITS=ARBITRARY UNITS
##XYDATA=(X++(Y..Y))
599.6I81251001l00467O4254L14772K31862J19269R8944j2696M113J40607O795k14100
622.1I81704354k45452k36570m45307n91576l63052L5525L74317M62889M18485K10106
642.5I81323719r0659j56343n7816j2159k06173k63691L0279K26796J41501J3888o70612
664.9I80278730k335727j445472J593888J318574J85847k73228m56273l88861o7234
683.3I78410244J60038K29240J52349r3817j94311j98186l19719l94583l97742q33809
703.7I76519704j499474j727283j840472k893389o945312j6461551k2835314q861363
720I13455546J3306558J4710248j220286j4457405q300900J3056516K2348941J4338493
736.3I67237711N782723K336562J219034Q08120N04732J13905j61589j8954M2737k06888
$$ y = [981251001, 980950534, 981014788, 981329560, 981561422, 981680691, 981779635, 981766939, 981771052, 981911659, 981918454, 981704354, 981458902, 981222332, 980777025, 980185449, 979822397, 979857922, 980232239, 980695128, 981113613, 981323719, 981233060, 981076717, 981018901, 981006742, 980800569, 980536878, 980567157, 980793953, 980935454, 980949342, 980278730, 977943003, 976497531, 978091419, 979409993, 979595840, 979322612, 978866339, 978477478, 978410244, 978570282, 978799522, 978951871, 978858054, 978663743, 978465557, 978145838, 977751255, 977353513, 976519704, 975020230, 973292947, 971452475, 968559086, 961613774, 945152223, 922316909, 913455546, 926762104, 941472352, 940252066, 925794661, 917493761, 930550277, 952899218, 967237711, 973020434, 975356996, 976576030, 977384150, 977888882, 978002787, 977841198, 977822244, 977864981, 977658093]
756.7I77658093j38521K4616j67548l44157l25621k55346j14679m530j21057k21253
777.1I75989997k10404j22964L25560Q76367R95279P73012M87328K45809J6034k72512
797.5I79103506m71235n54859m97699j62840J17481M0948j59740l48986n80370q00669
817.9I75685537j165688j776278k450288l068327l150881k106845j60992J905024L174543
836.2I66885805L152251K386809J568734R91702P95305P43211N44488J67549j59920
854.6I77075934k23457j45734p4327n4896q821J15335J50740K0385j44243k41995l35396
877I76133525m18186m36008l72886k94328l02255k29717p331J10984N781j41203k66671
899.5I73781705m75764o73533p06732o75917p77364j033127j429737j886904j947760
$$ y = [977658093, 977519572, 977544188, 977376640, 977032483, 976706862, 976451516, 976336837, 976332307, 976211250, 975989997, 975779593, 975656629, 975982189, 976858556, 977853835, 978626847, 979114175, 979359984, 979376018, 979103506, 978632271, 978077412, 977579713, 977416873, 977534354, 977575302, 977415562, 977066576, 976486206, 975685537, 974519849, 972743571, 970293283, 967224956, 964074075, 961967230, 961806238, 963711262, 966885805, 970038056, 972424865, 973993599, 974985301, 975780606, 976523817, 977068305, 977235854, 977075934, 976852477, 976706743, 976632416, 976577520, 976568699, 976684034, 976834774, 976855159, 976710916, 976468921, 976133525, 975715339, 975279331, 974906445, 974612117, 974309862, 974080145, 974072814, 974183798, 974189579, 974048376, 973781705, 973305941, 972632408, 971925676, 971249759, 970472395, 969439268, 968009531, 966122627, 964174867]
917.8I64174867j071871L87133J307785J323700R81629O02186K64585P7486p570K622
938.2I68042552N7281j06156m80295o89029o48201o03556n74470k88546M86612J418412
958.6I66614604J820922J539290R23574L93987Q8155j72556m95433r61364j423120
977I68328059j662553j521766p45594K64465Q60334R59515P03156K97547m8697l86059
997.4I67048407o97554p95900q49784j081109j405418j618325j600624j623034j906693
1015.7I55469966k030432j714230j180470o30796o8903P72655J414180J041830J04546
1034.1I53178346n08606n31256m15266n18858n61893m17233k31028j78814k50577l12865
1054.5I49251950l64065k79844k87295p94053j167535n54383L64005M69625J18554
$$ y = [964174867, 963102996, 963490129, 964797914, 966121614, 967103243, 967705429, 967970014, 968047500, 968039930, 968042552, 968099833, 967993677, 967513382, 966824353, 966176152, 965572596, 964998126, 964709580, 965196192, 966614604, 968435526, 969974816, 970898390, 971292377, 971380532, 971207976, 970712543, 969751179, 968328059, 966665506, 965143740, 964398146, 964662611, 965522945, 966482460, 967185616, 967483163, 967434466, 967048407, 966350853, 965554953, 964705169, 963624060, 962218642, 960600317, 958999693, 957376659, 955469966, 953439534, 951725304, 950544834, 949914038, 949845135, 950617790, 952031970, 953073800, 953178346, 952669740, 952138484, 951723218, 951204360, 950642467, 950225234, 949994206, 949815392, 949564815, 949251950, 948887885, 948608041, 948320746, 947526693, 946359158, 945804775, 946168780, 946638405, 946756959]
1072.8I46756959J95920N99623P93457P29442N89251M37558K69234J74523K45928K76506
1093.2I51068401L8207l31462n17606m53413k75731j02520n2392j03176k8193J76549
1113.6I49418664L38852M82262N40494M25756K92719K48074K16425J62423J42633P7069
1134I52345371r8765k64108m08411n70118p16269r77636j485705k098501k611697l137111
1154.4I39977050l803075m257798m202783l896415l739297l396988j991630K49505
1170.7I14938569K055407K998888L840923M490972L441691P48873j004875n245K204001
1189.1I33709204K816677J482249k62261j286149j251042m11033M42326N18679O2585
1207.5I35821235r8646P3612Q9407o3360j32620k30133m30763m99308m26829n12064
$$ y = [946756959, 946952879, 947552502, 948345959, 949075401, 949664652, 950102210, 950371444, 950545967, 950791895, 951068401, 951106608, 950775146, 950257540, 949804127, 949528396, 949425876, 949373484, 949270308, 949242115, 949418664, 949757516, 950239778, 950780272, 951206028, 951498747, 951746821, 951963246, 952125669, 952268302, 952345371, 952246606, 951982498, 951574087, 951003969, 950287700, 949310064, 947824359, 945725858, 943114161, 939977050, 936173975, 931916177, 927713394, 923816979, 920077682, 916680694, 914689064, 914938569, 916993976, 919992864, 923833787, 928324759, 931766450, 932515323, 931510448, 931505203, 933709204, 936525881, 938008130, 937745869, 936459720, 935208678, 934797645, 935239971, 935758650, 935821235, 935722589, 935796201, 935885608, 935822248, 935689628, 935459495, 935028732, 934529424, 934102595, 933590531]
1227.9I33590531p60257p76112n50687n53489q97348j230240j315355j390517j426637
1246.2I24689889q79586Q9944Q52167J370251J721681J761853J754821J875460J825094
1264.6I35061574J608849J372218J064479P44343N93841N90265N45799M74155N15700
1282.9I42571223O14702P15256R77338J396358J590430J349211Q80659L82542k8312
1301.3I50449407k65598k08318J21831L67463L91245M18007L64125J73450K34246L99232
1321.7I52445090K50876o5029k38597J9192N37575N72502R239m69208k71916K84672
1342.1I53074396K79963k03789n20467m21405k11656k05756k58207m88758r92536j028896
1362.5I49022889k88188k5988m49955j018823j753866j696348l53694J017093J719058
$$ y = [933590531, 932830274, 932054162, 931503475, 930949986, 930052638, 928822398, 927507043, 926116526, 924689889, 923810303, 923900247, 924752414, 926122665, 927844346, 929606199, 931361020, 933236480, 935061574, 936670423, 938042641, 939107120, 939851463, 940445304, 941035569, 941581368, 942055523, 942571223, 943185925, 943901181, 944878519, 946274877, 947865307, 949214518, 950095177, 950477719, 950449407, 950183809, 949975491, 950097322, 950464785, 950856030, 951274037, 951638162, 951811612, 952045858, 952445090, 952695966, 952630937, 952392340, 952411532, 952949107, 953521609, 953530848, 953061640, 952789724, 953074396, 953354359, 953150570, 952630103, 952208698, 951997042, 951791286, 951533079, 951044321, 950051785, 949022889, 948734701, 948708713, 948258758, 947239935, 945486069, 943789721, 943436027, 944453120, 946172178]
1380.8I46172178J472175M57048j13427K04265j18971j105011p65025M57406Q39949
1399.2I47500587O91533k4438p41005j059532j796067k432347j919388q98063j14263
1417.5I39207017J223028K047837J275957M30524l70324j138210j133919j466393k265632
1435.9I37809885j372755j49429o57976j504480k203644k710283k850949l491879n032956
1454.3I17835534r270370j9086361k5924027j5895784J0747313K3653508N591929j6895652
1470.6H70756090j7071903J5134692L3640027K5151611J3579130O940484K820790J65999
1486.9I51116920n25117Q15093J388669j03474j264631n76258j68025j643062n089164
1505.2I43950951p152438l922880k357602j842558P52926M256069N649388N287647
$$ y = [946172178, 947644353, 948101401, 947987974, 948192239, 948073268, 946968257, 946203232, 946660638, 947500587, 948192120, 948167682, 947426677, 946367145, 944571078, 942138731, 940219343, 939321280, 939207017, 940430045, 942477882, 943753839, 944184363, 943814039, 942675829, 941541910, 940075517, 937809885, 936437130, 936287701, 935629725, 934125245, 931921601, 929211318, 926360369, 922868490, 917835534, 908565164, 889478803, 863554776, 847658992, 858406305, 882059813, 887651742, 870756090, 853684187, 868818879, 902458906, 927610517, 941189647, 948130131, 950950921, 951116920, 950591803, 951406896, 952795565, 952692091, 951427460, 950851202, 950683177, 949040115, 943950951, 936798513, 932875633, 930518031, 928675473, 929428399, 933684468, 939333856, 944621503]
1521.6I44621503M403711K865612J898289J158595k03907n46277J42813j196266k917826
1539.9I50226247n22017J954794K001226R44614r0182m61578r88364k131999l044367
1558.3I47888374M82083L104448J470327k27391j172245q85546k30908j267791j849056
1576.6I47312295m56154l83139j302063j430452q04186n3108K51294j50621r82762
1595I42001104j962185l088533m069150l921091k005339J040399L938556N107760L850162
1613.4I40891683J706779R97901J163244l9160j223803j102209r54866p23481n79417
1631.7I40136671j412570j083553J907348K936542J740873J371j416266m19974M60982
1650.1I42851424j551986j028299K423287J800119j79648j072407n20765o08147j941144
$$ y = [944621503, 949025214, 951890826, 953789115, 954947710, 954743803, 954197526, 954340339, 953144073, 950226247, 949704230, 951659024, 953660250, 954604864, 954514682, 954053104, 953064740, 950932741, 947888374, 948370457, 951474905, 952945232, 952717841, 951545596, 950660050, 950429142, 949161351, 947312295, 946856141, 946473002, 945170939, 943740487, 942936301, 942883193, 943134487, 942983866, 942001104, 940038919, 936950386, 932881236, 928960145, 926954806, 927995205, 931933761, 937041521, 940891683, 942598462, 943596363, 944759607, 944720447, 943496644, 942394435, 941439569, 940716088, 940136671, 938724101, 937640548, 939547896, 942484438, 944225311, 944226682, 942810416, 942390442, 942851424, 941299438, 940271139, 942694426, 944494545, 944314897, 943242490, 942721725, 942113578, 940172434]
1668.4I40172434j802862n85079r25005j094877q41439j821280l425478k921164J10745
1686.8I26865995N56588l26872j066565k483964k874136k137304j217842j99020r98318
1705.1I16118562j740992j523077j892686k541781k748787j429916J231373J221537
1721.5I06694233j881778o612599j2663483j8913627k1822453j9538939n373597J3263107
1737.8H33150864K7532875L1294823K3028791J3571441P009745L946125L227949K324164
1754.1I45086777Q94189K75910L5167l4273K92897j65522r60409j099587m58538Q40127
1774.5I44706738J134634L84986n9843N2214K13146K79427j67012j007259o64771N25534
1794.9I45397794N74112n9724j87874K99335M57943L8087l47495j69099K35439J82211
$$ y = [940172434, 938369572, 937784493, 936859488, 935764611, 934923172, 933101892, 929676414, 926755250, 926865995, 927422583, 927095711, 926029146, 923545182, 920671046, 918533742, 917315900, 917116880, 916118562, 914377570, 912854493, 910961807, 908420026, 905671239, 904241323, 905472696, 906694233, 904812455, 898199856, 885536373, 866622746, 844800293, 825261354, 819887757, 833150864, 860683739, 891978562, 915007353, 928578794, 935588539, 939534664, 942762613, 945086777, 945980966, 946256876, 946292043, 946257770, 946550667, 946385145, 945424736, 944325149, 943866611, 944706738, 945841372, 946226358, 946166515, 946218729, 946431875, 946711302, 946544290, 945537031, 944872260, 945397794, 945971906, 945912182, 945724308, 946023643, 946481586, 946519673, 946172178, 946003079, 946238518, 946420729]
1815.3I46420729p6115p7665j86026o27756o91056m00067l20255J72019N89609K72751
1835.7I45076168J1861j04189o74248j056313r0063Q02517N67436J07944j04725j74403
1856.1I44361985k01464j19626q8215l41952q52585q94964R8050P75218M12464q3625
1876.5I43065286k56121l21031l55959l10004l52800n01513k66612N6386r775k7180
1896.9I40720677K4736k9385m6491p6116k03490k43366n2213R7215j57476m68790k06769
1919.3I39358532R7394M3393J05679J55329J4186j24335j64926j10865j35839l68535
1939.7I38870013n05686j73092J92523J65820M6015j3649r3222j58310j46449j07765
1960.1I38076198j13308k34187l15666j10805Q5652k9683j64927j09970L993L8147
$$ y = [946420729, 946344614, 946266949, 946080923, 945453167, 944762111, 944362044, 944041789, 944213808, 944803417, 945076168, 945088029, 944983840, 944309592, 943253279, 943163216, 943965733, 944533169, 944641113, 944536388, 944361985, 944160521, 944040895, 943952680, 943610728, 942758143, 941863179, 941961229, 942736447, 943148911, 943065286, 942809165, 942488134, 942132175, 941822171, 941469371, 940967858, 940701246, 940757632, 940747857, 940720677, 940745413, 940716028, 940669537, 940593421, 940389931, 940146565, 940094352, 940191567, 940034091, 939565301, 939358532, 939455926, 939499319, 939604998, 939760327, 939774513, 939650178, 939485252, 939374387, 939238548, 938870013, 938364327, 938191235, 938383758, 938549578, 938595593, 938581944, 938488722, 938330412, 938183963, 938076198, 937962890, 937728703, 937413037, 937302232, 937387884, 937358201, 937193274, 937083304, 937087297, 937125444]
1980.5I37125444n1677j74939k44081k59340k59936j14918J01507J5378j71900j63436
2000.9I35802102r9540q0645r6500j36733j76906j99795k55883k85148j65105k1756
2021.3I34284091J7583j6212j02401j81436j78755j36614j08420r3222r8705j04845
2041.7I33281064p6473k1219j7345q3506j22666j49846j99140k21967k04385j63793
2062.1I32020724j15454p391P4207k5272j85132k16663j45435j26600j38522r2029
2082.5I31042433m9949r7930j92643k00271j42574r1076o7413q8692r9242p5519q1658
2104.9I29855466j53780k00927j44601j9014K026j27553j94192j57297j03951o1869
2125.3I28694308p4387j29699j69576k02894k03252r2685k3961j18017k05755j61469
$$ y = [937125444, 937073767, 936898828, 936654747, 936395407, 936135471, 936020553, 936122060, 936137438, 935965538, 935802102, 935702562, 935621917, 935525417, 935388684, 935211778, 935011983, 934756100, 934470952, 934305847, 934284091, 934301674, 934285462, 934183061, 934001625, 933822870, 933686256, 933577836, 933484614, 933385909, 933281064, 933204591, 933183372, 933166027, 933082521, 932959855, 932810009, 932610869, 932388902, 932184517, 932020724, 931905270, 931897879, 931972086, 931946814, 931761682, 931545019, 931399584, 931272984, 931134462, 931042433, 930992484, 930894554, 930701911, 930501640, 930359066, 930267990, 930200577, 930111885, 930012643, 929937124, 929855466, 929701686, 929500759, 929356158, 929337144, 929339170, 929211617, 929017425, 928860128, 928756177, 928694308, 928619921, 928490222, 928320646, 928117752, 927914500, 927821815, 927797854, 927679837, 927474082, 927312613]
2145.7I27312613o8427j04129j63436n0664N6803k6822j85072k11001j24931r3460
2166.1I26341474j34826j15811m6075p5817j22786o3478m4644j63973k15888q5771
2186.5I25272405m172p4744j20044q5652p8380j08957j33574j61112j68085r0241k3187
2208.9I24224257o5922j24872j87874k11775j09792m3034q6725j21236j44303j69754
2229.3I22958970j20282q2851j51157j62721j24335j68204k00331j61052j54376k09511
2249.7I21424150j97947j27971r4413q1718j30415k16186j93179j43528k01225k25544
2270.1I19812024k02299k11119j56582o4134k2829o6459j59860k39729l04103k93434
2290.5I18091476k56777l31163m25220l97086l53813m46320n84244o35624o59168o98269
$$ y = [927312613, 927244186, 927140057, 926976621, 926925957, 926982760, 926955938, 926770866, 926559865, 926434934, 926341474, 926206648, 926090837, 926044762, 925968945, 925846159, 925782681, 925738037, 925574064, 925358176, 925272405, 925268233, 925193489, 925073445, 924987793, 924909413, 924800456, 924666882, 924505770, 924337685, 924247444, 924224257, 924158335, 924033463, 923845589, 923633814, 923524022, 923480988, 923394263, 923273027, 923128724, 922958970, 922838688, 922755837, 922604680, 922441959, 922317624, 922149420, 921949089, 921788037, 921633661, 921424150, 921226203, 921098232, 921003819, 920922101, 920791686, 920575500, 920382321, 920238793, 920037568, 919812024, 919609725, 919398606, 919242024, 919177890, 919155061, 919088602, 918928742, 918689013, 918384910, 918091476, 917834699, 917503536, 917078316, 916681230, 916327417, 915881097, 915296853, 914661229, 914002061, 913303792]
2310.9I13303792o67929o23107p35104r67384j075327q83222n74171m84169n42044
2329.3I06751335m51923k35855j57953k65300l49224k84850j1087P02560J194179N11170
2349.7I07403052q76129j834810j809001j326918n11408L20435N54561O26028R55462
2368I03501272J189888J165867J202344J377643J410067J274764J072288P97987M92811
2386.4I13484931K06172k3305j38044j27316p5996r9778j79350k19882k15590k14219
2406.8I12397623k14100j73628j35005j17659p7248o7353p7367n4240p8917j54257
2427.2I11247849j64687j05798p8738q1599q2433j26720j58131j32382j13964j38163
2447.6I10065234j62363j23084j12534j76191j89364j54435j50323j33694r1195j22726
$$ y = [913303792, 912635863, 912012756, 911277652, 910310268, 909234941, 908351719, 907777548, 907293379, 906751335, 906299412, 906063557, 905905604, 905640304, 905291080, 905006230, 904995143, 905697703, 906891882, 907403052, 906526923, 904692113, 902883112, 901556194, 901044786, 901365221, 901919782, 902545810, 903501272, 904691160, 905857027, 907059371, 908437014, 909847081, 911121845, 912194133, 912992120, 913484931, 913691103, 913667798, 913529754, 913402438, 913326442, 913226664, 913047314, 912827432, 912611842, 912397623, 912183523, 912009895, 911874890, 911757231, 911679983, 911612630, 911535263, 911481023, 911402106, 911247849, 911083162, 910977364, 910898626, 910817027, 910734594, 910607874, 910449743, 910317361, 910203397, 910065234, 909902871, 909779787, 909667253, 909491062, 909301698, 909147263, 908996940, 908863246, 908772051, 908649325]
2467.9I08649325k10225k81036k83897j58072n0306o5327r2268j26004j76608j57059
2488.3I07048523p9929p0632j28984j14382r1254j83821k00749j12414j88291k66850
2508.7I05611217j30475o1452j28686j53900j99079k82586k56657j06693m6014j58549
2529.1I04087126k07603j27494j04487j63257k12968k34723k84850l15845k80023k79009
2549.5I01876867k26855n1737R417j26540k26975k02060k39789l35455l28720k57849
2569.9H99890304j82689j35064j59323k09451k16603k10226k50160k91348k60889j81318
2590.3H97793233j75237k44022k62379k30193k17617k53916k53022j82092k10702l51966
2610.7H95412087l83555k75255k20298k77699l68058l79384l12507l34680m13954l43681
$$ y = [908649325, 908439100, 908158064, 907874167, 907716095, 907665789, 907600462, 907508194, 907382190, 907205582, 907048523, 906968594, 906897962, 906768978, 906654596, 906563342, 906379521, 906178772, 906066358, 905878067, 905611217, 905480742, 905419290, 905290604, 905136704, 904937625, 904655039, 904398382, 904291689, 904245675, 904087126, 903879523, 903752029, 903647542, 903484285, 903271317, 903036594, 902751744, 902435899, 902155876, 901876867, 901650012, 901598275, 901607692, 901481152, 901254177, 901052117, 900812328, 900476873, 900148153, 899890304, 899707615, 899572551, 899413228, 899203777, 898987174, 898776948, 898526788, 898235440, 897974551, 897793233, 897617996, 897373974, 897111595, 896881402, 896663785, 896409869, 896156847, 895974755, 895764053, 895412087, 895028532, 894753277, 894532979, 894255280, 893887222, 893507838, 893195331, 892860651, 892446697, 892103016]
2631.1H92103016j78635j05023p2003j1503j6690p8797j27733k24530k71499j75238
2651.5H90841365j07169q9288p4506j04546j50562j36256m0948j5676j68264k41638
2671.9H89712512q2671r298r1732j11341p5043j55329l17038l14652j93537j89006
2692.3H88172865l00050l24726l00169l33011l14295l14951l84271l66152l40521l99530
2712.7H84795189l93510l36111l60310m53949m45246l47615l21686l12090l30806l60548
2733.1H81133318l65675m08947m50671m14610l04341l02136l69966l00407k84732m38332
2753.5H77493501m88937m20451m33863n43296o13928n78046n84840o54996p13110p86781
2773.9H71675253p60257o67274p59483r66966j088738j176417j220048j112818j044631
$$ y = [892103016, 891924381, 891819358, 891747355, 891735852, 891719162, 891640365, 891512632, 891288102, 891016603, 890841365, 890734196, 890644908, 890570402, 890465856, 890315294, 890179038, 890138090, 890122414, 889954150, 889712512, 889629841, 889620543, 889528811, 889417470, 889342427, 889187098, 888870060, 888555408, 888361871, 888172865, 887872815, 887548089, 887247920, 886914909, 886600614, 886285663, 885901392, 885535240, 885194719, 884795189, 884401679, 884065568, 883705258, 883251309, 882806063, 882458448, 882136762, 881824672, 881493866, 881133318, 880767643, 880358696, 879908025, 879493415, 879189074, 878886938, 878516972, 878216565, 877931833, 877493501, 877004564, 876584113, 876150250, 875606954, 874993026, 874414980, 873830140, 873175144, 872462034, 871675253, 870914996, 870247722, 869488239, 868521273, 867432535, 866256118, 865036070, 863923252, 862878621]
2792.2H62878621j207531j371086j360952j330734j333773j381099j571357j750887
2808.6H51571202j748621j760960k014994k405763k659321k744794k969086l534019
2824.9H31733644m309416n257368o557763q371949j0980844j4941812k1191418l1516015
2841.2G28607059m7008992o1517894n6008697j6610145L5650015O3408136N9001088
2855.5G05520570M1670800K6296556J5777409Q797407M325211J638531l8504j229167
2871.8H02758813k463281m246474o292641p942915q921086r171129q897960q559942
2888.1G46263385q252144p783711p418811p490039p977545q751393r980559j2550473
2904.4F76058710j7463267k5198102l5456181m4751704m3843686k5133461M546702
$$ y = [862878621, 861671090, 860300004, 858939052, 857608318, 856274545, 854893446, 853322089, 851571202, 849822581, 848061621, 846046627, 843640864, 840981543, 838236749, 835267663, 831733644, 827424228, 822166860, 815609097, 807237148, 796256304, 781314492, 760123074, 728607059, 681598067, 620080173, 564071476, 547461331, 583111346, 646519482, 705520570, 747191370, 773487926, 789265335, 798062742, 802387953, 804026484, 803987980, 802758813, 800295532, 796049058, 789756417, 781813502, 772892416, 763721287, 754823327, 746263385, 738011241, 730227530, 722808719, 715318680, 707341135, 698589742, 688609183, 676058710, 658595443, 633397341, 597941160, 553189456, 509345770, 484212309, 488759011]
2918.7D88759011K9651493M2797804M5415818M1365922L5192907L0065000K6188135
2933G39436090K2248566J7911971J4167189J1804998J0068476P418752L400088p63536
2949.3H25692594l030598k267599P49767M294097O974638Q217692Q112192P036924
2965.6H55779707N692244M687846L970563L334820K851546K421737J934886J602471
2981.9H82275820J316666Q64268N74052O24418O20723M27663K57492J79172J58787
3000.3H87299061J24335J23263J55448K4856k15769k94984j62840K2650Q2612Q643
3020.7H87167275o2704o8188j0669j2338j44959l02374k78592o8486k146n8829p153
3043.1H86150837O0022j7464k33293l29435k11596j24216j51873k18093l11137l98695
$$ y = [488759011, 518410504, 561208308, 606624126, 647990048, 683182955, 713247955, 739436090, 761684656, 779596627, 793763816, 805568814, 815637290, 823056042, 826456130, 825692594, 822661996, 820394397, 821144164, 825438261, 832412899, 840630591, 848742783, 855779707, 861471951, 866159797, 870130360, 873465180, 876316726, 878738463, 880673349, 882275820, 883592486, 884456754, 885030806, 885655224, 886275947, 886703610, 886961102, 887140274, 887299061, 887423396, 887546659, 887702107, 887726963, 887511194, 887216210, 887053370, 887076020, 887158632, 887167275, 887104571, 887036383, 887025714, 887013376, 886868417, 886566043, 886287451, 886218965, 886216819, 886157990, 886150837, 886210859, 886193395, 885960102, 885630667, 885419071, 885294855, 885142982, 884924889, 884613752, 884215057]
3063.5H84215057l70205j35541P4864j5497k00451l25560l69370j66834J5140o9857
3083.9H82651746j50263j05977k0444J00195J44899q643j37806j05560o4194p3314
3104.3H82230639k02298k89857j26839q1181l55840m21464j34469M2975K4498k4021
3124.7H80662143j41740k41875j69933j55866k96593m20630l65257j67012j60575k33412
3145.1H78309250k12133l59416n48780l63290r2805j15752j59860j53362k03014k50399
3165.5H75850439k81095k61665j70946j71900k95400k92123k23458l00169l53753k40922
3185.9H73259008j59741k00152k56181k76327k48253j44541m6194p6473j25944j41502
3206.3H71583700j58489j81973k77817k75194n9963P212j10328j33395j59860j65045
$$ y = [884215057, 883844852, 883709311, 883784175, 883768678, 883568227, 883242667, 882873297, 882706463, 882721603, 882651746, 882501483, 882395506, 882375062, 882475257, 882620156, 882611513, 882473707, 882368147, 882303953, 882230639, 882028341, 881738484, 881611645, 881530464, 881174624, 880753160, 880618691, 880661666, 880686164, 880662143, 880520403, 880278528, 880108595, 879952729, 879656136, 879235506, 878870249, 878703237, 878542662, 878309250, 878097117, 877737701, 877188921, 876825631, 876732826, 876617074, 876457214, 876303852, 876100838, 875850439, 875569344, 875307679, 875136733, 874964833, 874669433, 874377310, 874153852, 873853683, 873499930, 873259008, 873099267, 872899115, 872642934, 872366607, 872118354, 871973813, 871927619, 871851146, 871725202, 871583700, 871425211, 871243238, 870965421, 870690227, 870630264, 870637476, 870527148, 870393753, 870233893, 870068848]
3226.7H70068848j87099l92556m36723j44184R5785Q8751K5094j5915j48237k02894
3247.1H68750870J2219J56343K861j77145j67429r7871l0398O4253j1325k55942l59058
3269.5H67887378q2314J78814p809j39713N4717J13607o6400j48594j07527j80960
3289.9H67501199k33710j01685K9087P1466j6093k49386l49283j98543L2365J76430
3310.3H66661847J13129j907N0068K9146j98602k98023j71304k4975J491j12474k38717
3332.7H65809679k34842j51158l9518J4246n6922k8611l7014k74122k90692n5015m7922
3355.2H64608109j91808j89721r2149o8843k05994k98739j38998J40429J91688o5028
3375.5H63688946j56343p510j312j26004j91808k62141m46260l65972N6922J38462
$$ y = [870068848, 869881749, 869489193, 869052470, 868908286, 869004071, 869092822, 869117916, 869102001, 868953764, 868750870, 868763089, 868919432, 868922293, 868745148, 868577719, 868479848, 868449450, 868513703, 868502378, 868246436, 867887378, 867805064, 867983878, 867976069, 867836356, 867891073, 868004680, 867938280, 867789686, 867682159, 867501199, 867267489, 867165804, 867194891, 867266357, 867250264, 867000878, 866651595, 866453052, 866485417, 866661847, 866774976, 866773069, 866823137, 866852283, 866653681, 866355658, 866184354, 866159379, 866160870, 866048396, 865809679, 865574837, 865423679, 865384161, 865398407, 865341485, 865312874, 865275860, 865001738, 864711046, 864656031, 864608109, 864416301, 864226580, 864134431, 864065588, 863859594, 863560855, 863421857, 863562286, 863753974, 863688946, 863532603, 863525093, 863523781, 863397777, 863205969, 862943828, 862497568, 862131596, 862188518, 862326980]
3395.9H62326980k11299l74555j02818J35421R239j24633j11401n2512O7592O0498
3416.3H61622512j02222j37686m1783L57j07109k65718k59161k31921k49207n5731
3436.7H60172331J94013J75775k8432k77638l63708o5565K38955J86741J1504n3882
3457.1H60190094L1471K03550J30653k17438l20613J4603L64840L48449O9737l35455
3477.5H60479891o21617m10676l3795L2305j8060O0j00851k61665j95801n2988j29998
3500H58686805k06828P7068L37601J39058q3685p6771J9550K01106K06531j27078m21464
3522.4H58751893k72751R2507K42412K26855J46627L2545N3167J55866J8179l43024
3542.8H59104276m85063r2387M01497L69966J71840K04325J43885p4267k06590l24547
$$ y = [862326980, 862115681, 861741126, 861638308, 861773729, 861782968, 861658335, 861546934, 861494422, 861562014, 861622512, 861520290, 861382604, 861340821, 861341178, 861234069, 860968351, 860709190, 860477269, 860228062, 860172331, 860366344, 860542119, 860513687, 860236049, 859872341, 859806776, 860045731, 860232472, 860243976, 860190094, 860221565, 860425115, 860555768, 860338330, 860017717, 860032320, 860397160, 860745609, 860815346, 860479891, 859858274, 859447598, 859413803, 859446108, 859428048, 859428108, 859327257, 859065592, 858869791, 858816803, 858686805, 858479977, 858557045, 858894646, 859033704, 858950019, 858873248, 858892798, 859093904, 859300435, 859173357, 858751893, 858479142, 858571649, 858814061, 859040916, 859187543, 859220088, 859273255, 859429121, 859447300, 859104276, 858619213, 858526826, 858928323, 859298289, 859470129, 859674454, 859818339, 859744072, 859537482, 859212935]
3563.2H59212935n92649m45843N00500J008273N79059K8491j85013j68085j14501l22401
3583.6H59500766p17700n01573L68715M95433q4042k25127m6492j32739p3016N5432
3604H58639657k40862n04076k07246J89424K95877O7115l66747J7524Q88049O13332
3624.4H59392047o53923j496791j52231J296044R79364L26633O0976j4067k27571p72476
3644.8H58738005j502693j669585p6771J439810R00507k7299L35038O61134K63572
3663.1H59061718k31028p33673j188815r41872n19693n33402N59032J512229J113296
3681.5H58097792N29050k43067j357436j278699M99606J438976R62555J07288n57005
3699.8H58199060o34968n6327J39714n31555j090109m19080R36150J105666K18094
$$ y = [859212935, 858620286, 858174443, 858674943, 859683216, 860262275, 860290766, 860105753, 859937668, 859823167, 859500766, 858783066, 858281493, 858650208, 859145641, 859061599, 858836472, 858789980, 858657241, 858584225, 858639657, 858398795, 857894719, 857687473, 857876897, 858172774, 858239889, 857873142, 857890666, 858778715, 859392047, 858738124, 857241333, 857089102, 858385146, 859364510, 859691143, 859752119, 859738052, 859510481, 858738005, 857235312, 855565727, 855488956, 856928766, 857829273, 857801974, 858137012, 858798146, 859061718, 858830690, 858097017, 856908202, 855966330, 855446637, 854913235, 855472267, 856984496, 858097792, 858626842, 858383775, 857026339, 855747640, 856247246, 857686222, 858648777, 858756065, 858199060, 857564092, 857507765, 857647479, 857115924, 856025815, 855606735, 856542885, 857648551, 857866645]
3718.2H57866645n14746n03540r2745J09613K31326j51158j271188j434922j073Q87036
3738.6H55125248M74751o68823j406491l49462J1325o71447J80126J173973O94513
3756.9H54563713n4479O6042L51727P630k88010k82585j550M38630J82152n21242o59824
3779.4H53802204j07467K09987J28269J05083k9564j78217k68758n42521n44846n48363
3799.8H52025807q34644j03593L67701M1783L66628L66688n85794j296938p42197k96950
3820.2H49308491R4890Q75354N20885l6120l6657j52111l79980q02398j033186k14041
3840.6H48145127O14345O73414N16116J17362p35760j697719q86023J013875J084506
3858.9H48845243J67668n00202n01096j67012m01795m65334K27094M93288K95579k99274
$$ y = [857866645, 857351899, 856848359, 856755614, 856865227, 857096553, 856945395, 855674207, 854239285, 854238212, 855125248, 855599999, 854931176, 853524685, 853175223, 853186548, 852515101, 852695227, 853869200, 854563713, 854509234, 854575276, 854927003, 854934633, 854646623, 854364038, 854362488, 854801118, 854983270, 854462028, 853802204, 853694737, 853904724, 854032993, 854138076, 854108512, 853930295, 853661537, 853119016, 852574170, 852025807, 851191163, 851087570, 851455271, 851497054, 851863682, 852230370, 851644576, 850347638, 849605441, 849308491, 849403381, 850278735, 850799620, 850763500, 850726843, 850574732, 850194752, 849392354, 848359168, 848145127, 848759472, 849432886, 849949002, 850066364, 849330604, 847632885, 846746862, 847760737, 848845243, 849012911, 848512709, 848011613, 847844601, 847442806, 846977472, 847204566, 847697854, 847993433, 847694159]
3879.3H47694159n42105j15573q0288K32041K65360l81887j0073N07295j81198r82761
3899.7H46404970r54151k81573O21677R62853N80967J67667k06351o79552n73397L6657
3920.1H46079767J63436n2035K7954J7584l50595l06606K19882L69787N1200l25441
3940.5H45894933l88205J19Q0466l22163k70307J81615K75910Q8573o2883k40445l14653
3962.9H44922960k15650j94609j62840k6226k0683n9545P868l2246j88470k11000k3783
3985.4H43795776O6281j4782m9412j24634k39193k58267
3997.6H43175769
$$ y = [847694159, 847152054, 847036481, 846956193, 847188234, 847453594, 847071707, 847061634, 847568929, 847387731, 846404970, 845450819, 845169246, 845790923, 846753776, 847334743, 847502410, 847296059, 846616507, 846043110, 846079767, 846243203, 846191168, 846219122, 846236706, 845886111, 845579505, 845799387, 846169174, 846220374, 845894933, 845506728, 845506847, 845587313, 845265150, 844994843, 845176458, 845452368, 845540941, 845478058, 845237613, 844922960, 844707310, 844512701, 844349861, 844323635, 844302952, 844243407, 844251275, 844219029, 844030559, 843819559, 843795776, 843862057, 843847275, 843797863, 843673229, 843434036, 843175769]
##END=$$ End of the data block
