##TITLE=Casca de arroz - 5 $$ Begin of the data block
##JCAMP-DX=5.00 $$ ACD/SpecManager v 10.08
##SPECTROMETER/DATA SYSTEM=Alpha
##DATE=26 May 2015 14:52:24
##DATA TYPE=INFRARED SPECTRUM
##DATA CLASS=XYDATA
##ORIGIN=
##OWNER=
##NPOINTS=1765
##FIRSTX=399.76428223
##LASTX=3997.64306641
##MAXX=3997.64306641
##MINX=399.76428223
##MAXY=0.79631019
##MINY=0.48314181
##XFACTOR=1.0000000000
##YFACTOR=1.000000000000000e-9
##FIRSTY=0.64071316
##DELTAX=2.03961372
##XUNITS=1/CM
##YUNITS=ARBITRARY UNITS
##XYDATA=(X++(Y..Y))
399.8F40713155M14729K36810j745522k194822m57466O04034r26257k480685j533509
418.1F32630467J00196q04484k507210j967132j88529m90070k374291k406061m12464
436.5F21580422J69337j528442k422631q95679M34279n73337j969277j228273K81632
454.8F13848031k05338j741887j420259L33130R11713l10898r50575N32866K168417
473.2F13165200J698792N75423J418531L397942L498017J769543J358569K929270L586829
491.5F33398116J975476O26266J471341K495289J430690l65853l57628R04441R10520
509.9F42488658p56144j701593n65529N80847k56002j460135q08895R26435J111150
528.3F39558792l90053p53104Q18908J637816J18256j385927m82619J060068M06564
$$ plain form
399.8 640713155 641127884 641364694 639619172 637424350 636966884 637570918 636644661 634163976 632630467
418.1 632630467 632730663 631926179 629418969 627451837 627263308 626773238 624398947 621992886 621580422
436.5 621580422 621749759 620221317 617798686 616903007 617337286 616763949 614794672 613566399 613848031
454.8 613848031 613642693 611900806 610480547 610813677 611725390 611414492 610463917 610996783 613165200
473.2 613165200 614863992 615439415 616857946 620255888 623753905 625523448 626882017 629811287 633398116
491.5 633398116 635373592 635999858 637471199 639966488 641397178 641031325 640673697 641578138 642488658
509.9 642488658 641732514 640030921 639465392 640046239 639790237 638330102 637521207 638447642 639558792
528.3 639558792 639168739 638415635 639234543 640872359 640990615 639604688 639122069 640182137 640588701
546.6F40588701j489401j468122M51922Q75891j002551j973092l66032J255095L28839
565F37201250j412869q08239J206517J325608l52741o14643J366675K457321J026988
583.3F41395867k92301P52210K241135J403749o05106n09441J368165J616835k26497
601.7F47144616r19760P14660J975536R29475m99308L03030K175450K179146O88315
620F54691160O21438K394974L173113J507640o0618P32243K155185J565814k11835
638.4F66569114l46422J247942J834273M05133o74486L34799J580000Q78990p53939
656.8F71075404p98703O33419J092792J69277o81162K29239J899481J561344O07550
675.1F75788641J157463K800405K942860J271724M09961J527012K372503J130998m67300
$$ plain form
546.6 640588701 639099300 637631178 638083100 638958991 637956440 635983348 635617316 636872411 637201250
565 637201250 635788381 634980142 636186659 637512267 637159526 636544883 637911558 640368879 641395867
583.3 641395867 641103566 641855776 644096911 645500660 644895554 644386113 645754278 647371113 647144616
601.7 647144616 646224856 646939516 648915052 649844527 649345219 649648249 651823699 654002845 654691160
620 654691160 655312598 657707572 660880685 662388325 662327707 663059950 665215135 666780949 666569114
638.4 666569114 666222692 667470634 669304907 669710040 669035554 669370353 670950353 671829343 671075404
656.8 671075404 670276701 670910120 672002912 672172189 671491027 671720266 673619747 675181091 675788641
675.1 675788641 676946104 679746509 682689369 683961093 684371054 685898066 688270569 689401567 688934267
693.5F88934267j3531J459360J262308m41075q60333Q47697K005458Q24451m54604
711.8F93563998N74529K374828K009094R8109o497J926422K606988Q86559m03046P84278
732.2G04415262K283633J374363o64055n52893J389504J670301l99172j548827j02818
750.6G07865298J253128J5199j755476r28163J308858J472831m05848q83043R58741
768.9G08901525J954972K51353j509428o38723J166343Q71361q41260r31859P83503
787.3G10007787J450956k6107j172960n2035J531363J035332o14226n96761J034796
805.6G12598145J479745l7789r54152K35141J494705Q02160n49794k48312J165926
824G15985775J142740n98609j566887o72877J59264p12335j895309j338065R2864R9421
$$ plain form
693.5 688934267 688920736 690380096 691642404 691201329 690340996 691188693 693194151 694018602 693563998
711.8 693563998 694138527 696513355 698522449 698620558 698614061 700540483 703147471 704034030 703630984 704415262
732.2 704415262 706698895 708073258 707409203 706856310 708245814 709916115 709516943 707968116 707865298
750.6 707865298 709118426 709133625 707378149 706449986 707758844 709231675 708825827 707942784 708901525
768.9 708901525 710856497 711107850 709598422 708959699 710126042 710997403 710156143 709224284 710007787
787.3 710007787 711458743 711432636 710259676 710207641 711739004 712774336 712160110 711563349 712598145
805.6 712598145 714077890 714040101 713085949 713321090 714815795 715617955 715068161 714819849 715985775
824 715985775 717128515 716529906 714963019 714290142 714449406 713737071 711841762 710503697 710596561 710695982
844.4G10695982j212299j603305l71158N73992j92761j307786p84993P54953J179576
862.8G07732201M23669M19200J760244K590359J510620j5915r1970M49836m16159k413809
883.2G11948276l324748k621650k199233l064394l721297k709865j106024r19104j815319
901.5F90466642j792729o54697k90692j465857k476156j915514r12666j215399k244055
919.9F77498877k006829m71055M04179j82569o75321J67966J074135M34161r65834
938.2F75277710j272321n69403o56247j993179k941609k548754k081692k806485l857076
956.6F56550944l735066k810716k671421l470242l758609l001988k451181l101886
972.9F31549835m127145m208028l667295l805160m574180m639685l541470k396881
$$ plain form
844.4 710695982 709483683 707880378 707509220 708083212 707890451 706582665 705797672 706552625 707732201
862.8 707732201 708155870 708575070 710335314 712925673 714436293 714420378 714328408 714778244 714362085 711948276
883.2 711948276 708623528 706001878 703802645 700738251 697016954 694307089 693201065 692281961 690466642
901.5 690466642 688673913 688019216 687728524 686262667 683786511 681870997 680958331 679742932 677498877
919.9 677498877 675492048 675020993 675425172 675242603 674567282 674735248 675809383 676243544 675277710
938.2 675277710 674005389 673435986 672779739 670786560 667844951 665296197 663214505 660408020 656550944
956.6 656550944 652815878 650005162 647333741 643863499 640104890 637102902 634651721 631549835
972.9 631549835 627422690 623214662 619547367 615742207 611168027 606528342 602986872 600589991
989.2F00589991k127707k104760j361787k85983j12116r60708j624405j601935j783013
1007.6E88627577k763272l792166l884852l291845l021420l230869l084660k246380
1023.9E63312113j555204j704037k080858j726866q69155m94182o99997o45757j1861
1042.2E53524196N08368L51250P3970M93288J329064J618207J256406J180589J821101
1060.6E62156439K377987K025604J156569O85274N29647n8413r30011j069724k17021
1079E66656351O09458N88059K65181M64559R25541Q38458J73569k27213O258J54496
1099.4E70454717l15547p52330l70920M77791R07242R35674J356721K296567K898991
1117.7E77888906K681673K303361K501250L035486L144860K794921K680302K961814
$$ plain form
989.2 600589991 598462284 596357524 594995737 594709754 594597638 593636930 592012525 590410590 588627577
1007.6 588627577 585864305 582072139 578187287 574895442 571874022 568643153 565558493 563312113
1023.9 563312113 561756909 560052872 557972014 556245148 555375993 554881811 554181814 553536057 553524196
1042.2 553524196 554032564 554383814 554457784 554951072 556280136 557898343 559154749 560335338 562156439
1060.6 562156439 564534426 566560030 567716599 568401873 568931520 568873107 567943096 566873372 566656351
1079 566656351 567265809 567853868 568119049 568583608 569509149 570347607 570521176 570293963 570300221 570454717
1099.4 570454717 570139170 569386840 569015920 569493711 570400953 571336627 572693348 574989915 577888906
1117.7 577888906 580570579 582873940 585375190 588410676 591555536 594350457 597030759 599992573
1134E99992573K931357K096831J022101N42879N08368J10745o88314j056075o81818
1152.4F04778647k75731l69429m50611J51217J164972J706601J652956J869440K675354
1170.7F12903416L249347K988339K478480K502561K804816K589225J828015J348376
1187.1F32692575J526237J600921Q95381J6391q5175L31641K68757k68281k74896M63068
1207.5F37166619R14097M75168p4327J33574O41525M27187l29912n25951L2901L39270
1227.9F39200151j44362n49555n7996O92308O62268J14023J47581Q75831J211286O92308
1248.2F42843843K86281P13586J223147Q74102J43230J77205R01282J155197O18637
1266.6F48936510L27468R49621J669049J561046J084805J247108J916051K037107J426876
$$ plain form
1134 599992573 602923930 605020761 606042862 606585741 607094109 607204854 606516540 605460465 604778647
1152.4 604778647 604502916 604133487 603682876 603834093 604999065 606705666 608358622 610228062 612903416
1170.7 612903416 616152763 619141102 621619582 624122143 626926959 629516184 631344199 632692575
1187.1 632692575 634218812 635819733 636715114 636731505 636646330 636977971 637246728 636978447 636703551 637166619
1207.5 637166619 638080716 638555884 638481557 638615131 639256656 639683843 639353931 638827980 638860881 639200151
1227.9 639200151 639055789 638506234 638448238 639140546 639802814 639916837 640064418 640940249 642151535 642843843
1248.2 642843843 643130124 643843710 645066857 645940959 646084189 646261394 647162676 648317873 648936510
1266.6 648936510 649263978 650213599 651882648 653443694 654528499 655775607 657691658 659728765 661155641
1285F61155641J045644J398981J735032J255691M78625L95477Q05199O72102r5606
1303.3F68846786m95553j45674J13726l85642j012027q26180j41502P7486k60472l68416
1323.7F65402532J23441M82559R6560l61920n8293N91636O62982K96831L89516R11594
1344.1F68537438J020789L86238l11255k94507P1466q6188p71761j236498r92179n20826
1364.5F65802717p27176j184226q55863k21073j21713k66373r5368L93093P95066R60350
1384.9F64479434J147688J611948J830518J093924K4796j38283L27229N00858k5391
1403.3F70852721o02901l09170J02342k46406q87394j075923j016498r26733n58972
1421.6F65331066l11077J05560O67691O74665N90682Q04007R77576J227677J173377
$$ plain form
1285 661155641 662201285 663600266 665335298 666590989 667069614 667465091 668270290 668942392 668846786
1303.3 668846786 668351233 668205559 668319285 667933643 666921616 666095436 665953934 666031420 665770948 665402532
1323.7 665402532 665525973 666008532 666105092 665743172 665684879 666276515 666939497 667236328 667625844 668537438
1344.1 668537438 669558227 669944465 669633210 669338703 669410169 669323981 668552220 667315722 666323543 665802717
1364.5 665802717 665075541 663891315 663035452 662814379 662692666 662426293 662330925 662724018 663519084 664479434
1384.9 664479434 665627122 667239070 669069588 670163512 670188308 670050025 670377254 670878112 670852721
1403.3 670852721 670249820 669940650 670042992 669796586 668909192 667833269 666816771 665890038 665331066
1421.6 665331066 665019989 665125549 665793240 666467905 667058587 667862594 668840170 670067847 671241224
1440F71241224N80013J60694j02222p08163j108944q62003n38111r80258j087546J50085
1460.4F66744769P56085Q02457J228154J809239K156436K830327L657639L687978L334939
1478.7F87008023L259063L282964K668500J517832P60139R74595J069069j17958j568079
1497.1F98854148j405358n84543p80284k538145l766358j230955M23372K10345M32908
1515.4F89615130J891911L573418M434049M372835M007161L868163L422796K327860
1531.8G17513323J518488J755595J596808M51744K20537J179099J699806J445412P35164
1550.1G28115976L95179N63919N42462m82738o24895Q74937J000165K36094q77022
1568.5G29744077j567364j015842j308799k811849k823651k302527k559483k886951
$$ plain form
1440 671241224 671821237 671981931 671879709 671171546 670062602 669200599 668662488 667682230 666594684 666744769
1460.4 666744769 667500854 668303311 669531465 671340704 673497140 676327467 679985106 683673084 687008023
1478.7 687008023 690267086 693550050 696218550 697736382 698496521 699471116 700540185 700422227 698854148
1497.1 698854148 697448790 696864247 696083963 693545818 689779460 688548505 688971877 689182222 689615130
1515.4 689615130 691507041 695080459 699514508 703887343 707894504 711762667 715185463 717513323
1531.8 717513323 719031811 720787406 722384214 722835958 723056495 724235594 725935400 727380812 728115976
1550.1 728115976 728511155 729075074 729617536 729134798 728509903 729384840 730385005 730621099 729744077
1568.5 729744077 728176713 727160871 725852072 723040223 720216572 717914045 715354562 712467611
1584.8G12467611l245711l335655k886057k391100k426207k735555k821148k680480
1601.1F89945698k508462k247452j653552p59066j13189l57270j565278k219498r75728
1619.5F77546203o27518j608252j752079j174092o27041j84536m00901n37991Q96096
1637.8F71529889J942396J708567J211524J014948J653433K014935Q18908M86851K554894
1656.2F84936345L120422K442718K052843K601266K998769K421081J860381K100765
1672.5G04534590K336264K262831J922607J410723R41813R88185J538694J433730J200378
1690.9G18569815J274407P58648J10209l0994K77042J087666O94036k31326j67191
1709.2G22342312J38641j22965j010298j693130o32405N48184J85013m63486l66807
$$ plain form
1584.8 712467611 709221900 705886245 703000188 700609088 698182881 695447326 692626178 689945698
1601.1 689945698 687437236 685189784 683536232 682777166 682663977 682306707 680741429 678521931 677546203
1619.5 677546203 676918685 675310433 673558354 672384262 671757221 671572685 671171784 670633793 671529889
1637.8 671529889 673472285 675180852 676392376 677407324 679060757 681075692 681894600 682381451 684936345
1656.2 684936345 688056767 690499485 692552328 695153594 698152363 700573444 702433825 704534590
1672.5 704534590 706870854 709133685 711056292 712467015 713408828 714397013 715935707 717369437 718569815
1690.9 718569815 719844222 720602870 720713079 720682085 720959127 722046793 722740829 722509503 722342312
1709.2 722342312 722480953 722357988 721347690 719654560 719022155 719570339 719755352 719291866 718925059
1727.6G18925059J28150J93357n68211o3777J419544J786709J661480J709699K051175
1745.9G27243185K612889K981365L144204L305614L588259L828645L480971L036320
1762.2G53221452L162742L325820K948820K163947J758516K233386K485275J829624
1778.6G73129582J101852J121938J486003J446605R07421L87133O88493J376331J171589
1796.9G82816947M67181M44889J042783J103222N19574J74105N19097R01938O15894
1815.3G88605630J25587K41518O37770M81129o616p1645K66611O44684N21720J8418
1835.7G91464806M8220M85778L07798m26292l51906M57406O64830J96576k35617p4923
1856.1G92536676L24607K90155j14083k52187j7882J07587M6551M4644J84655L72887
$$ plain form
1727.6 718925059 719053209 719246566 718678355 718614578 720034122 721820831 723482311 725192010 727243185
1745.9 727243185 729856074 732837439 735981643 739287257 742875516 746704161 750185132 753221452
1762.2 753221452 756384194 759710014 762658834 764822781 766581297 768814683 771299958 773129582
1778.6 773129582 774231434 775353372 776839375 778285980 779193401 779580534 780269027 781645358 782816947
1796.9 782816947 783284128 783729017 784771800 785875022 786394596 786568701 787087798 787989736 788605630
1815.3 788605630 788731217 788972735 789610505 790091634 790085018 790013373 790279984 790924668 791446388 791464806
1835.7 791464806 791513026 791998804 792306602 791880310 791528404 791985810 792650640 792847216 792611599 792536676
1856.1 792536676 792861283 793151438 793037355 792785168 792767286 792874873 792921424 792966068 793150723 793523610
1876.5G93523610K79545q9407j71959J63317L30567j1504k35259Q3089L87311L15070
1896.9G94574380K1636n5372K31564L92794Q7560k24173k1697L58284K61605j99199
1917.3G95427382k44796J44660L13461J18077j62482j50025J13427J25170j91331l33488
1937.7G95160055j25944R715j25706k73347j79708R3639J30176j80482l36528p1645
1958.1G94100225J79112J5736k99454k61486J24991K49148r1434k72512L4332K98440
1978.5G94077098O1214k91884k01583J36853J33335k41398l47198N8592K98023j3649
1998.8G93669403l84450k83957Q0526Q5652k91765m23550j21594L0935l01898o64889
2019.2G91394413n89252m10318m17233j98066J67906L14891K25366j14918l62754j71363
$$ plain form
1876.5 793523610 793803155 793713748 793541789 793705106 794035673 794024169 793788910 793871999 794259310 794574380
1896.9 794574380 794596016 794540644 794772208 795165002 795252562 795028389 795006692 795364976 795626581 795427382
1917.3 795427382 795182586 795327246 795640707 795758784 795596302 795446277 795559704 795684874 795493543 795160055
1937.7 795160055 795034111 795043826 794918120 794644773 794465065 794558704 794688880 794508398 794171870 794100225
1958.1 794100225 794279337 794295073 793995619 793734133 793859124 794108272 794016838 793744326 793778658 794077098
1978.5 794077098 794138312 793846428 793644845 793781698 793915033 793673635 793326437 793385029 793683052 793669403
1998.8 793669403 793284953 793000996 793081522 793167174 792875409 792451859 792330265 792361200 792059302 791394413
2019.2 791394413 790805161 790394843 789977610 789779544 789947450 790262341 790487707 790372789 790010035 789838672
2039.6G89838672J41322R0063k03908k35557N3584K10107k39j98721l3677K18630J53243
2062.1G90033519j03652j05322J90795L12686P1943j37270L398K61664K34485j7226
2082.5G90745020q4281J18792K11477J5319j62721n5015J60396J32859j18912j99913
2102.9G90763021K7835J61350l8922k35021j10448J29938J05024j42098k02000L6836
2123.3G90495515J94251J9908j90913p8500J69695J54376n4598o5565J55449K39014
2143.7G91038632M9949q2493Q1718K89977K20656M471K3603K74479L69311J78158k98
2166.1G92448163R3639L37243L79980K00390J63258L05473L30568J76072P1764J63555
2186.5G94670105K82288K26795P0334M9412J82986K30789J04905j1385L1233J34885
$$ plain form
2039.6 789838672 789979994 790070057 789866149 789630592 789684176 789894283 789894044 789695323 789661646 789880276 790033519
2062.1 790033519 789929867 789824545 790015340 790328026 790399969 790262699 790266097 790527761 790762246 790745020
2082.5 790745020 790660739 790779531 790991008 791006327 790843606 790788591 790948987 791081846 790962934 790763021
2102.9 790763021 790790856 790952206 790913284 790678263 790567815 790697753 790802777 790660679 790458679 790495515
2123.3 790495515 790689766 790709674 790518761 790440261 790609956 790764332 790709734 790644169 790799618 791038632
2143.7 791038632 791088581 791006088 791087806 791377783 791598439 791602910 791626513 791900992 792270303 792448461 792448163
2166.1 792448163 792541802 792879045 793259025 793459415 793622673 793928146 794258714 794434786 794506550 794670105
2186.5 794670105 794952393 795179188 795249522 795298934 795481920 795712709 795817614 795806229 795837462 795972347
2206.9G95972347J19090J7763O55P8499J04905l815j18673o5029R3759J10685m3511
2229.3G96266675j05739N067R7453L3915r7096q7380N8472J02997j1683j05559n5492
2251.8G96101630O7889O3241p0512q4877O7591J43290J3411j32740q4042P9274Q3625
2274.2G96247780q8811j35183K2531J06215j4543j23203l8088P1347j4901j83403j71066
2296.6G95678675J3471Q2373m9114j48535o4075Q0049K7299j85728k03371K2650J18375
2319.1G95372069j01328l08335j50561J02401j610l17216l52859j22130m0531k38896
2339.5G93841004m50849m48525k10703L03388O37412L69847j51455l16322l38257m64558
2359.9G92770982m28796k64347k60353l87549l68893j94431j06096j49190j16587O4731
$$ plain form
2206.9 795972347 796091437 796109200 796109855 796188354 796293259 796289444 796170771 796105742 796199501 796310186 796266675
2229.3 796266675 796160936 796166003 796263456 796297371 796200275 796112895 796171367 796274364 796262681 796157122 796101630
2251.8 796101630 796169519 796232760 796162248 796077371 796144962 796288252 796301663 796168923 796084881 796164155 796247780
2274.2 796247780 796158969 796023786 796046317 796152532 796137989 796014786 795976698 796048045 796033144 795849741 795678675
2296.6 795678675 795692146 795774519 795725405 795576870 795512795 795592844 795620143 795434415 795231044 795253694 795372069
2319.1 795372069 795270741 794962406 794811845 794914246 794912636 794595420 794242561 794120431 794079900 793841004
2339.5 793841004 793390155 792941630 792730927 793034315 793671727 794041574 793890119 793573797 793235540 792770982
2359.9 792770982 792342186 792077839 791817486 791429937 791061044 790866613 790760517 790611327 790494740 790559471
2380.2G90559471J62840J7523j73807j69039n5730q5235k46882l05891k01523j38522
2400.6G89363205k52842l90530l44694j96814j83165l30568m13298l10123k12848k85030
2421G86443293m09186l94583k68220k13862l00527m01139l59535k56896k79188l85165
2441.4G83174992l88682k71619k28464l34203m09186l30031k05994k12550l39866l86357
2461.8G80068040k72930j89781k68757l32773k38240j40369k22385l67760l47138j89900
2482.2G77498007j29998k55167l34084k25842j46211k46763l68476l24130j71125j53184
2502.6G75143027l13520l58820j74165n6088j91867l42846k60294o8366o4194k54095
2523G73058772l16024j39296l9339k17676l81172k62618n6684p2300k66969l04282
$$ plain form
2380.2 790559471 790722311 790739834 790566027 790396988 790341258 790256023 790009141 789703250 789501727 789363205
2400.6 789363205 789110363 788719833 788375139 788178325 787995160 787664592 787251294 786941171 786728323 786443293
2421 786443293 786034107 785639524 785371304 785157442 784856915 784455776 784096241 783839345 783560157 783174992
2441.4 783174992 782786310 782514691 782286227 781952024 781542838 781212807 781006813 780794263 780454397 780068040
2461.8 780068040 779795110 779605329 779336572 779003799 778765559 778625190 778402805 778035045 777687907 777498007
2482.2 777498007 777368009 777112842 776778758 776552916 776406705 776159942 775791466 775467336 775296211 775143027
2502.6 775143027 774829507 774470687 774296522 774240434 774048567 773705721 773445427 773377061 773312867 773058772
2523 773058772 772742748 772603452 772564113 772346437 771965265 771702647 771645963 771573663 771306694 771002412
2543.4G71002412j23143m9055k24829l60250k35617n5731r3519k76924l06785j53243
2563.8G69123316q5175k30134l74973k87711j10746j42634l28958l58104k07246j42753
2584.2G66854882k71022l91543l24428k12789k68697l99530l78073k52127k52009l96967
2604.6G63707697m71949l77298k69055l12865m36008m11808k65002k60711m24385n07415
2625G59971201m00126k82883l36528m63545m41671k93553k52902l75390m57525l59774
2645.4G56307304k27392k79069m12345l72052k32458k27809l67939m35412k97249j68383
2665.8G53287196k64466m11927l61145k26498k67386m27783m52637l10779k22683l13163
2686.2G50028729m10735l44932k33531k70844m11093m45962l47972k99811l71099m35412
$$ plain form
2543.4 771002412 770879269 770830214 770605385 770245135 770009518 769953787 769860268 769583344 769276559 769123316
2563.8 769123316 769038141 768808007 768433034 768145323 768034577 767891943 767562985 767204881 766997635 766854882
2584.2 766854882 766583860 766192317 765867889 765655100 765386403 764986873 764608800 764356673 764104664 763707697
2604.6 763707697 763235748 762858450 762589395 762276530 761840522 761428714 761163712 760903001 760478616 759971201
2625 759971201 759571075 759288192 758951664 758488119 758046448 757752895 757499993 757124603 756667078 756307304
2645.4 756307304 756079912 755800843 755388498 755016446 754783988 754556179 754188240 753752828 753455579 753287196
2665.8 753287196 753022730 752610803 752249658 752023160 751755774 751327991 750875354 750564575 750341892 750028729
2686.2 750028729 749617994 749273062 749039531 748768687 748357594 747911632 747563660 747263849 746892750 746457338
2706.6G46457338l89337l26395l84987m84347m54783l28780k95043l82125m07338l25859
2727G42678344k94745l64184m18782l71039k60830k30551l18050l60728k64704j95980
2747.4G39598751l02195m07279l43978k66552l10660l83973l65257l03686l22103l99530
2767.8G36193538m59016m50074l82960l88086m70757m94838m72725m73797m87566n27263
2788.2G31586456o13630o74426o56068o20544o42658p13229p56919p87676q42750q72731
2808.6G24405825q85010r10401r39012r72032r76265r72390j040756j158119j226782
2826.9G15325058j223505j227379j274228j294672j296282j371265j514196j658440
2843.2G04465091j781344j837731j731217j477897j252710j132787j064300j086355
$$ plain form
2706.6 746457338 746068001 745741606 745356619 744872272 744417489 744088709 743793666 743411541 743004203 742678344
2727 742678344 742383599 742019415 741600633 741229594 740968764 740738213 740420163 740059435 739794731 739598751
2747.4 739598751 739296556 738889277 738545299 738278747 737968087 737584114 737218857 736915171 736593068 736193538
2767.8 736193538 735734522 735284448 734901488 734513402 734042645 733547807 733075082 732601285 732113719 731586456
2788.2 731586456 730972826 730298400 729642332 729021788 728379130 727665901 726908982 726121306 725278556 724405825
2808.6 724405825 723520815 722610414 721671402 720699370 719723105 718750715 717709959 716551840 715325058
2826.9 715325058 714101553 712874174 711599946 710305274 709008992 707637727 706123531 704465091
2843.2 704465091 702683747 700846016 699114799 697636902 696384192 695251405 694187105 693100750
2859.5F93100750j227438j369059j431882j434744j395702j333535j283109j213730
2875.9F82411551j068115r12249p68244n51343l12030j75655j18077l8207L4571J6391
2896.3F78518593n8472j07586j22845j61350k77758m64320o46591q35300j062393j212299
2916.6F73569679j190960j020193p63476n21183l33786j82033j3649K00331L97861
2935F70142591N86927Q39114J125038J311421J332760J305997J399339J550018J520455
2953.4F81113660J396478J473248J713812J853228J796722J736283J858950K016842
2969.7F94959223K017379J943231J935720J987219J925528J650751J385212J332104
2986G09136367J322329J147628Q61764O38127N53310M52757K56955J35482J20818Q9467
$$ plain form
2859.5 693100750 691873312 690504253 689072371 687637627 686241925 684908390 683625281 682411551
2875.9 682411551 681343436 680431187 679662943 679111600 678799570 678623915 678505838 678467631 678502202 678518593
2896.3 678518593 678460121 678352535 678229690 678068340 677790582 677326262 676679671 675844371 674781978 673569679
2916.6 673569679 672378719 671358526 670595050 670073867 669740081 669558048 669544399 669744730 670142591
2935 670142591 670729518 671568632 672693670 674005091 675337851 676643848 678043187 679593205 681113660
2953.4 681113660 682510138 683983386 685697198 687550426 689347148 691083431 692942381 694959223
2969.7 694959223 696976602 698919833 700855553 702842772 704768300 706419051 707804263 709136367
2986 709136367 710458696 711606324 712468088 713106215 713659525 714112282 714369237 714504719 714625537 714715004
3006.4G14715004L7551K5749J550r4652k33055l64601m02093l13044k94864m76420
3026.8G12601125n82337m57823l60310m84944o57141o19710n01513n64337p75397q90553
3047.2G06707060p88569o82235p44879q47936q62360q13663p75933p74622p78794p89941
3067.6F98848128q13663q30710q11755p07507o26326p29561q80182r24647r25600q73447
3088F90724730q23736r02474r77277q96275p92623q84116j050710r96113p96795p87258
3108.4F81817353r52721r21428p28428p54595r64403j167715j269698j163125j008392
3126.7F72886848r77575j001180j008987r89437r61244j010716j128853j148760j090050
3145.1F63570046j062274r74953q99017j060485j302839j318693j177430j079559j064599
$$ plain form
3006.4 714715004 714752555 714778304 714779854 714685202 714452147 714087546 713685453 713372409 713077545 712601125
3026.8 712601125 712018788 711560965 711200655 710715711 710058570 709438860 708937347 708373010 707597613 706707060
3047.2 706707060 705918491 705236256 704491377 703643441 702781081 701967418 701191485 700416863 699638069 698848128
3067.6 698848128 698034465 697203755 696392000 695684493 695058167 694328606 693448424 692523777 691598177 690724730
3088 690724730 689900994 688998520 688021243 687124968 686332345 685448229 684397519 683401406 682604611 681817353
3108.4 681817353 680864632 679943204 679214776 678460181 677495778 676328063 675058365 673895240 672886848
3126.7 672886848 671909273 670908093 669899106 668909669 667948425 666937709 665808856 664660096 663570046
3145.1 663570046 662507772 661532819 660633802 659573317 658270478 656951785 655774355 654694796 653630197
3163.4F53630197j103222j147151j147092j158595j221478j248777j211762j175165
3179.8F44216955j203418j264036j262963j189351j158058j248837j353562j355111
3196.1F34181619j284242j221538j230776j277685j261115j256108j323224j343905
3212.4F23983026j293302j242220j255215j318276j328528j278162j263856j312197
3228.7F13691270j305937j239479j287878j392960j401842j338482j246392j178086
3245F03300214j198054j295447j310289j188993j111329j145959j175940j140237j100719
3263.4E92633247j085877j019418r29475j000881j178027j243174j187265j091957
3279.7E83897173j052498j096309j149177j125038r94563r50932j128853j322806j368403
$$ plain form
3163.4 653630197 652526975 651379824 650232732 649074137 647852659 646603882 645392120 644216955
3179.8 644216955 643013537 641749501 640486538 639297187 638139129 636890292 635536730 634181619
3196.1 634181619 632897377 631675839 630445063 629167378 627906263 626650155 625326931 623983026
3212.4 623983026 622689724 621447504 620192289 618874013 617545485 616267323 615003467 613691270
3228.7 613691270 612385333 611145854 609857976 608465016 607063174 605724692 604478300 603300214
3245 603300214 602102160 600806713 599496424 598307431 597196102 596050143 594874203 593733966 592633247
3263.4 592633247 591547370 590527952 589598477 588597596 587419569 586176395 584989130 583897173
3279.7 583897173 582844675 581748366 580599189 579474151 578479588 577528656 576399803 575076997 573708594
3298E73708594j287878j165330j123965j249730j483977j647711j693010j682163j633167
3316.4E60741663j592934j607001j640439j694739j800775j872659j873791j857698
3332.7E46801627j775563j688957j811028k029180k053321j938045j835108j802086
3349E31868339j954258k162933k178073k065718j987040j967431j910686j791239j809597
3367.4E14041364k011239k152503k089441j921832j776159j654089j574277j512200
3383.7D99349624j403898j195014r58025j026332j301200j249373q42660o21796r02235
3402.1D89849091j197309j034319p38710o45757o68198o77377n79208m01765l18617
3420.4D83587831k91258j54763M8786J85371J75327J97172L59356L90202K55793K61933
$$ plain form
3298 573708594 572420716 571255386 570131421 568881691 567397714 565750003 564056993 562374830 560741663
3316.4 560741663 559148729 557541728 555901289 554206550 552405775 550533116 548659325 546801627
3332.7 546801627 545026064 543337107 541526079 539496899 537443578 535505533 533670425 531868339
3349 531868339 529914081 527751148 525573075 523507357 521520317 519552886 517642200 515850961 514041364
3367.4 514041364 512030125 509877622 507788181 505866349 504090190 502436101 500861824 499349624
3383.7 499349624 497945726 496750712 495792687 494766355 493465155 492215782 491373122 490751326 489849091
3402.1 489849091 488651782 487617463 486878753 486232996 485564798 484887421 484308213 483906448 483587831
3420.4 483587831 483296573 483141810 483190596 483375967 483551294 483748466 484107822 484498024 484753817 485015750
3440.8D85015750M88222P08550P61866P83474R14633J057207J136750J181335J209020
3459.2D93256807J194865J269162J504063J594246J369685J140892J211584J423299
3475.5E03964603J566470J536131J371026J389265J563966J586437J558960J642644
3491.8E16179502J714647J717090J698435J729071J705348J562596J548111J717925
3508.1E29572725J890660J979470J926184J818120J848161J974225K021253J923860
3524.4E44954658J865506J947939K092302K225280K265274K213002K195119K286554
3540.8E62045634K322793K208769K129972K288520K390147K306044K388119K549410
3557.1E80629408K561629K496422K435266K378762K489031K869248L126919L095091
$$ plain form
3440.8 485015750 485503972 486212522 486974388 487757862 488672495 489729702 490866452 492047787 493256807
3459.2 493256807 494451672 495720834 497224897 498819143 500188828 501329720 502541304 503964603
3475.5 503964603 505531073 507067204 508438230 509827495 511391461 512977898 514536858 516179502
3491.8 516179502 517894149 519611239 521309674 523038745 524744093 526306689 527854800 529572725
3508.1 529572725 531463385 533442855 535369039 537187159 539035320 541009545 543030798 544954658
3524.4 544954658 546820164 548768103 550860405 553085685 555350959 557563961 559759080 562045634
3540.8 562045634 564368427 566577196 568707168 570995688 573385835 575691879 578079998 580629408
3557.1 580629408 583191037 585687459 588122725 590501487 592990518 595859766 598986685 602081776
3573.4F02081776L059983L077388L083944L183901L265262L052652K793968L140688
3589.7F26739562L586590L490329L316283L407478L449321L387034L332078L113270
3606F53821945K856434K935171L176450L191352L071249K894401K870381L094912L030479
3624.4F80942774K522886J822292J989723K794325K764106K395272K273679K140760
3640.7F99645817J986862J810789J411140R78171J292348K060831K091885J627862
3657G12905705J660883J667321J371145J317203J202167O54220M93705R30250O21676
3675.4G22824275P30992J706004J856863J570285J339316P43449J35243O74724J455307
3693.7G33036458J422406J046240P40528N40674O84202R06646N93603M7326q8156N59330
$$ plain form
3573.4 602081776 605141759 608219147 611303091 614486992 617752254 620804906 623598874 626739562
3589.7 626739562 630326152 633816481 637132764 640540242 643989563 647376597 650708675 653821945
3606 653821945 656678379 659613550 662790000 665981352 669052601 671947002 674817383 677912295 680942774
3624.4 680942774 683465660 685287952 687277675 690072000 692836106 695231378 697505057 699645817
3640.7 699645817 701632679 703443468 704854608 705832779 707125127 709185958 711277843 712905705
3657 712905705 714566588 716233909 717605054 718922257 720124424 720778644 721272349 722202599 722824275
3675.4 722824275 723555267 725261271 727118134 728688419 730027735 730771184 730906427 731581151 733036458
3693.7 733036458 734458864 735505104 736245632 736786306 737470508 738377154 738970757 739018083 738929927 739489257
3714.1G39489257J082659Q27372L84331J56999J12354J43349M02213M79042k0563m23789
3734.5G42633224j27852O16312J061141M11093p50363r4711O46293j43707O378R55105
3754.9G45212913Q89658L14832K57790N09203K69592J3768J4663P3612L70621M90368
3775.3G48417020K45213j18792j26600J27733J64449J99497K13623J42097J31727m232
3795.7G49391735p1884j84059n52594N245M15802l1352K93791P13408K28763n97000
3816.1G49611855m32730j47045l04460L84986N82576K03371J50859N1916R835l30627
3836.5G49780536q23856k67029M55797M66168L93987M15861K9207j348794j540482
3854.8G47561395N81145J305700N07235k61247l80337m4406k22027m51982J32501M40777
$$ plain form
3714.1 739489257 740571916 741399288 741783619 741940618 742052972 742196321 742598534 743077576 743057013 742633224
3734.5 742633224 742505372 743121684 744182825 744593918 743843555 743748844 744395137 744251430 744257808 745212913
3754.9 745212913 746102571 746417403 746675193 747184396 747453988 747467756 747482419 747556031 747926652 748417020
3775.3 748417020 748662233 748543441 748416841 748544574 748709023 748908520 749122143 749264240 749395967 749391735
3795.7 749391735 749319851 749135792 748583198 748588443 749004245 748972893 749266684 749980092 750208855 749611855
3816.1 749611855 749179125 749032080 748727620 749112606 749695182 749898553 750049412 750101328 750111163 749780536
3836.5 749780536 748956680 748689651 749145448 749611616 750005603 750421464 750450671 749101877 747561395
3854.8 747561395 748142540 749448240 749955475 749694228 749313891 749269485 749047458 748595476 748727977 749168754
3875.2G49168754M05252P8678k65658n603j15693j17719J66953j99795j10447M46558
3895.6G49451280J85072m72009o47664m53174l636M81665M21584J04546j0490j88649
3916G48868525l30210j35600M8458m5478j01626p927q7500j54436P3314J96219M5716
3938.5G48369455r9182j92642j54078p8559j41323p9512O5029O7591P75k2352j3292
3960.9G47721910m5299q1182q1122o3240q8453j82569j99199p2837L4988J7047p5877
3983.3G46884167j24275p3672k9027o5089o6816Q404K5988
3997.6G46559680
$$ plain form
3875.2 749168754 749574006 749652684 749387026 749381423 749265730 749148011 749314964 749115169 749004722 749451280
3895.6 749451280 749636352 749164343 748516679 748063505 748059869 748541534 748963118 749067664 749057174 748868525
3916 748868525 748538315 748402715 748451173 748405695 748304069 748296142 748208642 748054206 748127520 748323739 748369455
3938.5 748369455 748270273 748077631 747923553 747844994 747703671 747624159 747689188 747756779 747757554 747735202 747721910
3960.9 747721910 747676611 747595429 747514307 747451067 747362614 747180045 746980846 746908009 746942997 746960044 746884167
3983.3 746884167 746759892 746686220 746657193 746592104 746525288 746533692 746559680
3997.6 746559680
##END=$$ End of the data block
