##TITLE=Casca de arroz - 4 $$ Begin of the data block
##JCAMP-DX=5.00 $$ ACD/SpecManager v 10.08
##SPECTROMETER/DATA SYSTEM=Alpha
##DATE=26 May 2015 14:52:24
##DATA TYPE=INFRARED SPECTRUM
##DATA CLASS=XYDATA
##ORIGIN=
##OWNER=
##NPOINTS=1765
##FIRSTX=399.76428223
##LASTX=3997.64306641
##MAXX=3997.64306641
##MINX=399.76428223
##MAXY=0.83268243
##MINY=0.54793489
##XFACTOR=1.0000000000
##YFACTOR=1.000000000000000e-9
##FIRSTY=0.73114079
##DELTAX=2.03961372
##XUNITS=1/CM
##YUNITS=ARBITRARY UNITS
##XYDATA=(X++(Y..Y))
$$ plain form
399.8 731140792 730636716 730296314 729981840 729344964 728334308 727535725 727094710 726406455 725111306
418.1 725111306 723967373 723495424 723010778 722096086 721068978 720469952 720064402 719195247 718090415
436.5 718090415 717631280 717683136 717248082 716375768 715978682 716101229 715795815 714833200 714215100 714303374
456.9 714303374 714211464 713572085 713315904 713840544 714178503 713885009 713858247 714684308 715531766 715698063
477.3 715698063 716239393 718095183 720033169 720725715 721119046 722685695 724777102 725717962 725826859
495.6 725826859 726699650 728097796 728439629 727876842 728143752 729120612 728854239 727434933 727045655
514 727045655 727880359 727786481 726360321 725734949 726492405 726668596 725547850 725053310 726147890 727005839
534.4 727005839 726190031 725279868 725872278 726554275 725568771 724133313 724197149 724825323 724128425 722848296
$$ packed form
399.8G31140792n04076l40402l14474o36876j010656p98583m41015o88255j295149
418.1G25111306j143933m71949m84646r14692j027108n99026m05550q69155j104832
436.5G18090415m59135N1856m35054q72314l97086J22547l05414r62615o18100Q8274
456.9G14303374r1910o39379k56181N24640L37959k93494k6762Q26061Q47458J66297
477.3G15698063N41330J855790J937986O92546L93331J566649K091407R40860J08897
495.6G25826859Q72791J398146L41833n62787K66910R76860k66373j419306l89278
514G27045655Q34704r3878j426160o25372P57456J76191j120746m94540J094580Q57949
534.4G27005839q15808r10163N92410O81997r85504j435458O3836O28174o96898j280129
$$ plain form
554.8 722848296 722786844 723360419 722828627 721699238 721841574 722860098 722754002 721786320 721976638 723300159
575.2 723300159 723905206 723622501 724180698 725841641 726762593 726418018 726543128 727933109 729018390
593.5 729018390 728781521 728679419 729915500 731177092 731101155 730845392 731930792 733432591 733814299
611.9 733814299 733852983 734968722 736587286 737416744 737973154 739647508 741921723 743082345 743305862
630.2 743305862 744286895 746073723 747016966 746907890 747446239 749094367 750133157 749809086 749758184
648.6 749758184 751005590 752027571 751727045 751434982 752327740 753291130 753120542 752645731 752914250
667 752914250 753927886 754607320 755107343 756603241 758839309 760170281 760715485 762121022 764304399
685.3 764304399 765481889 765460432 765996754 767524838 768397868 767961681 767836332 768995404 770000160
$$ packed form
554.8G22848296o1452N73575n31792j129389J42336J018524j06096r67682J90318J323521
575.2G23300159O05047k82705N58197J660943R20952l44575J25110J389981J085281
593.5G29018390k36869j02102J236081J261592p5937k55763J085400J501799L81708
611.9G33814299L8684J115739J618564Q29458N56410J674354K274215J160622K23517
630.2G43305862R81033J786828R43243j09076N38349J648128J038790l24071n0902
648.6G49758184J247406J021981l00526k92063Q92758R63390j70588m74811K68519
667G52914250J013636O79434N00023J495898K236068J330972N45204J405537K183377
685.3G64304399J177490k1457N36322J528084Q73030m36187j25349J159072J004756
$$ plain form
703.7 770000160 769704282 769464552 770657301 772129834 772322059 772113800 773153484 774811625 775366008
722 775366008 775182545 776004255 777707279 778485894 778170586 778557897 780069530 780929983 780433714 780264735
742.4 780264735 781443000 782408535 781890750 781287968 782044709 782969654 782531619 781718552 782233059 783476889
762.8 783476889 783655167 782998502 783292532 784537494 784886777 784057736 783830881 784774363 785306334 784681797
783.2 784681797 784399331 785431802 786363304 785927653 785367489 786152899 787275076 787137270 786469162
801.6 786469162 786938727 788056314 788107157 787321627 787431359 788514316 788897812 788263977 788253367 789396942
822 789396942 790045559 789327621 788674355 789140165 789472461 788469255 787240386 787222505 787645400 787024617
842.4 787024617 785877526 785731256 786295772 786020935 784957230 784593582 785068631 784995079 784164488 784114301
$$ packed form
703.7G70000160k95878k39730J192749J472533J92225k08259J039684J658141N54383
722G75366008j83463Q21710J703024P78615l15308L87311J511633Q60453m96269j68979
742.4G80264735J178265R65535n17785o02782P56741R24945m38035q13067N14507J243830
762.8G83476889J78278o56665K94030J244962L49283q29041k26855R43482N31971o24537
783.2G84681797k82466J032471R31502m35651n60164P85410J122177j37806o68108
801.6G86469162M69565J117587N0843p85530J09732J082957L83496o33835j0610J143575
822G89396942O48617p17938o53266M65810L32296j003206j228869j7881M22895o20783
842.4G87024617j147091j46270N64516k74837j063705l63648M75049p3552q30591n0187
$$ plain form
862.8 784114301 785463989 786806643 787206054 787696779 789105654 790342689 790277004 789672136 789615452
881.1 789615452 789384842 787772775 785415888 783752561 782619774 780873179 778730571 777534664 777403355
899.5 777403355 777059078 776082575 775473952 775570869 775229573 773888350 772619247 772163570 771690071 770461500
919.9 770461500 769261658 769028604 769248426 769022763 768703461 769120693 769888282 769925773 769286394 768907011
940.3 768907011 768773317 767935753 766312778 764857531 763772368 762177944 759798169 757520556 755841017
958.6 755841017 754020095 751537979 749134958 747459888 745883346 743651688 741159797 739056408
974.9 739056408 736938298 734038353 730659664 727751255 725392163 722947299 720541894 719018698
991.3 719018698 718443096 717934132 717093706 716472745 716298938 715826333 714494228 712760568 711131334
$$ packed form
862.8G84114301J349688J342654L99411M90725J408875J237035o5685o04868n6684
881.1G89615452k30610j612067k356887j663327j132787j746595k142608j195907j31309
899.5G77403355l44277r76503o08623R6917l41296j341223j269103m55677m73499j228571
919.9G70461500j199842k33054K19822k25663l19302M17232P67589L7491o39379l79383
940.3G68907011j33694q37564j622975j455247j085163j594424k379775k277613j679539
958.6G55841017j820922k482116k403021j675070j576542k231658k491891k103389
974.9G39056408k118110k899945l378689k908409k359092k444864k405405j523196
991.3G19018698n75602n08964q40426o20961j73807m72605j332105j733660j629234
$$ plain form
1009.6 711131334 709234416 706657529 703948677 701866686 700213730 698345125 696379483 694952369
1025.9 694952369 694011629 692886114 691509545 690559983 690288484 690136611 689754128 689556956 689891875
1044.3 689891875 690333188 690461218 690692127 691544235 692719460 693660200 694514811 695803225 697404504
1062.6 697404504 698647857 699354768 699913681 700365782 700293839 699692786 699260950 699453473 699873328 700073779
1083 700073779 700292468 700882316 701560795 701827049 701800466 701926947 702116191 701911867 701333046 700927734
1103.4 700927734 700937629 701037586 701117754 701633215 702855468 704410553 705892682 707423687 709264398
1121.8 709264398 711198628 712847948 714409411 716368794 718583107 720441461 721805930 722996950
1138.1 722996950 724046528 724620163 724594653 724319398 724114180 723799706 723186314 722576320 722338796 722404659
$$ packed form
1009.6G11131334j896918k576887k708852k081991j652956j868605j965642j427114
1025.9F94952369r40740j125515j376569r49562k71499j51873l82483j97172L34919
1044.3F89891875M41313J28030K30909Q52108J175225R40740Q54611J288414J601279
1062.6F97404504J243353P06911N58913M52101p1943o01053m31836J92523M19855K00451
1083G00073779K18689N89848O78479K66254k6583J26481J89244k04324n78821m05312
1103.4G00927734R895R9957Q0168N15461J222253J555085J482129J531005J840711
1121.8G09264398J934230J649320J561463J959383K214313J858354J364469J191020
1138.1G22996950J049578N73635k5510k75255k05218l14474o13392o09994k37524O5863
$$ plain form
1158.5 722404659 722529471 722865045 723755777 725095570 726500511 727937639 729692876 731763601 733710468
1176.9 733710468 735305905 736832380 738467813 739918232 740928948 741707623 742492914 743081093 743185639
1195.2 743185639 742989123 742914677 743001461 742981076 742902875 743088365 743506849 743766606 743766010 743839562 744096339
1217.7 744096339 744212568 744012237 743748426 743654072 743548155 743220508 742899299 742913067 743133187 743203700
1238.1 743203700 743187487 743434727 743921995 744297206 744487226 744786620 745311379 745750010 745897949 746031523
1258.4 746031523 746405125 746808410 747008979 747228980 747771978 748525321 749190152 749828160 750745237 751878858
1278.8 751878858 752862453 753651619 754563332 755668402 756605983 757188916 757699490 758313477 758763552
1297.2 758763552 758844256 758792937 758852541 758833468 758495510 758013189 757667005 757406831 757033229 756606579
$$ packed form
1158.5G22404659J24812L35574Q90732J339793J404941J437128J755237K070725J946867
1176.9G33710468J595437J526475J635433J450419J010716P78675P85291N88179J04546
1195.2G43185639j96516p4446Q6784k0385p8201J85490M18484K59757n96P3552K56777
1217.7G44096339J16229k00331k63811r4354j05917l27647l21209J3768K20120P0513
1238.1G43203700j6213K47240M87268L75211J90020K99394N24759M38631J47939J33574
1258.4G46031523L73602M03285K00569K20001N42998P53343O64831O38008R17077J133621
1278.8G51878858R83595P89166R11713J105070R37581N82933N10574O13987M50075
1297.2G58763552Q0704n1319N9604j9073l37958m82321l46184k60174l73602m26650
$$ plain form
1317.6 756606579 756428957 756542683 756624699 756551802 756543875 756725132 756920993 756994545 757086575 757356167 757782638
1340 757782638 758236766 758631289 758996308 759287894 759342968 759178996 758980274 758819342 758529603 757891953
1360.4 757891953 757053375 756458998 756021500 755402923 754799247 754390240 754121661 753973722 753843069 753664434
1380.8 753664434 753679752 754309356 755564511 757055461 758360744 759076357 759214938 759258449 759377837
1399.2 759377837 759560287 759601951 759395123 759263456 759181380 758889616 758470953 758096635 757490277 756620288
1419.6 756620288 756175041 756113648 756263077 756602287 756890297 757373154 758144379 758693337 759159029 759870291
1440 759870291 760444283 760700822 760529637 759871125 759246409 759088457 759033978 758174419 757162750 757487059
1460.4 757487059 758222401 758591235 759244800 760789454 762715936 764608324 766641259 768950582 771327674
$$ packed form
1317.6G56606579j77622J13726Q2016p2897p927J81257J95861P3552R2030K69592M26471
1340G57782638M54128L94523L65019K91586N5074j63972j98722j60932k89739o37650
1360.4G57891953q38578n94377m37498o18577o03676m09007k68579j47939j30653j78635
1380.8G53664434J5318O29604J255155J490950J305283P15613J38581M3511J19388
1399.2G59377837J82450M1664k06828j31667q2076k91764m18663l74318o06358q69989
1419.6G56620288m45247o1393J49429L39210K88010M82857P71225N48958M65692P11262
1440G59870291N73992K56539j71185o58512o24716j57952n4479q59559j011669L24309
1460.4G57487059P35342L68834O53565J544654J926482J892388K032935K309323K377092
$$ plain form
1478.7 771327674 773437977 775200963 776699662 777860165 778440475 778627396 778848529 778703928 777774751
1497.1 777774751 776594043 775790513 775290787 773994982 771618724 770477116 770535707 770965040 771742761
1515.4 771742761 773122847 775280297 778138936 781230569 783852577 786100745 788267612 789988339
1531.8 789988339 791144371 792370617 793446302 793683827 793673575 794056594 794738591 795486689 795974374
1550.1 795974374 796268106 796643794 797030449 796329141 795208037 795446455 795833349 795677602 794677973
1568.5 794677973 793189466 792279184 790967405 788233399 785691261 783723354 781464934 778848171
1584.8 778848171 776056170 773369730 770895123 768413246 765724719 763000309 760349989 757552803
1601.1 757552803 754647374 752125263 750273585 748848915 747546434 746215463 744288385 741885543
$$ packed form
1478.7G71327674K110303J762986J498699J160503N80310J86921K21133j44601r29177
1497.1G77774751j180708q03530m99726j295805k376258j141608N8591M29333P77721
1515.4G71742761J380086K157450K858639L091633K622008K248168K166867J720727
1531.8G89988339J156032J226246J075685K37525j0252L83019O81997P48098M87685
1550.1G95974374K93732L75688L86655p01308j121104K38418L86894j55747r99629
1568.5G94677973j488507r10282j311779k734006k542138j967907k258420k616763
1584.8G78848171k792001k686440k474607k481877k688527k724410k650320k797186
1601.1G57552803k905429k522111j851678j424670j302481j330971j927078k402842
$$ plain form
1617.4 741885543 740374386 739133537 737419724 735900819 734579384 733494699 733283281 733577967 733882129
1635.8 733882129 734870017 736697853 738977551 741282940 743285000 745651782 748403728 750461400
1652.1 750461400 752249122 754940152 757916510 760733604 763314545 765942454 768602490 770887196
1668.4 770887196 772932291 774955809 776708484 778358161 780069768 781575441 782430828 782766044 783656418
1686.8 783656418 784731627 785708249 786716759 787201941 787344396 787375093 787345707 787868261 788117051 787926078
1707.2 787926078 788003683 788195848 788114727 787473261 786394596 785927176 786053121 785956979 785835564 785982251
1727.6 785982251 786237836 786270559 785794139 786015391 787056506 787827671 788644075 790011227 791681349
1745.9 791681349 793285549 794818401 796886921 799420178 801725507 803871870 806120396 808465540
$$ packed form
1617.4G41885543j511157j240849j713813j518905j321435j084685k11418K94686L04162
1635.8G33882129R87888J827836K279698K305389K002060K366782K751946K057672
1652.1G50461400J787722K691030K976358K817094K580941K627909K660036K284706
1668.4G70887196K045095K023518J752675J649677J711607J505673Q55387L35216Q90374
1686.8G83656418J075209R76622J008510M85182J42455L0697k9386N22554K48790j90973
1707.2G87926078P7605J92165q1121o41466j078665m67420J25945r6142j21415J46687
1727.6G85982251K55585L2723m76420K21252J041115P71165Q16404J367152J670122
1745.9G91681349J604200J532852K068520K533257K305329K146363K248526K345144
$$ plain form
1762.2 808465540 810757995 812711239 814491272 816192865 817491710 818623483 819896162 821135938
1778.6 821135938 822150350 822867274 823446929 824269235 825229108 825676262 825751424 826309860 827181399 827687323
1799 827687323 827823102 828138649 828747809 829262137 829456627 829583049 829963386 830386877 830542922 830645919
1819.4 830645919 830955684 831235647 831313491 831349969 831382990 831569850 831838310 831883013 831921577 832220495
1839.8 832220495 832400680 832064331 831818461 832079828 832349539 832372010 832312942 832381427 832504272 832490683
1860.2 832490683 832397819 832442284 832507908 832309842 832093060 832182288 832395256 832495868 832452059 832381845 832416654
1882.6 832416654 832512498 832498431 832318187 832268298 832454205 832534909 832460880 832455277 832550406 832604408 832558036
1905 832558036 832504809 832542896 832633734 832682431 832638800 832510173 832466841 832458198 832321703 832255661 832322717 832309484
$$ packed form
1762.2H08465540K292455J953244J780033J701593J298845J131773J272679J239776
1778.6H21135938J014412P16924N79655Q22306R59873M47154P5162N58436Q71539N05924
1799H27687323J35779L15547O09160N14328J94490J26422L80337M23491J56045J02997
1819.4H30645919L09765K79963P7844L6478L3021J86860K68460M4703L8564K98918
1839.8H32220495J80185l36349k45870K61367K69711K2471n9068O8485J22845j3589
1860.2H32490683r2864M4465O5624j98066k16782Q9228K12968J00612m3809p0214L4809
1882.6H32416654R5844j4067j80244m9889J85907Q0704p4029n603R5129N4002m6372
1905H32558036n3227L8087R0838M8697m3631j28627m3332q643j36495o6042O7056j3233
$$ plain form
1929.5 832309484 832151175 831970632 831882656 831849217 831710041 831423402 831221163 831188560 831116915 830963731
1949.9 830963731 830852091 830805480 830716848 830531001 830376387 830353558 830323279 830142319 829959571 829940796
1970.3 829940796 829961360 829879880 829750538 829687417 829690576 829642594 829499304 829380274 829353869 829259038 829053283
1992.7 829053283 828956246 828984320 828944623 828766584 828574240 828486145 828418076 828243434 828016579 827881157
2013.1 827881157 827782273 827533901 827115655 826615930 825966954 825339317 825296819 825760782 826138437 826252997
2033.5 826252997 826179028 826059163 826032639 826050520 825981736 825839937 825758815 825761795 825732231 825641692 825632393
2056 825632393 825748146 825822115 825761259 825704992 825794578 825925887 825928450 825895011 825981915 826115727 826157272
2078.4 826157272 826131344 826169729 826287091 826359928 826345861 826363027 826454401 826491773 826414943 826354623 826412857
$$ packed form
1929.5H32309484j58309j80543q7976l3439j39176k86639k02239l2603p1645j53184
1949.9H30963731j11640m6611q8632j85847j54614k2829l0279j80960j82748j8775
1970.3H29940796K0564q1480j29342o3121L159m7982j43290j19030k6405r4831k05755
1992.7H29053283r7037K8074l9697j78039j92344q8095o8069j74642k26855j35422
2013.1H27881157r8884k48372m18246m99725o48976o27637m2498M63963L77655J14560
2033.5H26252997p3969j19865k6524J7881o8784j41799q1122K980k9564r0539r299
2056H25632393J15753P3969o0856n6267Q9586J31309K563l3439Q6904J33812M1545
2078.4H26157272k5928L8385J17362P2837j4067J7166R1374L7372p6830o0320N8234
$$ plain form
2100.8 826412857 826469243 826400936 826306403 826324165 826389074 826347589 826229572 826211095 826305330 826334417 826246738
2123.3 826246738 826198578 826276243 826345205 826294363 826240957 826317251 826445103 826477826 826442242 826485157 826621950
2145.7 826621950 826724470 826748550 826796174 826930702 827073991 827148199 827214479 827362180 827519655 827580929
2166.1 827580929 827620983 827785134 828038454 828217626 828304827 828417659 828600049 828765273 828851938 828948379
2186.5 828948379 829127371 829303563 829370379 829364300 829412878 829518259 829565644 829551637 829582572 829666018 829699278
2208.9 829699278 829679072 829702497 829774141 829804003 829756260 829707265 829718828 829748511 829716682 829644084 829640806 829689205
2233.4 829689205 829680681 829629660 829604387 829597414 829569459 829524279 829508483 829533517 829531074 829466045 829410434 829421759
2257.9 829421759 829446316 829417109 829378903 829400957 829427719 829393625 829344869 829329252 829320073 829280078 829219341 829187810
$$ packed form
2100.8H26412857N6386o8307r4533J7762O4909m1485j18017j8477R4235K9087q7679
2123.3H26246738m8160P7665O8962n0842n3406P6294J27852L2723l5584M2915J36793
2145.7H26621950J02520K4080M7624J34528J43289P4208O6280J47701J57475O1274
2166.1H27580929M0054J64151K53320J79172Q7201J12832J82390J65224Q6665R6441
2186.5H28948379J78992J76192O6816o079M8578J05381M7385j4007L0935Q3446L3260
2208.9H29699278k0206K3425P1644K9862m7743m8995J1563K9683l1829p2598l278M8399
2233.4H29689205q524n1021k5273o973k7955m5180j5796K5034k443o5029n5611J1325
2257.9H29421759K4557k9207l8206K2054K6762l4094m8756j5617r179l9995o0737l1531
$$ plain form
2282.3 829187810 829187989 829129934 829012215 828948379 828938901 828879118 828761101 828676105 828647494 828600347 828464866
2304.8 828464866 828284144 828145146 828008771 827832699 827701390 827643931 827529252 827244103 826908171 826738298
2325.2 826738298 826665103 826445282 826124012 825955570 825920761 825794101 825470269 825043440 824663460 824665308
2345.6 824665308 825337648 826115906 826270401 825748563 825007021 824315250 823791504 823498189 823320866 823192418
2366 823192418 823214412 823399067 823587179 823695540 823880136 824264705 824687719 824943364 825076044 825208664
2386.4 825208664 825280309 825164735 824932098 824785769 824735701 824592412 824338019 824161112 824090838 823935807
2406.8 823935807 823626280 823369563 823286593 823177278 822901249 822625816 822505534 822405279 822137237 821806252
2427.2 821806252 821626544 821528077 821306825 821007371 820836484 820781052 820607543 820278108 820028007 819952607
$$ packed form
2282.3H29187810J79n8055j17719o3836r478n9783j18017q4996k8611m7147j35481
2304.8H28464866j80722j38998j36375j76072j31309n7459j14679k85149l35932j69873
2325.2H26738298p3195k19821l21270j68442l4809j26660l23832m26829l79980J848
2345.6H24665308O72340P78258J54495n21838p41542o91771n23746k93315j77323j28448
2366H23192418K1994J84655J88112J08361J84596L84569M23014K55645J32680J32620
2386.4H25208664P1645j15574k32637j46329n0068j43289k54393j76907p0274j55031
2406.8H23935807l09527k56717q2970j09315k76029k75433j20282j00255k68042l30985
2427.2H21806252j79708r8467k21252k99454j70887n5432j73509l29435k50101p5400
$$ plain form
2447.6 819952607 819848359 819575965 819297731 819180906 819085717 818840265 818574905 818459928 818396926 818208694
2467.9 818208694 817946672 817798376 817739785 817567050 817284107 817109942 817084014 816987574 816716850 816476345
2488.3 816476345 816417813 816355944 816103101 815820038 815712392 815661609 815445065 815149069 815021455 815013766
2508.7 815013766 814889610 814653218 814525485 814537168 814461410 814232886 814069390 814060390 814008176 813796639
2529.1 813796639 813588798 813521564 813469708 813287914 813075066 812999487 812991023 812853098 812611938 812476456
2549.5 812476456 812468052 812379301 812157750 811993778 811971545 811912537 811705053 811515391 811454952 811379611 811172366
2572 811172366 810944200 810833097 810763240 810577631 810312331 810139716 810059249 809884369 809602499 809427142
2592.4 809427142 809382558 809239984 808918059 808612704 808457851 808318436 808048069 807742834 807560384 807442546
$$ packed form
2447.6H19952607j04248k72394k78234j16825r5189k45452k65360j14977o3002j88232
2467.9H18208694k62022j48296n8591j72735k82943j74165k5928r6440k70724k40505
2488.3H16476345n8532o1869k52843k83063j07646n0783k16544k95996j27614p689
2508.7H15013766j24156k36392j27733J1683p5758k28524j63496r000n2214k11537
2529.1H13796639k07841o7234n1856j81794k12848p5579q464j37925k41160j35482
2549.5H12476456q404q8751k21551j63972k2233n9008k07484j89662o0439p5341k07245
2572H11172366k28166j11103o9857j85609k65300j72615q0467j74880k81870j75357
2592.4H09427142m4584j42574l21925l05355j54853j39415k70367l05235j82450j17838
$$ plain form
2612.8 807442546 807233810 806947589 806720078 806566775 806351364 806046188 805809081 805672824 805480242 805195391
2633.2 805195391 804951668 804810405 804636538 804322422 804016352 803866208 803753495 803521395 803247929 803077400
2653.5 803077400 802965581 802777410 802516520 802333415 802256286 802115321 801860213 801645577 801532447 801389277
2673.9 801389277 801147342 800918639 800767601 800601244 800341606 800059021 799861670 799707532 799479306 799201369
2694.3 799201369 799005687 798885643 798691213 798394203 798109233 797879040 797638893 797355890 797099352 796907723
2714.7 796907723 796694458 796423256 796177149 796013653 795884073 795651853 795309126 795044839 794895053 794725955
2735.1 794725955 794506609 794290960 794123530 793991804 793863237 793736219 793586791 793365300 793082833 792845905
2755.5 792845905 792683363 792491138 792225420 791953266 791727245 791518629 791281104 791055083 790884018 790662825
$$ packed form
2612.8H07442546k08736k86221k27511j53303k15411l05176k37107j36257j92582k84851
2633.2H05195391k43723j41263j73867l14116l06070j50144j12713k32100k73466j70529
2653.5H03077400j11819j88171k60890j83105p7129j40965k55108k14636j13130j43170
2673.9H01389277k41935k28703j51038j66357k59638k82585j97351j54138k28226k77937
2694.3G99201369j95682j20044j94430k97010k84970k30193k40147k83003k56538j91629
2714.7G96907723k13265k71202k46107j63496j29580k32220l42727k64287j49786j69098
2735.1G94725955k19346k15649j67430j31726j28567j27018j49428k21491k82467k36928
2755.5G92845905j62542j92225k65718k72154k26021k08616k37525k26021j71065k21193
$$ plain form
2775.9 790662825 790313363 789924741 789597929 789334893 789094687 788849771 788547695 788146019 787684917 787240207
2796.3 787240207 786813915 786357880 785869420 785344243 784811139 784345627 783870161 783255160 782580495 781982183
2816.7 781982183 781436026 780828714 780135632 779446781 778772652 778022170 777214766 776444197 775737524 775039017
2837.1 775039017 774182737 773110449 772011518 770978451 769895375 768743336 767699003 766869485 766160011
2855.5 766160011 765491426 764859498 764193594 763370574 762375295 761385024 760599792 759997487 759319484 758458614
2875.9 758458614 757668197 757098794 756645262 756275356 756044030 755937636 755860806 755788267 755798519 755831063
2896.3 755831063 755716026 755511642 755395651 755337059 755201101 754964590 754684091 754335225 753767014 752930701
2916.6 752930701 751992762 751156807 750548542 750155270 749954998 749960363 750028193 750092089 750297129 750696778
$$ packed form
2775.9G90662825l49462l88622l26812k63036k40206k44916l02076m01676m61102m44710
2796.3G87240207m26292m56035m88460n25177n33104m65512m75466o15001o74665n98312
2816.7G81982183n46157o07312o93082o88851o74129p50482q07404p70569p06673o98507
2837.1G75039017q56280j072288j098931j033067j083076j152039j044333q29518p09474
2855.5G66160011o68585o31928o65904q23020r95279r90271p85232o02305o78003q60870
2875.9G58458614p90417n69403m53532l69906k31326j06394p6830p2539J0252L2544
2896.3G55831063j15037k04384j15991n8592j35958k36511k80499l48866n68211q36313
2916.6G52930701r37939q35955o08265l93272k00272N365O7830O3896K05040L99649
$$ plain form
2937 750696778 751274347 752079725 753029585 753911734 754687428 755505800 756418288 757246315 757967889 758816183
2957.4 758816183 759828210 760861099 761881232 762973964 764173806 765415370 766691267 768029749
2973.8 768029749 769351184 770594060 771729410 772684216 773498118 774224102 774856329 775534213 776257098
2992.1 776257098 776752949 776981056 777093530 777159095 777211428 777203023 777162135 777281523 777578175 777773976
3012.5 777773976 777664423 777364016 777057469 776758909 776465952 776208699 775948763 775686562 775437534 775194526
3032.9 775194526 774890661 774467230 774089158 773834586 773535430 773056090 772428930 771846771 771369755 770865023
3053.3 770865023 770303786 769709945 769117296 768617392 768206954 767782688 767261803 766656399 766032279 765475869
3073.7 765475869 765120625 764907658 764527798 763902009 763219833 762540698 761895478 761276364 760531247 759769380
$$ packed form
2937G50696778N77569Q05378R49860Q82149P75694Q18372R12488Q28027P21574Q48294
2957.4G58816183J012027J032889J020133J092732J199842J241564J275897J338482
2973.8G68029749J321435J242876J135350R54806Q13902P25984O32227O77884P22885
2992.1G76257098M95851K28107J12474O5565N2333q405m0888J19388K96652J95801
3012.5G77773976j09553l00407l06547k98560k92957k57253k59936k62201k49028k43008
3032.9G75194526l03865m23431l78072k54572k99156m79340o27160n82159m77016n04732
3053.3G70865023n61237n93841n92649m99904m10438m24266n20885o05404o24120n56410
3073.7G65475869l55244k12967l79860o25789o82176o79135o45220o19114p45117p61867
$$ plain form
3094.1 759769380 759223104 758765757 758149147 757394791 756718576 756190002 755637348 754955351 754367590 754008293
3114.5 754008293 753579497 752905071 752047777 751028180 749984443 749101222 748424113 747782707 746992111
3132.8 746992111 746195257 745609701 745070457 744212866 743100524 742120564 741389930 740797460 740188658
3151.2 740188658 739345074 738268852 737215459 736223161 735221267 734311879 733485758 732535958 731445730
3169.6 731445730 730435908 729537785 728550673 727430165 726370811 725431800 724433959 723309875 722224772
3187.9 722224772 721270144 720273435 719068944 717772603 716573477 715457022 714300334 713089406 711927235
3206.3 711927235 710833848 709723592 708539248 707319438 706160605 705007195 703742504 702463150
3222.6 702463150 701287746 700143516 698944867 697815478 696799099 695590675 694118679 692695618
$$ packed form
3094.1G59769380n46276m57347o16610p54356o76215n28574n52654o81997n87761l59297
3114.5G54008293m28796o74426q57294j019597j043737q83221o77109o41406p90596
3132.8G46992111p96854n85556n39244q57591j112342r79960p30634n92470o08802
3151.2G40188658q43584j076222j053393r92298j001894r09388q26121r49800j090228
3169.6G31445730j009822q98123r87112j120508j059354r39011r97841j124084j085103
3187.9G22224772r54628r96709j204491j296341j199126j116455j156688j210928j162171
3206.3G11927235j093387j110256j184344j219810j158833j153410j264691j279354
3222.6G02463150j175404j144230j198649j129389j016379j208424j471996j423061
$$ plain form
3238.9 692695618 691467881 690394104 689411998 688359857 687115490 685861647 684784651 683784008
3255.2 683784008 682717383 681605935 680538774 679538488 678606451 677804530 677128077 676287830 675145447
3273.6 675145447 673943102 672805846 671697974 670606077 669559181 668529630 667472363 666486382
3289.9 666486382 665532708 664388061 663001716 661480069 660031378 658861160 657885432 656705916 655048132
3308.2 655048132 653091252 651110768 649207830 647396922 645649195 643879473 642074585 640263438
3324.6 640263438 638260543 636025429 633814752 631700158 629640400 627661049 625559270 623180926
3340.9 623180926 620742798 618324339 615925372 613690615 611387968 608709276 605894625 603260040
3357.2 603260040 600792646 598317623 595801473 593449175 591266930 588891387 586107969 583262265
$$ packed form
3238.9F92695618j227737j073777r82106j052141j244367j253843j076996j000643
3255.2F83784008j066625j111448j067161j000286r32037q01921o76453q40247j142383
3273.6F75145447j202345j137256j107872j091897j046896j029551j057267r85981
3289.9F66486382r53674j144647j386345j521647j448691j170218r75728j179516j657784
3308.2F55048132j956880j980484j902938j810908j747727j769722j804888j811147
3324.6F40263438k002895k235114k210677k114594k059758j979351k101779k378344
3340.9F23180926k438128k418459k398967k234757k302647k678692k814651k634585
3357.2F03260040k467394k475023k516150k352298k182245k375543k783418k845704
$$ plain form
3373.5 583262265 580727637 578443527 576296926 574228764 572205067 570315540 568727553 567470729
3389.8 567470729 566133380 564391732 562630773 561351299 560392559 559090495 557349741 555834532
3406.1 555834532 554780662 553852439 552841008 551752925 550725639 549895763 549190879 548568964 548155606
3424.5 548155606 547967017 547934890 547959983 548062265 548315883 548496902 548453331 548475444 548845172 549482346
3444.9 549482346 550203383 550998688 551923215 552922368 553969443 555136085 556429982 557694197 558963239
3463.2 558963239 560514033 562271416 563798368 564949930 566086113 567507863 569199085 570866585
3479.6 570866585 572260022 573649883 575267315 576891363 578461885 580139458 581906199 583699286
3495.9 583699286 585491240 587281644 589042783 590678513 592239082 593887746 595729649 597760141
$$ packed form
3373.5E83262265k534628k284110k146601k068162k023697j889527j587987j256824
3389.8E67470729j337349j741648j760959j279474r58740j302064j740754j515209
3406.1E55834532j053870r28223j011431j088083j027286q29876p04884o21915m13358
3424.5E48155606j88589l2127K5093J02282K53618J81019m3571K2113L69728O37174
3444.9E49482346P21037P95305R24527R99153J047075J166642J293897J264215J269042
3463.2E58963239J550794J757383J526952J151562J136183J421750J691222J667500
3479.6E70866585J393437J389861J617432J624048J570522J677573J766741J793087
3495.9E83699286J791954J790404J761139J635730J560569J648664J841903K030492
$$ plain form
3512.2 597760141 599757969 601571798 603375793 605353475 607477963 609501362 611295223 613111377
3528.5 613111377 615184903 617431581 619726837 621974170 624151707 626473665 628953338 631310463
3544.8 631310463 633465528 635651708 637927234 640251994 642713308 645290494 647942781 650693536
3561.1 650693536 653368533 655694842 658059657 661047220 664267838 667288065 670275986 673391223
3577.5 673391223 676676810 680186272 683691800 686698675 689405382 692698777 696292818 699572563
3593.8 699572563 702836812 706311345 709715068 713075399 716503680 719635487 722457945 725417733
3610.1 725417733 728577733 731860876 734886467 737326562 739978671 743246973 746397436 748545408
3626.4 748545408 749768376 751818776 754629552 757034302 759105563 761106789 763140798 765265942
$$ packed form
3512.2E97760141J997828J813829J803995J977682K124488K023399J793861J816154
3528.5F13111377K073526K246678K295256K247333K177537K321958K479673K357125
3544.8F31310463K155065K186180K275526K324760K461314K577186K652287K750755
3561.1F50693536K674997K326309K364815K987563L220618L020227K987921L115237
3577.5F73391223L285587L509462L505528L006875K706707L293395L594041L279745
3593.8F99572563L264249L474533L403723L360331L428281L131807K822458K959788
3610.1G25417733L160000L283143L025591K440095K652109L268302L150463K147972
3626.4G48545408J222968K050400K810776K404750K071261K001226K034009K125144
$$ plain form
3642.7 765265942 767176807 768260419 768719912 769978344 771923959 773284853 774400532 775952339
3659 775952339 777296066 778328419 779576778 780551076 780749023 781342030 782109499 781955838 782349646
3677.4 782349646 783644497 784948289 786360323 787581205 787887216 787633657 788081288 789218247 790309548
3695.8 790309548 791050851 791372418 791494250 792040288 792921305 793468952 793222547 792727411 793205023 794209778
3716.2 794209778 794815600 794955552 794928432 794864535 795018733 795681000 796247661 796098650 795509756 795374453
3736.5 795374453 796321511 797438562 797124624 796106339 796549618 796865344 795979083 795883358 796811879
3754.9 796811879 797345817 797272921 797436416 797843635 797974348 797897637 797655463 797563851 797939479 798414826
3775.3 798414826 798549294 798340797 798239648 798268378 798282802 798421979 798609018 798795283 798898399 798882604
$$ packed form
3642.7G65265942J910865J083612M59493J258432J945615J360894J115679J551807
3659G75952339J343727J032353J248359R74298J97947N93007P67469j53661L93808
3677.4G82349646J294851J303792J412034J220882L06011k53559M47631J136959J091301
3695.8G90309548P41303L21567J21832N46038Q81017N47647k46405m95136M77612J004755
3716.2G94209778O05822J39952k7120o3897J54198O62267N66661j49011n88894j35303
3736.5G95374453R47058J117051l13938j018285M43279L15726q86261r5725R28521
3754.9G96811879N33938p2896J63495M07219J30713p6711k42174r1612L75628M75347
3775.3G98414826J34468k08497j01149K8730J4424J39177J87039J86265J03116j5795
$$ plain form
3795.7 798882604 798975229 798584223 797890186 798033595 798006952 797733843 798343956 799160600 799067736 798468471
3816.1 798468471 798440695 798103154 797630966 798027992 798471749 798711002 798838556 798879564 798968732 798555136
3836.5 798555136 797762394 797550261 797735333 798088610 798833430 799653053 799352527 797056437 795613587
3854.8 795613587 796713889 797947168 798287511 797991037 797796786 797823131 797353148 796922922 797059476
3873.2 797059476 797422349 797808826 797707438 797517538 797462702 797116637 797162592 797266722 796859622 796925128
3893.6 796925128 797490478 797593951 797123849 796478271 795980215 796055317 796532094 796863079 797040939 797079146
3914 797079146 796726763 796253502 796224952 796419322 796368301 796296656 796365798 796266675 796061575 796069801 796197593
3936.4 796197593 796255171 796150982 795923233 795838654 795869172 795836985 795814753 795834184 795841157 795825899 795761168
$$ packed form
3795.7G98882604R2625l91006o94037J43409k6643k73109O10113Q16644r2864n99265
3816.1G98468471k7776l37541m72188L97026M43757K39253J27554M1008Q9168m13596
3836.5G98555136p92742k12133J85072L53277P44820Q19623l00526k296090j442850
3854.8G95613587J100302J233279L40343k96474j94251K6345m69983m30226J36554
3873.2G97059476L62873L86477j01388j89900n4836l46065M5955J04130m07100O5506
3893.6G96925128N65350J03473m70102o45578m98056P5102M76777L30985J77860L8207
3914G97079146l52383m73261k8550J94370n1021p1645O9142r9123k05100Q226J27792
3936.4G96197593N7578j04189k27749q4579L0518l2187k2232J9431O973j5258o4731
$$ plain form
3958.9 795761168 795641899 795563340 795586526 795624495 795567989 795448244 795368016 795345366 795297384 795211256 795210540
3981.3 795210540 795297265 795288205 795140624 795036852 795045495 795039833 794978559 794930756
3997.6 794930756
$$ packed form
3958.9G95761168j19269p8559K3186L7969n6506j19745q0228k2650m7982q6128p16
3981.3G95210540Q6725r060j47581j03772Q643n662o1274m7803
3997.6G94930756
##END=$$ End of the data block
