##TITLE=Casca de arroz - 3 $$ Begin of the data block
##JCAMP-DX=5.00 $$ ACD/SpecManager v 10.08
##SPECTROMETER/DATA SYSTEM=Alpha
##DATE=26 May 2015 09:43:50
##DATA TYPE=INFRARED SPECTRUM
##DATA CLASS=XYDATA
##ORIGIN=
##OWNER=
##NPOINTS=1765
##FIRSTX=399.76428223
##LASTX=3997.64306641
##MAXX=3997.64306641
##MINX=399.76428223
##MAXY=0.80106115
##MINY=0.46856019
##XFACTOR=1.0000000000
##YFACTOR=1.000000000000000e-9
##FIRSTY=0.66547102
##DELTAX=2.03961372
##XUNITS=1/CM
##YUNITS=ARBITRARY UNITS
##XYDATA=(X++(Y..Y))
399.8F65471017l37183l098667j210868J059890j417935k787888K97308Q90016l070831
418.1F55794859l389120M87804j81019l039301j953005J62363j678646l413379q64625
436.5F41925931Q46088j711845l007770l18706N15520k012729k102971L26276l88563
454.8F34071231l078878j802087J074493j44601k140939l94642J395106l27110j063168
473.2F27589405J844585L183484J257777J052439L572166L719449J383305J759052
489.5F45361662L942311K869427L57270J246095K795279Q33154j048923P05600J817345
507.9F58879220n13970j775921k8312J94013j978516j782775N69999L47078j489401
526.2F52421415m35949J775086R35853p26283O76394K397477P88332q81434M62592
$$ plain form
399.8 665471017 665133834 662035167 660824299 661884189 660466254 657678366 657975674 658865690 655794859
418.1 655794859 652405739 652893543 652712524 649673223 647720218 647882581 646203935 642790556 641925931
436.5 641925931 642772019 641060174 638052404 637733698 638249218 636236489 634133518 634459794 634071231
454.8 634071231 630992353 629190266 630264759 630120158 627979219 627584577 628979683 628652573 627589405
473.2 627589405 629433990 632617474 633875251 634927690 638499856 642219305 643602610 645361662
489.5 645361662 649303973 652173400 652530670 653776765 656572044 657405198 656356275 657061875 658879220
507.9 658879220 658365250 656589329 656561017 656755030 654776514 652993739 653563738 653910816 652421415
526.2 652421415 651985466 653760552 654696405 653970122 654646516 657043993 657832325 656950891 657413483
544.6F57413483J333356n37992j462877J56224M47273j527607j736522J28985j0610
562.9F54203713j877546j643837j67131q28207k049863o40631J395285Q94487J1087
581.3F49297357J494884K728582J361846K87354J383663J647234j37389o57797Q59916
599.6F58265650J004517o05642n30124J138627J057387k90394K93434J829624J319945
618F63483024M23431J777887L114641J891792N19335J440704K195120P54714j78933
636.4F75421715J118243J670777J04904l34680J246989J390994l41296m31002J093626
654.7F80940270Q74401o31929k21968J245618R89139k20775L39210J684069R13561
673.1F85911596J52170J416922K409637J042187Q3745J275122J682639K265n49376
$$ plain form
544.6 657413483 658746839 658208847 656745970 656902194 657349467 655821860 654085338 654214323 654203713
562.9 654203713 652326167 650682330 650515199 649686992 647637129 646996498 648391783 649286270 649297357
581.3 649297357 650792241 653520823 654882669 655170023 656553686 658200920 658063531 657405734 658265650
599.6 658265650 659270167 658664525 658134401 659273028 660330415 660040021 660333455 662163079 663483024
618 663483024 663906455 665684342 668798983 670690775 671210110 672650814 674845934 675600648 675421715
636.4 675421715 676539958 678210735 678315639 677980959 679227948 680618942 680277646 679846644 680940270
654.7 680940270 681814671 681182742 680960774 682206392 683195531 682974756 683313966 684998035 685911596
673.1 685911596 686063766 687480688 689890325 690932512 691016257 692291379 693974018 693976283 693426907
691.4F93426907Q63314Q47697r93788j177728L65674L09885j016021l99828J372039
709.8F93598151J183629J06097R69052K387106J718879P02202J774788K757728J443923
728.1G06641555L64661J502156K088368N45085k40326R16421J060069n94139j023531
746.5G11260319K24471N4896j585007j528323j5676j04963j221002m21524J282811
764.9G07946002R93193k8968Q46326J940668Q98003k26855P32362J609385N84603p4089
785.3G15220630J007915J431048J90258q2612J334786J655936M34876M35352J762807
803.6G23390996J646817L29972N63263J801074J404166J99676P03156J766443R56476
822G32762039k59340L00169R18031k28525j134097q1360P46905j24633m69208P18892
$$ plain form
691.4 693426907 694290221 695137918 694144130 692966402 693332076 693641961 692625940 692226112 693598151
709.8 693598151 694781780 694887877 695856929 698244035 699962914 700665116 702439904 705197632 706641555
728.1 706641555 707006216 708508372 710596740 711141825 710901499 711817920 712877989 712283850 711260319
746.5 711260319 711484790 711539686 709954679 708426356 708410680 708305717 707084715 706663191 707946002
764.9 707946002 708939195 708910227 709756553 711697221 712595224 712368369 713100731 714710116 715294719 715220630
785.3 715220630 716228545 717659593 717849851 717767239 719102025 720757961 721192837 721628189 723390996
803.6 723390996 725037813 725367785 725931048 727732122 729136288 729335964 730039120 731805563 732762039
822 732762039 732502699 732802868 733720899 733492374 732358277 732276917 733023822 732899189 732429981 733148873
842.4G33148873J052439k04742n34356N55635N63085o54995o26207N25117M55380l65496
862.8G33914733L30448J671016J334906L05414O48439J195073J23739j148462r04143
881.1G37471163p27713k026200k948702k257943j760900k409279k364099r56774k50399
899.5G21769154r12487j032234k62618n18977j848579k191126j566827j902044k849579
917.8G08684683k550900j568377j628220k071679j380741m24266o52075j051307k80082
936.2F97077036M74274j073m53353M8340O7055j179338k116143j994908k265990l365636
956.6F86290264l770053l257931l378093m228711m392862l980637m413187n469144
972.9F53399646n799889n709768o336629p157803o954729o216526o082237n996466
$$ plain form
842.4 733148873 734201312 733996570 733462214 734017849 734580934 733925939 733299732 733824849 734280229 733914733
862.8 733914733 734245181 735916197 737251103 737556517 738204956 739400029 739523768 738375306 737471163
881.1 737471163 736743450 734717250 731768548 729510605 727749705 725340426 722976327 722019553 721769154
899.5 721769154 720856667 719824433 719561815 719042838 717194259 715003133 713436306 711534262 708684683
917.8 708684683 706133783 704565406 702937186 700865507 699484766 699060500 698408425 697357118 697077036
936.2 697077036 697551310 697550237 697096884 697145224 697212279 696032941 693916798 691921890 689655900 686290264
956.6 686290264 682520211 679262280 675884187 671655476 667262614 663281977 658868790 653399646
972.9 653399646 647599757 641889989 635553360 628395557 621440828 615224302 609142065 603145599
989.2F03145599n017995l951252l728807l596604k842188k356291k837896l417253
1005.5E75397313l501058l879368m807115n186796m635751m076779l768325k921283
1021.8E42620838j561821p35164n55813j58608L61741J80244l78728l75092k7597j18851
1042.2E39251149l27528R8944P54952R02474R70781J639962K376974K480805K477765
1060.6E50626278K872169K804279J513839l41475j962781l329575m108608l478229
1076.9E44595897j708269j44899O78301J380980K108455K195477J685977J426041J411260
1095.3E53629220R41395L06070L44932Q38578J040041J158178J757801K414465K442300
1113.6E64872980K260864K505064K683461K309858K057910K487421K952338K899706
$$ plain form
989.2 603145599 598127604 594176352 590447545 586850941 584008753 581652462 578814566 575397313
1005.5 575397313 571896255 568016887 563209772 558022976 553387225 549310446 545542121 542620838
1021.8 542620838 541059017 540323853 539768040 539609432 539971173 540151417 539772689 539397597 539370000 539251149
1042.2 539251149 538923621 539022565 539777517 540679991 541650772 543290734 545667708 548148513 550626278
1060.6 550626278 553498447 556302726 557816565 557475090 555512309 552182734 548074126 544595897
1076.9 544595897 542887628 542742729 543421030 544802010 546910465 549105942 550791919 552217960 553629220
1095.3 553629220 554570615 554876685 555221617 556060195 557100236 558258414 560016215 562430680 564872980
1113.6 564872980 567133844 569638908 572322369 574632227 576690137 579177558 582129896 585029602
1129.9E85029602K758145K698779K081931P74562l26395q29994j410485k170383k269865
1148.3E86335897j679062j266659r99570j01387J235723K144516K725243L669799M654765
1166.7E96719265M898012M786074N099535N408525M974783M330396M239083M144370
1183F34600043L399492K665937K501726K184152J266241N56469N25296M37558n782
1201.3F48131132K9981O93679J003921P54535Q07703J207352J045107M04656K56658
1219.7F54334724M65155J41441m31537l61800J1384j36018l65793L8981N28634M29213
1240.1F54654384K94923P54238J193583J007855Q32259J157046J313328R02772O78659
1258.4F62789047J057982J267672R55939Q86798J283646J414001J167893J287639J754821
$$ plain form
1129.9 585029602 587787747 590486526 592568457 593343019 593016624 592186630 590776145 588605762 586335897
1148.3 586335897 584656835 583390176 582390606 582289219 583524942 585669458 588394701 592064500 596719265
1166.7 596719265 601617277 606403351 611502886 616911411 621886194 626216590 630455673 634600043
1183 634600043 637999535 640665472 643167198 645351350 646617591 647174060 647699356 648136914 648131132
1201.3 648131132 648161113 648854792 649858713 650613248 651420951 652628303 653673410 654078066 654334724
1219.7 654334724 654799879 654941320 654509783 654147983 654159367 654023349 653657556 653696537 654225171 654654384
1240.1 654654384 654949307 655703545 656897128 657904983 658737242 659894288 661207616 662110388 662789047
1258.4 662789047 663847029 665114701 666070640 666957438 668241084 669655085 670822978 672110617 673865438
1276.8F73865438J739323J290500J244604J525760J340628Q68082Q70168J071572P53761
1295.2F84569836K50697K55286M13299J26541j81198Q642J40965l24309p37190n35488
1315.6F83987081l14534m90844n56052k84552k48730o37412p32065l12864j19627l64363
1336F79926038k85447M41849Q88646N81622L13580L37303O9916m04239m66466k90215
1356.4F81112587n95808j201391j168132n89668n99087r22680o86585l62218k64823
1374.7F74722195M2617M23610L73304J78576Q31604K238035K793670J849234P77065
1393.1F84229910N20170N25951K05219Q9050P4982k09629m92931n68509n23627o98804
1413.5F83151782j160026j387119p71046J9610J17779L36408O88553O57857O97732
$$ plain form
1276.8 673865438 675604761 676895261 678139865 679665625 681006253 681874335 682744503 683816075 684569836
1295.2 684569836 684820533 685075819 685489118 685615659 685434461 685443103 685584068 685259759 684522569 683987081
1315.6 683987081 683672547 683181703 682625651 682341099 682092369 681454957 680722892 680410028 680290401 679926038
1336 679926038 679640591 680082440 680971086 681552708 681866288 682203591 682273507 681869268 681402802 681112587
1356.4 681112587 680516779 679315388 678147256 677557588 676958501 676035821 675349236 674987018 674722195
1374.7 674722195 674764812 675188422 675561726 675740302 676571906 678809941 681603611 683452845 684229910
1393.1 684229910 684750080 685276031 685481250 685570300 685645282 685435653 684942722 684374213 683850586 683151782
1413.5 683151782 681991756 680604637 679833591 679853201 679970980 680307388 680995941 681653798 682351530
1431.8F82351530Q63194R51409J215995J264810R59277M18962m17054q99375n42283
1450.2F86166465l61681r24289j419723j37746J316845R87828Q67665K088248K893746
1468.5F91477358K780974L469706M783511M830360L944695L259719K937376K119005
1484.9G19602704R22203N04613R87113P44402m76539j138032o54280o21974j423180
1503.2G18447030k579153k554536n42879K06351J65165M74095J174808K163708L478825
1521.6G20433414L989577L185571K661466K426744J614093Q58963Q47995M41611l44753
1539.9G36114681K23100J440108J763284J056969K02179J42992K38716m48286j262546
1558.3G39471197M39048J872659P52628m52042p89046o15001p61271j700401k198458
$$ plain form
1431.8 682351530 683214724 684166133 685382128 686646938 687606215 688025177 687608123 686708748 686166465
1450.2 686166465 685804784 684880495 683460772 683323026 684639871 685627699 686495364 688583612 691477358
1468.5 691477358 694258332 697728038 702511549 707341909 711286604 714546323 717483699 719602704
1484.9 719602704 720524907 721029520 722016633 722761035 722284496 721146464 720492184 719870210 718447030
1503.2 718447030 715867877 713313341 712770462 712976813 713141978 713616073 714790881 716954589 720433414
1521.6 720433414 724422991 727608562 730270028 732696772 734310865 735169828 736017823 736459434 736114681
1539.9 736114681 736337781 737777889 739541173 740598142 740800321 740943313 741182029 740733743 739471197
1558.3 739471197 739910245 741782904 742535532 742083490 741294444 740679443 739918172 738217771 736019313
1576.6G36019313j549720j831770k608061k540350k454221k810359k782703k304554
1593G17137575k373695k922416l069282k924323l004193k980769k326011j565874j628876
1611.3F94342136k356469l083408l166735k548695k812862l178478k570569k437830
1627.6F72187090k398908j544655j061797r40323K75791J396775J361907N58734J60992
1646F69995606J238108J720786Q10623J422882L191292K963543K033889K046288K959549
1664.3F88382566K817214K048194K407908L118158K971649K677858K622723K310694
1680.7G09356964J563847J705169K851308K947688K184450J207114P99894J038909
1697G23655343R36925J150072J923204J765132J065194P32958P57397M12702m56333
$$ plain form
1576.6 736019313 734469593 732637823 730029762 727489412 725035191 722224832 719442129 717137575
1593 717137575 714763880 711841464 708772182 705847859 702843666 699862897 697536886 695971012 694342136
1611.3 694342136 691985667 688902259 685735524 683186829 680373967 677195489 674624920 672187090
1627.6 672187090 669788182 668243527 667181730 666241407 666517198 667913973 669275880 669834614 669995606
1646 669995606 671233714 672954500 673765123 675188005 678379297 681342840 683376729 685423017 688382566
1664.3 688382566 691199780 693247974 695655882 698774040 701745689 704423547 707046270 709356964
1680.7 709356964 710920811 712625980 715477288 718424976 720609426 721816540 722616434 723655343
1697 723655343 724592268 725742340 727665544 729430676 730495870 731228828 731986225 732398927 731942594
1715.3G31942594m79579J014531J470983N46217J27077M54128L69131k30849j14023
1733.7G35100210J496315K055943J541257J853883K593219K441526J866102K315819
1750G51264274L436864L239154K427578K519071K819717K620101K316296K206803K048850
1768.4G74898708J469076J282155K103746K292216J397312Q13961J166343J363099
1784.7G86786616Q89659M28140M27186Q11577R17256P21216P36535P67171N97358O01888
1805.1G93684602P67708N39243J50621L58224P45654N27501R0659Q6903K42412J29819
1825.5G97323346j01626Q3924O77824O02543L2127R2268L27349j82212o35862Q9407
1845.9G98309088P28905L47853n5909R3758K30491n8711k09451O4910R3222m14372
$$ plain form
1715.3 731942594 731463015 732477546 733948529 734494746 734621823 735075951 735445082 735214233 735100210
1733.7 735100210 736596525 738652468 740193725 742047608 744640827 747082353 748948455 751264274
1750 751264274 754701138 757940292 760367870 762886941 765706658 768326759 770643055 772849858 774898708
1768.4 774898708 776367784 777649939 779753685 782045901 783443213 784257174 785423517 786786616
1784.7 786786616 787676275 788104415 788531601 789343178 790260434 790981650 791718185 792485356 793082714 793684602
1805.1 793684602 794452310 794991553 795142174 795500398 796246052 796773553 796864212 796951115 797193527 797323346
1825.5 797323346 797221720 797305644 797983468 798586011 798618138 798710406 799037755 798855543 798219681 798309088
1845.9 798309088 799037993 799385846 799329937 799423695 799654186 799595475 799386024 799450934 799544156 799129784
1866.3G99129784n25713K62559O48498J78099q3387J69873K11239p8022j05203J09196
1886.7G99916923M5776q1241Q4997K85387K23994k5630q583K34186J56701j45555p1346
1909.1H00615609K46107J63555k13205k46048R4235J08540o8188J17183K43365j6033
1929.5H01045120k03192k7538J34051p3135l44515k55465L8564P5221m8816K8848Q2255
1951.9H00451398j12414j99914j9372O1512j02520k04563r1076K2650n4836j06514
1972.3G99644351J1802K0086j33633j35839K0623k384j99795k36928j12295n6863r0957
1994.8G98728168q4579k3305p8500k04205j63913q0407j75595l04818k42829j55569
2015.2G97214448k61366l88801m11510o12379p25746j16288M89115L18229r2923k23637
$$ plain form
1866.3 799129784 798604071 798866630 799515128 799693227 799609840 799779713 799990952 799912930 799807727 799916923
1886.7 799916923 799962699 799881458 799966455 800251842 800475836 800450206 800441623 800675809 800832510 800686955 800615609
1909.1 800615609 800861716 801025271 800812066 800566018 800660253 800768793 800700605 800817788 801061153 801045120
1929.5 801045120 800841928 800814390 800948441 800875306 800530791 800275326 800313890 800389111 800340295 800369143 800451398
1951.9 800451398 800338984 800139070 800119698 800181210 800078690 799874127 799783051 799805701 799750865 799644351
1972.3 799644351 799656153 799676239 799542606 799406767 799427390 799425006 799225211 798988283 798875988 798819125 798728168
1994.8 798728168 798643589 798620284 798541784 798337579 798173666 798093259 797917664 797612846 797370017 797214448
2015.2 797214448 796953082 796564281 796152771 795540392 794814646 794698358 795187473 795505702 795412779 795189142
2035.6G95189142j07586o1929j64748j64210k7776J3828r2566j14381Q762M3094n9128
2058G94462502o3181M0233L9816l8743j0133Q3268N9545l3557O377R8765M3690m7981
2082.5G94640601r895N6029N006o4492j4663M7803k3961q9228m530N4121l0219q4400
2106.9G94482172j0133K1159o1988r6679k8432j0192p4506o5982K3484K6107n7578
2129.4G94147432m8995L0577K4498k6167O199O4611L0399p570O3181J23918Q1122M2081
2153.9G94531286Q6128J35601J12116R7752J46687J34826N2809J16528K99453L25144
2174.3G96038330K08616J57356J90139J96993J65940J75714K02656J70588J29939J63018
2194.6G97799289J91987J28388O8844J07586J52945J17422Q2314J25169J41085N5134
$$ plain form
2035.6 795189142 795081556 795019627 794854879 794690669 794662893 794676721 794584155 794469774 794478536 794521630 794462502
2058 794462502 794399321 794439554 794479370 794440627 794430494 794513762 794573307 794539750 794546127 794644892 794688582 794640601
2082.5 794640601 794630706 794686735 794691741 794627249 794612586 794660389 794636428 794547200 794542670 794596791 794566572 794482172
2106.9 794482172 794472039 794493198 794431210 794334531 794306099 794295907 794221401 794155419 794178903 794205010 794147432
2129.4 794147432 794098437 794129014 794153512 794127345 794133544 794198155 794228554 794220984 794284165 794408083 794489205 794531286
2153.9 794531286 794617414 794753015 794865131 794962883 795109570 795244396 795297205 795413733 795713186 796038330
2174.3 796038330 796246946 796404302 796594441 796791434 796957374 797133088 797335744 797506332 797636271 797799289
2194.6 797799289 797991276 798119664 798188508 798296094 798449039 798566461 798648775 798773944 798915029 798970163
2215G98970163K1994Q9049R4474L2365K8729O5625M9353k861O914Q0347P4387j4067
2239.5G99496472r54P7665N0128k0981P271Q3089O5744o55J5199P4386O4135J4961
2264G99926460L6120Q4996M9532l278K9623O1989J3530j1444N0068P5579P868k6882
2288.5H00294161J609n722m0352j7822M6432M6730l5703q2612m3690j1385k5749k3961
2312.9H00101936j3590n4240j02878r6738q1957r0956q4281o8844r0122j50680k22028
2335.4G99045622k57432k14219j78218j95682j62184K3782K37882K31445K6166r9361
2355.8G98457801j83880k67684j81020q8334k05934l04758j91689j16050j77741j86622
2376.2G96554089p0572Q344n6207r9957m3750n4657j63138j99199j19388r2745j79171
$$ plain form
2215 798970163 798992157 799081206 799175680 799208045 799236774 799302399 799351752 799348891 799355805 799436152 799510539 799496472
2239.5 799496472 799495518 799573183 799623311 799602330 799609601 799692690 799758434 799757779 799772978 799847364 799911499 799926460
2264 799926460 799962580 800047576 800097108 800093830 800123453 800185442 800198972 800187528 800237596 800313175 800321043 800294161
2288.5 800294161 800295770 800290048 800249696 800231874 800278306 800325036 800289333 800206721 800163031 800151646 800125897 800101936
2312.9 800101936 800088346 800034106 799931228 799834490 799752533 799661577 799577296 799508452 799418330 799267650 799045622
2335.4 799045622 798788190 798573971 798395753 798200071 798037887 798061669 798299551 798530996 798557162 798457801
2355.8 798457801 798273921 798006237 797825217 797736883 797530949 797226191 797034502 796918452 796740711 796554089
2376.2 796554089 796483517 796491861 796435654 796335697 796291947 796237290 796074152 795874953 795755565 795662820 795483649
2398.6G95483649k12133j66476j97470k79665k46167j43469j65164k76268k79724k08378
2419G93308735k38836l16620k78532j86265k19881l28601k98559j85490k19226l18170
2439.4G90718555k68816j72079k24888l29733k99096k24531k69055l12329k25961j61886
2459.8G88230181k35856k90394k18272j98066k98202l00527j70767j48892k73228l02434
2480.2G85793543j91748j72556k77161k84016j65225j50024k75970k93314j64867j50740
2500.6G83667922k73526k66850j33991j42217k59995k37107j36793j76787k65777k05875
2521G81569004j03116j70350k99454k62618j54614j85311k58505j97828j31607k22028
2541.4G79583573l13401k38895j59800k23935k59340j61350j25646k23935k69234k02477
$$ plain form
2398.6 795483649 795271516 795105040 794907570 794627905 794381738 794238269 794073105 793796837 793517113 793308735
2419 793308735 793069899 792753279 792474747 792288482 792068601 791740000 791441441 791255951 791036725 790718555
2439.4 790718555 790449739 790277660 790052772 789723039 789423943 789199412 788930357 788618028 788392067 788230181
2459.8 788230181 787994325 787703931 787485659 787287593 786989391 786688864 786518097 786369205 786095977 785793543
2480.2 785793543 785601795 785429239 785152078 784868062 784702837 784552813 784276843 783983529 783818662 783667922
2500.6 783667922 783394396 783127546 782993555 782851338 782591343 782354236 782217443 782040656 781774879 781569004
2521 781569004 781465888 781295538 780996084 780733466 780578852 780393541 780135036 779937208 779805601 779583573
2541.4 779583573 779270172 779031277 778871477 778647542 778388202 778226852 778101206 777877271 777608037 777405560
2561.8G77405560j79410k67029k90453j72973j36971k49803k90633k14278k02418k78949
2582.2G75122643k61069j54018j90377l29495l12626j95623k11656l09408k85267j89841
2602.6G72683263k30611l57925l57211k70963k92241l80755l52084k57791l03208m22299
2623G69458175m13657l55541m18306m75824l74138k85923l69847m59254m17948l84748
2643.4G65502989m44531m49658l36289l01123m33921n02408l99828l43323m09424l95596
2663.7G61486888k70367k71439m27485m70161l58999l43919m30584m05490k94388l04281
2684.1G57909775m28796m39763l15666k97964l96967l74317k89977l63528m91441m56869
2704.5G54054487l58761m13894m82202l93390l12686l69072m44115m14013l58820l84689
$$ plain form
2561.8 777405560 777226150 776959121 776668668 776495695 776358724 776108921 775818288 775604010 775401592 775122643
2582.2 775122643 774861574 774707556 774517179 774187684 773875058 773679435 773467779 773158371 772873104 772683263
2602.6 772683263 772452652 772094727 771737516 771466553 771174312 770793557 770441473 770183682 769880474 769458175
2623 769458175 769044518 768688977 768270671 767794847 767420709 767134786 766764939 766305685 765887737 765502989
2643.4 765502989 765058458 764608800 764272511 763971388 763537467 763035059 762635231 762291908 761882484 761486888
2663.7 761486888 761216521 760945082 760517597 760047436 759688437 759344518 758913934 758508444 758214056 757909775
2684.1 757909775 757480979 757041216 756725550 756427586 756030619 755656302 755366325 755002797 754511356 754054487
2704.5 754054487 753695726 753281832 752799630 752406240 752093554 751724482 751280367 750866354 750507534 750122845
2724.9G50122845m06265l37184k95460l80397m28080l40343l03864l64959l41118k21908
2745.3G46703267k04682l35157m11093l41118l05235l82900l82185k73526k78771l91901
2765.7G43396699l91125l00229l21746m13120l94642l20256l92556n32388m95971l75449
2786.1G39459217m26293n70476n65231n14447o08683p06494o87599o95825p95066q15272
2806.5G33073831p02560p08580r21071j023591r16004q83817j017630j089335j038670
2824.9G24772573j081467j252771j340925j309395j351178j477301j603842j805544
2841.2G13550150k136409k524316k696336k389788j737416j100004o65962m72069n59509
2859.5F99268341q18670j020312j166344j352012j413107j277745j278758j482010
$$ plain form
2724.9 750122845 749716580 749379396 749083936 748703539 748275459 747935116 747631252 747266293 746925175 746703267
2745.3 746703267 746498585 746163428 745752335 745411217 745105982 744723082 744340897 744067371 743788600 743396699
2765.7 743396699 743005574 742705345 742383599 741970479 741575837 741255581 740863025 740330637 739834666 739459217
2786.1 739459217 739032924 738462448 737897217 737382770 736774087 736067593 735379994 734684169 733889103 733073831
2806.5 733073831 732371271 731662691 730741620 729718029 728802025 727918208 726900578 725811243 724772573
2824.9 724772573 723691106 722438335 721097410 719788015 718436837 716959536 715355694 713550150
2841.2 713550150 711413741 708889425 706193089 703803301 702065885 700965881 700299919 699827850 699268341
2859.5 699268341 698449671 697429359 696263015 694911003 693497896 692220151 690941393 689459383
2875.9F89459383j506984j317620j183569j156450j085996r40621q85725r03786q48531
2894.2F79630101p82907q01564q18073p64132p58886r13918j120329j267016j508117
2912.6F70895159j904189k092243j777529j221419p94828m71532o8247L03566M46260
2930.9F63314998N74172Q93652J206041J379728J571774J817286J878321J682580J535535
2949.3F75854087J580357J523912J308024J231432J317203J358331J323878J312137
2965.6F86809361J338065J348555J346767J366436J393855J443505J488805J421094
2981.9F97956443J291156J207173J129746J060903R23634O15954L93331L31044K08855
3000.3G05118239O1095l8922p2360m947N0068m5956k55882m33624n19633n44429n28992
$$ plain form
2875.9 689459383 687952399 686634779 685451210 684294760 683208764 682268143 681382418 680478632 679630101
2894.2 679630101 678847194 678045630 677227557 676463425 675704539 674790621 673670292 672403276 670895159
2912.6 670895159 668990970 666898727 665121198 663899779 663104951 662633419 662565172 662868738 663314998
2930.9 663314998 663889170 664782822 665988863 667368591 668940365 670757651 672635972 674318552 675854087
2949.3 675854087 677434444 678958356 680266380 681497812 682815015 684173346 685497224 686809361
2965.6 686809361 688147426 689495981 690842748 692209184 693603039 695046544 696535349 697956443
2981.9 697956443 699247599 700454772 701584518 702645421 703569055 704185009 704578340 704909384 705118239
3000.3 705118239 705179334 705140412 705068052 705063105 705113173 705067217 704811335 704377711 703858078 703313649 702784657
3022.7G02784657n64634o76394o64472n48304n68568p33972q54254p76767o75261p83980
3043.1F95938051r77040j055836r94742r53973j020908j061678j092672j122952j037597
3061.5F86620653r26912r01461j000523j152575j172722j051783q62122p70330r28164
3079.8F77854061j109063j144529j187205j214624j185953j210571j224100j162291
3096.1F68415725j085579j104832j227975j246094j105488j048982j197040j225412
3112.4F59174323j016855r78470j200795j461625j620889j548171j335681j219868
3128.8F48791969j268804j375735j361609j210987j185238j398981j540899j460553
3145.1F37989163j356363j256406j195908j356423j591742j626372j522064j445771
$$ plain form
3022.7 702784657 702220023 701543629 700879157 700330853 699762285 699028313 698174059 697397292 696722031 695938051
3043.1 695938051 694961011 693905175 692910433 691956460 690935552 689873874 688781202 687658250 686620653
3061.5 686620653 685693741 684792280 683791757 682639182 681466460 680414677 679552555 678782225 677854061
3079.8 677854061 676744998 675600469 674413264 673198640 672012687 670802116 669578016 668415725
3096.1 668415725 667330146 666225314 664997339 663751245 662645757 661596775 660399735 659174323
3112.4 659174323 658157468 657178998 655978203 654516578 652895689 651347518 650011837 648791969
3128.8 648791969 647523165 646147430 644785821 643574834 642389596 640990615 639449716 637989163
3145.1 637989163 636632800 635376394 634180486 632824063 631232321 629605949 628083885 626638114
3161.4F26638114j457452j499296j486301j456499j462162j481890j472414j446426
3177.7F14875674j452982j502633j539886j527489j479208j459360j505196j526356
3194F02882564j515388j530528j505435j430929j413643j455188j484990j477778j451731
3212.4E89616954j440882j399458j350045j380086j427293j419186j390517j354337
3228.7E78455150j245260j160383j304865j480758j421690j281977j213133j174450
3245E68172634j187265j269281j284480j158178j051366j120806j222968j193285j098275
3263.4E57586730j008928r01640q03113r08017j157582j253605j190424j092553j028239
3281.7E48242629j018167j012444r58145q58247q59440j019537j140833j175761j166225
$$ plain form
3161.4 626638114 625180662 623681366 622195065 620738566 619276404 617794514 616322100 614875674
3177.7 614875674 613422692 611920059 610380173 608852684 607373476 605914116 604408920 602882564
3194 602882564 601367176 599836648 598331213 596900284 595486641 594031453 592546463 591068685 589616954
3212.4 589616954 588176072 586776614 585426569 584046483 582619190 581200004 579809487 578455150
3228.7 578455150 577209890 576049507 574744642 573263884 571842194 570560217 569347084 568172634
3245 568172634 566985369 565716088 564431608 563273430 562222064 561101258 559878290 558685005 557586730
3263.4 557586730 556577802 555676162 554873049 553965032 552807450 551553845 550363421 549270868 548242629
3281.7 548242629 547224462 546212018 545253873 544395626 543536186 542516649 541375816 540200055 539033830
3300.1E39033830j028240q59260r43065j269102j505673j518190j422643j337171j315057
3318.4E27835429j325965j299143j279116j388728j532674j554072j507044j397252
3334.8E16551435j264632j359403j575231j596272j535774j480281j358986j403987
3351.1E04976869j634539j694500j558244j409888j350821j358240j245261j105785
3367.4D93619591j267582j618862j675845j389056j165390j153618j219124j195907
3383.7D82934207j052827q61823o62029p00295j003593j050294o80864m55439p85053
3402.1D75681990j156926r84549o47843n55009n84245o47574o60748n55634m70907
3420.4D69418555m07189k46375o6162K7985J1831M3869J48237L6270k08736j98096
$$ plain form
3300.1 539033830 538005590 537146330 536203265 534934163 533428490 531910300 530487657 529150486 527835429
3318.4 527835429 526509464 525210321 523931205 522542477 521009803 519455731 517948687 516551435
3334.8 516551435 515286803 513927400 512352169 510755897 509220123 507739842 506380856 504976869
3351.1 504976869 503342330 501647830 500089586 498679698 497328877 495970637 494725376 493619591
3367.4 493619591 492352009 490733147 489057302 487668246 486502856 485349238 484130114 482934207
3383.7 482934207 481881380 481019557 480357528 479657233 478653640 477603346 476922482 476467043 475681990
3402.1 475681990 474525064 473540515 472892672 472337663 471753418 471105844 470445096 469889462 469418555
3420.4 469418555 469011366 468764991 468698829 468726814 468738645 468782514 468930751 468967021 468758285 468560189
3440.8D68560189M7266K64735L59982L93003M48525M97669N45502O44326P30306P06911
3461.2D73198414P43210R74357J083762Q43435N55516N84244Q06362J028090J081139
3479.6D80898529Q82387Q48711J070768J118183J035720J093328J209557J278490J248598
3497.9D90684271J216471J265466J186043J070023J190543J435339J611054J528472
3514.2E01187682J284719J266896J477123J624465J528382J430809J547635J674116
3530.6E13021827J734376J831889J833320J717269J775145J925946J892507J724839
3546.9E27457118J749635J932621J976669J973509K071560K164602K092779J901805
3563.2E43320298J892567K265751K678156K717555K568781K524078K571046K652943
$$ plain form
3440.8 468560189 468607455 468872190 469232172 469625175 470073700 470571369 471116871 471761197 472491503 473198414
3461.2 473198414 473941624 474915981 475999743 476843178 477398694 477982938 478789300 479817390 480898529
3479.6 480898529 481780916 482629627 483700395 484818578 485854298 486947626 488157183 489435673 490684271
3497.9 490684271 491900742 493166208 494352251 495422274 496612817 498048156 499659210 501187682
3514.2 501187682 502472401 503739297 505216420 506840885 508369267 509800076 511347711 513021827
3530.6 513021827 514756203 516588092 518421412 520138681 521913826 523839772 525732279 527457118
3546.9 527457118 529206753 531139374 533116043 535089552 537161112 539325714 541418493 543320298
3563.2 543320298 545212865 547478616 550156772 552874327 555443108 557967186 560538232 563191175
3579.5E63191175K730012K660096K473056K465547K811014L012121K907216K922893
3595.8E85173130L135562L183842L030002K875864K734125K696812K843559L044784
3612.1F08717680L084481K947032K940059L230214L332257K863348K393603K549291
3628.5F32057965L108978L363431L236651L003716K871454K728582K445817K089083
3644.8F54905677J895308K226115K850592L041208K915501K782762K760470K573073
3661.1F75950706K127826J761973J542747J471043J528442J639247J755774K146661
3677.4F89924419K502680K238929J739621J454055J249135J038551J310468J743019
3693.7G03200877J628220J141250Q02755Q35300R90450Q73566M83394K94029N38767
$$ plain form
3579.5 563191175 565921187 568581283 571054339 573519886 576330900 579343021 582250237 585173130
3595.8 585173130 588308692 591492534 594522536 597398400 600132525 602829337 605672896 608717680
3612.1 608717680 611802161 614749193 617689252 620919466 624251723 627115071 629508674 632057965
3628.5 632057965 635166943 638530374 641767025 644770741 647642195 650370777 652816594 654905677
3644.8 654905677 656800985 659027100 661877692 664918900 667834401 670617163 673377633 675950706
3661.1 675950706 678078532 679840505 681383252 682854295 684382737 686021984 687777758 689924419
3677.4 689924419 692427099 694666028 696405649 697859704 699108839 700147390 701457858 703200877
3693.7 703200877 704829097 705970347 706773102 707608402 708598852 709472418 709955812 710249841 710788608
3712.1G10788608J023173J196802Q44419L84509J78456L24667N23686M93586J84298
3730.4G15942204k16067j37210M83573Q11338N32448q2135n45025J729N01513L23117
3750.8G17615485N73397R43661P16865L57628L33130M38094K69771N5611P1406L12150
3771.2G21687198N65350L92794L9399o6340P5519K07544K29239L19719L29495R5010
3791.6G23874927j40012k41935k22802k23518l15725J10268M81129K96891L43561L57091
3812G24319875o7055o09756n35547j03534J63436N54383N37277J77741q8037k96533
3832.4G24052250k13682j76251l57688q762N24819N99921L17574j96875p19785j013339
3852.8G22808182l37422Q16167Q80539K06828l20494l61800j12891o7652j03235K12372
$$ plain form
3712.1 710788608 711811781 713008583 713853002 714237511 714415967 714740634 715264320 715757906 715942204
3730.4 715942204 715726137 715588927 716072500 716883838 717416286 717334151 716789126 716790855 717292368 717615485
3750.8 717615485 718188882 719132543 719849408 720207036 720540166 720978260 721248031 721303642 721375048 721687198
3771.2 721687198 722252548 722645342 722684741 722618401 722693920 722901464 723130703 723450422 723779917 723874927
3791.6 723874927 723734915 723492980 723270178 723046660 722730935 722841203 723322332 723619223 723962784 724319875
3812 724319875 724252820 723643064 723107517 723003983 723167419 723721802 724259079 724436820 724348783 724052250
3832.4 724052250 723838568 723662317 723304629 723295867 723820686 724420607 724738181 724541306 723821521 722808182
3852.8 722808182 722470760 723286927 724167466 724374294 724053800 723692000 723579109 723511457 723408222 723620594
3873.2G23620594L89576K18272j98007l63588P3015J49966j3531P7606Q94n722M6313
3895.6G23995388k55049n83768m81605p4923L94225O27935L86834k8789k24054k76506
3916G23479688k57134q9050N3823N246r3460j00494r8944l3736J03235P5043o7115
3938.5G22977102j56224k12908j28627M0234K6285l8922L219L4392j5676j04427j39773
3960.9G22284675p9394o55k6405j04785j29223j28210r7274j6332J8597k6465n7816
3983.3G21636713o8784p8082r5308j15931k4557N3405o5743
3997.6G21241713
$$ plain form
3873.2 723620594 724010170 724228442 724030435 723666847 723739862 723889828 723876297 723953903 723954797 723949075 723995388
3895.6 723995388 723740339 723156571 722674966 722600043 722994268 723622203 724009037 723980248 723756194 723479688
3916 723479688 723222554 723133504 723187327 723192573 723099113 722998619 722899675 722865939 722969174 723044217 722977102
3938.5 722977102 722820878 722607970 722479343 722519577 722545862 722506940 722510159 722544551 722528875 722424448 722284675
3960.9 722284675 722205281 722204626 722178221 722073436 721944213 721816003 721718729 721702397 721720994 721694529 721636713
3983.3 721636713 721567929 721489847 721394539 721278608 721254051 721307456 721241713
3997.6 721241713
##END=$$ End of the data block
