##TITLE=Casca de arroz - 2 $$ Begin of the data block
##JCAMP-DX=5.00 $$ ACD/SpecManager v 10.08
##SPECTROMETER/DATA SYSTEM=Alpha
##DATE=26 May 2015 09:43:50
##DATA TYPE=INFRARED SPECTRUM
##DATA CLASS=XYDATA
##ORIGIN=
##OWNER=
##NPOINTS=1765
##FIRSTX=399.76428223
##LASTX=3997.64306641
##MAXX=3997.64306641
##MINX=399.76428223
##MAXY=0.84770554
##MINY=0.49975124
##XFACTOR=1.0000000000
##YFACTOR=1.000000000000000e-9
##FIRSTY=0.71620458
##DELTAX=2.03961372
##XUNITS=1/CM
##YUNITS=ARBITRARY UNITS
##XYDATA=(X++(Y..Y))
399.8G16204584j542688m0054j713038k625107j94908R14693j249492k044618q2135
418.1G07627237K47657k456784l442764j461804k03669k057672l398001j484990P7307
436.5F93446517j220226k238512p75576N51105r29773k447963p86901J051903l39627
454.8F86310947k343535j687229J46508k42174j888275j265287Q82506R35078p09474
473.2F80139065k54452K075433K623618J238763J223684L010571L332138J677572J093507
491.5F96159899K412200K774954J013339j79172P82251J581014K45213j267135p48336
509.9G02774227K23279n84782j848101j370847j08958l61263j341641q24392O05464
528.3F97162986P50422k9444L29971J626670J757443N33760j05202M49061N72979m68373
$$ y = [716204584, 714661896, 714621842, 712908804, 710283697, 710088789, 711003482, 709753990, 707709372, 707627237, 707874894, 705418110, 701975346, 700513542, 700309873, 698252201, 694854200, 693369210, 693446517, 692226291, 689987779, 689212203, 689763308, 688833535, 686385572, 685598671, 686650574, 686310947, 683967412, 682280183, 682426691, 682184517, 680296242, 679030955, 679913461, 680848539, 680139065, 679884613, 681960046, 684583664, 685822427, 687046111, 690056682, 693388820, 695066392, 696159899, 698572099, 701347053, 702360392, 702181220, 702963471, 704544485, 704789698, 703522563, 702774227, 702997506, 702412724, 700564623, 699193776, 699084818, 698723555, 697381914, 696557522, 697162986, 697913408, 697883964, 698213935, 699840605, 701598048, 702131808, 702026606, 702475667, 703048646, 702580273]
548.7G02580273j144230o12915k76744r71317j489938j005590n46157r25601j566708
567F94041073j683175j293719r57966o60598K4676R81271J608909J713752J712203
585.4F95486426J967430K002538J315474M95196K79247M70221M01676J3232j04665
603.7G02326775J86741M47631N77926P89106J113832J365364J513779J715839K006173
622.1G12043166K281845K227604J720190J238287J239061J379788J079142O05464O03318
640.4G24417865Q94606Q29399M31895L54588Q07524R67205L92258K0087M54902Q21829
660.8G30392158L82900k04265K3425J232087J373172P51496R94205J815021J818299
679.2G38578498R20773O00755J243115J367032L74317k38597K93314N43595l89695
$$ y = [702580273, 701436043, 700823128, 700546384, 699575067, 698085129, 697079539, 696533382, 695607781, 694041073, 692357898, 691064179, 690106213, 689445615, 689470291, 690451562, 692060471, 693774223, 695486426, 697453856, 699456394, 700771868, 701267064, 701546311, 702016532, 702418208, 702431440, 702326775, 702513516, 702961147, 703539073, 704328179, 705442011, 706807375, 708321154, 710036993, 712043166, 714325011, 716552615, 718272805, 719511092, 720750153, 722129941, 723209083, 723814547, 724417865, 725312471, 726141870, 726573765, 726928353, 727735877, 728703082, 729095340, 729115427, 729570329, 730392158, 730775058, 730570793, 730594218, 731826305, 733199477, 733950973, 734945178, 736760199, 738578498, 739499271, 740100026, 741343141, 742710173, 743084490, 742845893, 743139207, 743682802, 743293107]
697.5G43293107j152277n72741K56419l7670n41330K74956J601339J675010R28163
715.9G45724976J156926K351940K626836J547456J103938K034008K432466J301407
732.2G60279953L98636R94683J568973N86927p04170m43935L62754l02017j642406
750.6G61099398j552462m63486m10378j312018j140117M10199J302302P27534M29213
768.9G59090185J473785K225935J327992L02791Q90136J897693J361847J57713M04597
787.3G69132674J608252J554907M06265L93987J667142K026796R27567M31359J421690
805.6G79570639K009988J020193J49727Q54611J751900J146138N8532K97725J098633
824G87958086N84244p63774r77039q9169M0412q15630r21964J52886P29441m3153o72818
$$ y = [743293107, 742140830, 741568089, 741824508, 741786838, 741245508, 741520464, 743121803, 744796813, 745724976, 746881902, 749233842, 751860678, 753408134, 754512072, 756546080, 758978546, 760279953, 760678589, 761673272, 763242245, 763829172, 763125002, 762681067, 763043821, 762741804, 761099398, 759546936, 759083450, 758673072, 757361054, 756220937, 756631136, 757933438, 758660972, 759090185, 760563970, 762789905, 764117897, 764420688, 765310824, 767208517, 768570364, 768728077, 769132674, 770740926, 772295833, 772702098, 773096085, 774763227, 776790023, 777717590, 778148949, 779570639, 781580627, 782600820, 782750547, 783605158, 785357058, 786503196, 786561728, 786859453, 787958086, 788542330, 787778556, 786801517, 786712348, 786752760, 785937130, 785015166, 785168052, 785897493, 785854340, 785181522]
846.4G85181522j5258P02858J78098o71208m04477M57049N20289P6353N17190J687646
866.8G88230062K037465J223743N88715P77006O82295m16041j498520j656890j633942
885.2G88333893k336621l143013k953112k057552j616836j705945j387298n92053l12388
903.5G72229075r13381j591265j697183j729369k297104k918362k818823k259016k050757
921.9G53953815k176226j911521j136064o14643p29919p68304j43587N03421L79741
940.3G47356713j49250l35932l82364j024067k209246l057599l213466l416061m121125
958.6G29447603m670560m569590m402757m865587n618155n930423o007255o640136
974.9F86743140p742166q356393q229434q111358q270204p995605o929756n784750
$$ y = [785181522, 785166264, 785869122, 786047220, 785376012, 784971535, 785428584, 785948873, 786025226, 786542416, 788230062, 790267527, 791491270, 792079985, 792856991, 793539286, 793123245, 791624725, 789967835, 788333893, 785997272, 782854259, 779901147, 777843595, 776226759, 774520814, 773133516, 772541463, 772229075, 771315694, 769724429, 768027246, 766297877, 764000773, 761082411, 758263588, 756004572, 753953815, 751777589, 749866068, 748730004, 748115361, 747385442, 746617138, 746473551, 746976972, 747356713, 747207463, 746871531, 746489167, 745465100, 743255854, 740198255, 736984789, 733568728, 729447603, 724777043, 720207453, 715804696, 710939109, 705320954, 699390531, 693383276, 686743140, 679000974, 670644581, 662415147, 654303789, 646033585, 638037980, 631108224, 625323474]
991.3F25323474n227208m868746m089713l217697k994716l293931l394187l347456
1007.6E94889820l854275m854798n385220m976511m286707l858566l210664j951158
1023.9E62511921o79851q8870M9591L54111P38382O72639K37822J41740N87583R11355
1044.3E65436423P33495O79850J283586K025902K319158K549588L292859M138052M189730
1062.6E86648643L284335J943410J99139k227724m483640n059183l698110j633406
1079E74973464L8922J329183K565146L390968L306687K677738K234340J940906J276016
1097.3E93733370M49300K46763P46966J244426J427233J731395K419115K970755K875387
1115.7F07844710K500177K480805K698183K642691K463519K720416L291428L320396
$$ y = [625323474, 620096266, 615227520, 611137807, 607920110, 604925394, 601631463, 598237276, 594889820, 591035545, 586180747, 580795527, 575819016, 571532309, 567673743, 564463079, 562511921, 561832070, 561743200, 561792791, 562146902, 562885284, 563557923, 563795745, 563937485, 564525068, 565436423, 566169918, 566849768, 568133354, 570159256, 572478414, 575028002, 578320861, 582458913, 586648643, 589932978, 591876388, 592075527, 589847803, 585364163, 580304980, 576606870, 574973464, 575012386, 576341569, 578906715, 582297683, 585604370, 588282108, 590516448, 592457354, 593733370, 594182670, 594429433, 595176399, 596420825, 597848058, 599579453, 601998568, 604969323, 607844710, 610344887, 612825692, 615523875, 618166566, 620630085, 623350501, 626641929, 629962325]
1132F29962325K480686J395583M74632n65946j843036k799928k968609k638757k292872
1150.3F21204078j805365p51674P04348J978695K926231L898263M997194N782723N998075
1168.7F44932568O032944O250143O378114N992293N299151M833043M578650M067004
1185F88363910L219425K493084K094388J623392Q27610J40846K2769K71619M06801
1203.4F99463844M50909P58231J240373J385987J051127P30873P20024O16789J07705
1221.7G06525862l82900l89695j90735k88785n23448l45110J77323M20154K64525L01897
1242.1G05569088P85590J159012J032710Q42273J061857J335323J119971P23005Q14855
1260.5G14443684J257360J318156R84669R85026J452089J672268J353204J154721J481354
$$ y = [629962325, 632443011, 633838594, 634313226, 633747280, 631904244, 629104316, 626135707, 623496950, 621204078, 619398713, 618647039, 619351387, 621330082, 624256313, 628154576, 633151770, 638934493, 644932568, 650965512, 657215655, 663593769, 669586062, 674885213, 679718256, 684296906, 688363910, 691583335, 694076419, 696170807, 697794199, 698621809, 698762655, 698785424, 699057043, 699463844, 699914753, 700672984, 701913357, 703299344, 704350471, 705081344, 705801368, 706418157, 706525862, 706142962, 705753267, 705562532, 705273747, 704750299, 704405189, 704582512, 705002666, 705267191, 705569088, 706354678, 707513690, 708546400, 709388673, 710450530, 711785853, 712905824, 713628829, 714443684, 715701044, 717019200, 718003869, 718988895, 720440984, 722113252, 723466456, 724621177, 726102531]
1278.8G26102531J719713J376212R69112J085579J344383J028418L98040K77639N86271
1297.2G34887898N02288m6551k25484J87397L20613k35617o70135m49061j79649m69506
1317.6G33622193r10759p58052l05712m20332r39727r27507l46780m8518j97530j02759
1338G28664517M25518O74128L18409k5392J36971K72036k25425q02457p11203l15249
1358.4G28411853m67121j190841j479149r41038n77629o47009m11987J35005L87430
1376.7G23219514J99914j6093N27739J938582K846598K334357J764655J787781J280368
1395.1G35883415K84672j85490j19805q7440n11826q27252n45681l94165o50764o12020
1415.5G32233644j99199k84374o66559n20885j7166O23286Q81433P29561J013518J529276
$$ y = [726102531, 727822244, 729198456, 730167568, 731253147, 732597530, 733625948, 734023988, 734301627, 734887898, 735390186, 735343635, 735118151, 735305548, 735626161, 735390544, 734720409, 734271348, 734091699, 733622193, 732711434, 731953382, 731647670, 731227338, 730287611, 729360104, 729013324, 728964806, 728767276, 728664517, 729090035, 729764163, 730082572, 730057180, 730194151, 730466187, 730240762, 729438305, 728727102, 728411853, 727944732, 726753891, 725274742, 724333704, 723756075, 723109066, 722697079, 722832084, 723219514, 723419428, 723403335, 723931074, 725869656, 728716254, 731050611, 732815266, 734603047, 735883415, 736168087, 735982597, 735862792, 735775352, 735263526, 734436274, 733890593, 733496428, 732845664, 732233644, 732034445, 731750071, 731083512, 730562627, 730545461, 731168747, 732050180, 732779741, 733793259, 735322535]
1435.9G35322535J118362L55482K58863L65973K37286l59476q34703m72069L85523
1454.3G36377776O91592l27050o24001M37975J439154J893520K673686M209101N398691
1472.6G52170444M748225L648400L307164L199935K925276K568543K381444J852155
1488.9G76801586P27952J13427K15352j19805r59397j140952m76003R6500r71019k067745
1509.3G72219896j547753o09100O41346J888632K793909L145813K481223J933097J620710
1527.7G84567773J274646J383245J288294J072884J593947J633227J49429m98116l34084
1546G92131245O557M51922Q61228J197695J566291J367569o09338j177013n01692j41681
1566.4G95152783r179n01752r15229q98778j641393k314806k322137k568424k653659
$$ y = [735322535, 736440897, 736796379, 737055242, 737421215, 737658501, 737299025, 736464322, 735992253, 736377776, 737069368, 736742318, 736118317, 736556292, 737995446, 739888966, 742562652, 746771753, 752170444, 756918669, 760567069, 763874233, 767074168, 769999444, 772567987, 774949431, 776801586, 777529538, 777642965, 777858317, 777738512, 776779115, 775638163, 775162160, 775258660, 774287641, 772219896, 770672143, 770063043, 770704389, 772593021, 775386930, 778532743, 781013966, 782947063, 784567773, 785842419, 787225664, 788513958, 789586842, 791180789, 792814016, 792963445, 792465329, 792131245, 792137802, 792589724, 793450952, 794648647, 796214938, 797582507, 796973169, 795796156, 795294464, 795152783, 795143604, 794641852, 793726623, 792827845, 791186452, 788871646, 786549509, 783981085, 781327426]
1584.8G81327426k435147k418220k701760k780139k614439k671957l090143l439605
1601.1G59176016l272057k739608k402842k422035k295553j915455k273262l674745
1617.4G38180459l565789k552986k777696l332316l180385k543807j364887k63095
1633.7G18599498k22921n48720K4437P60556J410365K089441K003431J776636K360046
1652.1G28252769J876652R25898J564920K401531K841294K936899L078640L408194
1668.4G47286797L113031K742112L084361K798200K213001K705634L591835L075898
1684.7G70610869J340151J253187J979292K355039K453983K124429K008557J585305
1701.1G85710812N94258L86834M48227N13613O45519P64369R80795O59704m60923q09490
$$ y = [781327426, 778892279, 776474059, 773772299, 770992160, 768377721, 765705764, 762615621, 759176016, 755903959, 753164351, 750761509, 748339474, 746043921, 744128466, 741855204, 738180459, 734614670, 732061684, 729283988, 725951672, 722771287, 720227480, 718862593, 718599498, 718376577, 717827857, 717852294, 718612850, 720023215, 722112656, 724116087, 725892723, 728252769, 730129421, 731055319, 732620239, 735021770, 737863064, 740799963, 743878603, 747286797, 750399828, 753141940, 756226301, 759024501, 761237502, 763943136, 767534971, 770610869, 771951020, 773204207, 775183499, 777538538, 779992521, 782116950, 784125507, 785710812, 786305070, 786691904, 787140131, 787653744, 788299263, 789063632, 790044427, 790704131, 790243208, 789433718]
1721.5G89433718l19779K85268O56545P20739R30071J232803Q69453Q07762J317739
1739.8G95934319J753688K158225K368689K333700K337218K271473K084851J999557
1756.1H13241720K025545K264500K234518J642823J580060K049684K197326J484990
1772.4H28721166N16951N83946J106143J061857O56367O07728Q41141J064360J034260
1790.8H36193919N67019L16084N68866N70119K69353K68221M85063M83691L59595L40879
1811.2H40422809L57151K96652J45734J95086N27024O60300L57449K24293L34978P5400
1831.6H43596876j70291p5400J44244L87191N36681K90393j47938j38641m5597j27912
1852H44249606o4552J55092J96516J7643m4227K20955N04672K44737l23355l09169
$$ y = [789433718, 789113939, 789399207, 790055752, 790776491, 791706562, 792939365, 793808818, 794616580, 795934319, 797688007, 799846232, 802214921, 804548621, 806885839, 809157312, 811242163, 813241720, 815267265, 817531765, 819766283, 821409106, 822989166, 825038850, 827236176, 828721166, 829238117, 829822063, 830928206, 831990063, 832646430, 833254158, 834095299, 835159659, 836193919, 836760938, 837077022, 837645888, 838216007, 838485360, 838753581, 839238644, 839722335, 840081930, 840422809, 840779960, 841076612, 841222346, 841417432, 841944456, 842604756, 842962205, 843186498, 843521476, 843596876, 843426585, 843351185, 843495429, 843882620, 844419301, 844709694, 844561756, 844423115, 844377518, 844249606, 844185054, 844340146, 844536662, 844554305, 844510078, 844731033, 845235705, 845480442, 845157087, 844847918]
1872.4H44847918N1975R4354n0604j3411J39057J42276P7665R3103Q6188P4089J4603
1894.8H45557213q3566j2815J12295O3956j132Q9109J57296L7074o0498Q2016K02357
1917.3H46143305N9724q1718j19149j10746j2934Q345p1586p2181n185J2576L6419
1939.7H45786870O4909k5451j08063j08481j00970n8055O676k623p3314p1048L1292
1962.1H45341742J11461K6822j26362j17838j1266j4662r1851q3506K920K9266o2704
1984.6H45004022j17659j3590N4896j09077k41220j24693L159n1141j66177j44840
2005H44093680l8325n4419k01762k26438o6698n2810l30209n88656p38680o18339J4067
2027.4H41191411M12226K45630J06454N96j60634j49667l517J19j72257k14994o974
$$ y = [844847918, 844899893, 844994247, 844943643, 844930232, 845069289, 845211565, 845289230, 845382333, 845468521, 845542610, 845557213, 845473647, 845460832, 845573127, 845637083, 845635951, 845725060, 845882356, 845919430, 845858932, 845940948, 846143305, 846203029, 846121311, 846002162, 845891416, 845878482, 845886827, 845815241, 845743060, 845737875, 845750451, 845786870, 845851779, 845826328, 845718265, 845609784, 845508814, 845450759, 845457435, 845454812, 845381498, 845310450, 845341742, 845453203, 845480025, 845353663, 845235825, 845224559, 845209897, 845118046, 845034540, 845037460, 845066726, 845004022, 844886363, 844872773, 844927669, 844818592, 844577372, 844452679, 844455838, 844404697, 844238520, 844093680, 844055355, 844000936, 843799174, 843572736, 843506038, 843453228, 843123019, 842534363, 841795683, 841177344, 841191411, 841603637, 841849267, 841955721, 841956317, 841795683, 841646016, 841642499, 841642618, 841470361, 841255367, 841248393]
2049.8H41248393J19567k8968j47581k503J47283L0815j30951m5657J44303J09613
2070.2H41444314p5102o6579J18196J40190n0544r9659J01566J90914m709j37329L2544
2092.7H41593802J92285M3988j45257l3378J68502R4056j22845j11342R6262J33991
2113.1H41910064p4863j53840M6373J54256k0325j30951L4928J61708Q821j65641n6386
2135.5H41714144J61588J35183p0929p9513J30415J75059j9610p6830J31070K34187
2155.9H42434764O0558m6968J22368K63572J07825p6235P4566L53574L15130P4327
2176.3H43683481O1155K29597K20775O9082O4552J99377K41638J26302N2214J41561
2196.7H45089734K09212J09553K2412J13606K14398J32918P570M2260J58012J47164
$$ y = [841248393, 841367960, 841338992, 841191411, 841188908, 841336191, 841367006, 841236055, 841190398, 841334701, 841444314, 841369212, 841302633, 841420829, 841561019, 841510475, 841410816, 841512382, 841703296, 841698587, 841561258, 841593802, 841786087, 841830075, 841684818, 841651440, 841819942, 841913998, 841791153, 841679811, 841776073, 841910064, 841835201, 841681361, 841727734, 841881990, 841861665, 841730714, 841765642, 841927350, 841936171, 841770530, 841714144, 841875732, 842010915, 841939986, 841860473, 841990888, 842165947, 842146337, 842069507, 842200577, 842434764, 842495322, 842448354, 842570722, 842834294, 842942119, 842865884, 842940450, 843294024, 843609154, 843683481, 843744636, 843974233, 844195008, 844264090, 844328642, 844528019, 844769657, 844895959, 844948173, 845089734, 845298946, 845408499, 845430911, 845544517, 845758915, 845891833, 845899403, 845941663, 846099675, 846246839]
2217.1H46246839J1324j5020J16646J59264L6538j5855Q1599J12831J0073m4763L1352
2239.5H46730828R3162N0009o0J3351L6896K4140J0967L3557P2897P8082M8220L8385
2264H47230434N0486K5570j6689N662P0572R4891O6697N4538P6175M7207l7610o5446
2288.5H47602487j7643L099k8193m4823l3319n2094j20223j68085j32620q9109j29819
2310.9H46789658j51694p8141p5877k02656k49922j64867j14262j68264k41697k06530
2331.3H45135748j27136j66059k52843k13146q4579j2994P2718K31326K06947j07050
2351.7H44682932m68493n29945l58223k06113j50264r0420J13785L08037K63453J29759
2372.1H43694508J57952K83718L01779K12908J80184J99557J03891q2970j65760j06335
$$ y = [846246839, 846258163, 846243143, 846359789, 846519053, 846555591, 846539736, 846621335, 846734166, 846744239, 846699476, 846730828, 846823990, 846873999, 846873939, 846887290, 846924186, 846948326, 846959293, 846992850, 847065747, 847143829, 847192049, 847230434, 847280920, 847306490, 847289801, 847295463, 847366035, 847460926, 847527623, 847582161, 847658336, 847705543, 847667933, 847602487, 847584844, 847587943, 847559750, 847514927, 847481608, 847429514, 847309291, 847141206, 847008586, 846919477, 846789658, 846637964, 846559823, 846483946, 846281290, 846031368, 845866501, 845752239, 845583975, 845342278, 845135748, 845008612, 844842553, 844589710, 844376564, 844291985, 844278991, 844351709, 844583035, 844789982, 844682932, 844214439, 843684494, 843326271, 843120158, 842969894, 842879474, 842993259, 843301296, 843564749, 843694508, 843852460, 844136178, 844437957, 844650865, 844831049, 845030606, 845134497, 845051527, 844885767, 844779432]
2392.5H44779432n7578j16170j75833j20700n6684j34587k48313j99795p2419r3341
2412.9H43504012k27154k42829j21832r1433k19465k90811j89364r9838j97231l08633
2433.3H41515422k10405p9154j60158k94209k51412j47998j74523k74002k56718j25587
2453.7H39541256r3579k08557k69472j90973j29283j83701k49923j90615q6248j33991
2474.1H37804914k68877k54035j26064j23024k31027k24889j06394q8036j94430k39194
2494.5H35948944j63972j03116j38879j95325j54376p9512j17481k01106j95920j35422
2514.9H34463835j22547j54853j73152j42038j09553j57714k04742j82211j76192k03907
2535.3H32836926k00570j58071j38760j81794k18451j90735j58548j72198k04504k00629
$$ y = [844779432, 844721854, 844605684, 844429851, 844309151, 844252467, 844117880, 843869567, 843669772, 843597353, 843504012, 843276858, 843034029, 842912197, 842820764, 842601299, 842310488, 842121124, 842021286, 841824055, 841515422, 841305017, 841225863, 841065705, 840771496, 840520084, 840372086, 840197563, 839923561, 839666843, 839541256, 839447677, 839239120, 838969648, 838778675, 838649392, 838465691, 838215768, 838025153, 837938905, 837804914, 837536037, 837282002, 837155938, 837032914, 836801887, 836576998, 836470604, 836382568, 836188138, 835948944, 835784972, 835681856, 835542977, 835347652, 835193276, 835113764, 834996283, 834795177, 834599257, 834463835, 834341288, 834186435, 834013283, 833871245, 833761692, 833603978, 833399236, 833217025, 833040833, 832836926, 832636356, 832478285, 832339525, 832157731, 831939280, 831748545, 831589997, 831417799, 831213295, 831012666]
2555.6H31012666j43230j01328j43945k15649k24829j93238j75178j77205j90556j81973
2576H29265535j50919j57893j99199k07066j93477j94013j95145j93537j92165j95146
2596.4H27386975k14278k42412k41519k07126k01761k33353k46286k35259k53082l19481
2616.8H24992418l58343l25262k97845l19958l39150l26514l17097l41952m00781m25220
2637.2H21540296l61025k95460l19481l85464l92854l39329l41415m03226l95238l20494
2657.6H17986310l05772l54767l38555k65181k82406l83735m09961l30627k68876k94745
2678H14751685l50714l40462k92480l07500l70085l62158k72870k59102l54468l86179
2698.4H11455667k96891k59995l57509m34518l92496l44277l67462l86536l48390k75373
$$ y = [831012666, 830869436, 830768108, 830624163, 830408514, 830183685, 829990447, 829815269, 829638064, 829447508, 829265535, 829114616, 828956723, 828757524, 828550458, 828356981, 828162968, 827967823, 827774286, 827582121, 827386975, 827172697, 826930285, 826688766, 826481640, 826279879, 826046526, 825800240, 825564981, 825311899, 824992418, 824634075, 824308813, 824010968, 823691010, 823351860, 823025346, 822708249, 822366297, 821965516, 821540296, 821179271, 820883811, 820564330, 820178866, 819786012, 819446683, 819105268, 818702042, 818306804, 817986310, 817680538, 817325771, 816987216, 816722035, 816439629, 816055894, 815645933, 815315306, 815046430, 814751685, 814400971, 814060509, 813768029, 813460529, 813090444, 812728286, 812455416, 812196314, 811841846, 811455667, 811158776, 810898781, 810541272, 810106754, 809714258, 809369981, 809002519, 808615983, 808267593, 807992220]
2718.8H07992220k81513l97265m26352l27885l00109l64721l60489k56777k16067l09765
2739.2H04751277l84450l13699j85967k08020l54290l65853k48790k34187l29375l61860
2759.6H01764786l05235k73109l21686l57687l02613k53499l10063m18425m36663l77894
2780G98407912m06325m89115m57049l76940m36663n76139o06835n31256n23805o43969
2800.4G93359816p37905p10667o49869p12395q82447r37581q64267q46386r17613r72391
2820.8G85128295r71138j021147j160621j256943j272142j321495j438319j544595
2837.1G75141895j682520j922250k238035k594054k788126k529621j883269j272738
2853.4G58231282r09567o73532o18875q62539j176238j336336j434088j525223j540303
$$ y = [807992220, 807710707, 807313442, 806887090, 806559205, 806259096, 805894375, 805533886, 805277109, 805061042, 804751277, 804366827, 804053128, 803867161, 803659141, 803304851, 802938998, 802690208, 802456021, 802126646, 801764786, 801459551, 801186442, 800864756, 800507069, 800204456, 799950957, 799640894, 799222469, 798785806, 798407912, 798001587, 797512472, 797055423, 796678483, 796241820, 795665681, 795058846, 794527590, 794003785, 793359816, 792621911, 791911244, 791261375, 790548980, 789666533, 788728952, 787864685, 787018299, 786100686, 785128295, 784157157, 783136010, 781975389, 780718446, 779446304, 778124809, 776686490, 775141895, 773459375, 771537125, 769299090, 766705036, 763916910, 761387289, 759504020, 758231282, 757321715, 756648183, 756029308, 755166769, 753990531, 752654195, 751220107, 749694884, 748154581]
2871.8G48154581j552225j587212j554787j500130j442730j338541j231611j161039
2888.1G36786306j116037j029253q86679q52943r55164r59039q57293q70288j040518
2906.5G28219092j229823j368582j617134k045571k300919k065479j528025j021504
2922.8G15042055o06418j40905L55124O67393Q36790J097679J456797J771331K014637
2941.1G22494483K184510K223134K121747J949847J802325J692474J638055J634597
2957.4G37741172J613736J623095J693487J726269J662314J594723J676857J810610
2973.8G51142263J777530J672387J669944J656472J496077J282394J194238J249433
2990.1G63140738J137614P16150M06206L52204K73585J22309l7313r4056L2961J06514
$$ y = [748154581, 746602356, 745015144, 743460357, 741960227, 740517497, 739178956, 737947345, 736786306, 735670269, 734641016, 733754337, 732901394, 731946230, 730987191, 730129898, 729259610, 728219092, 726989269, 725620687, 724003553, 721957982, 719657063, 717591584, 716063559, 715042055, 714435637, 714294732, 714649856, 715317249, 716154039, 717251718, 718708515, 720479846, 722494483, 724678993, 726902127, 729023874, 730973721, 732776046, 734468520, 736106575, 737741172, 739354908, 740978003, 742671490, 744397759, 746060073, 747654796, 749331653, 751142263, 752919793, 754592180, 756262124, 757918596, 759414673, 760697067, 761891305, 763140738, 764278352, 764994502, 765400708, 765752912, 766026497, 766148806, 766111493, 766017437, 766050398, 766156912]
3010.5G66156912r2566l79026m85182n07593o05106o60122o37174o45220o83069p10011
3030.9G60751843o88612p35521q97765r18448q07584q25286j018881j200200j160562
3049.2G52498984j026213j030981j152337j267433j233220j064301j003682j065553
3065.5G43655264j125753j205325j274168j239598j013637q06391r85324j309157j372575
3083.9G33323336j288176j228690j265824j398444j401425j239836j155793j266063
3100.2G23079085j404225j349330j201213j235545j412451j348972j104534j154482
3116.5G12868333j402795j558662j649439j660526j581669j479030j438319j521528
3132.8G00576365j573563j426160j310468j501023j744688j744509j602232j421690
$$ y = [766156912, 766064346, 765685320, 765200138, 764692545, 764087439, 763427317, 762790143, 762144923, 761461854, 760751843, 760063231, 759327710, 758429945, 757511497, 756703913, 755878627, 754859746, 753659546, 752498984, 751472771, 750441790, 749289453, 748022020, 746788800, 745724499, 744720817, 743655264, 742529511, 741324186, 740050018, 738810420, 737796783, 736990392, 736005068, 734695911, 733323336, 732035160, 730806470, 729540646, 728142202, 726740777, 725500941, 724345148, 723079085, 721674860, 720325530, 719124317, 717888772, 716476321, 715127349, 714022815, 712868333, 711465538, 709906876, 708257437, 706596911, 705015242, 703536212, 702097893, 700576365, 699002802, 697576642, 696266174, 694765151, 693020463, 691275954, 689673722, 688252032]
3149.2F88252032j329839j532376j790881j782597j708447j717687j670003j593649
3165.5F75126553j624704j698673j679778j624942j642763j700997j724780j705110
3181.8F61724806j690388j720488j739383j694321j645506j670182j754820j785159
3198.1F48024559j719713j654685j649081j658440j636624j600326j601040j640975
3214.4F34863675j660705j636863j628697j641392j589299j506447j469016j423538
3230.7F22307718j417756j560808j675605j649022j567364j412690j276493j329780
3247.1F10418200j498758j512111j312196j199126j317740j398623j304984j227498
3263.4E99647164j208007j099050r31382j008511j305520j424194j303494j162648
$$ y = [688252032, 686922193, 685389817, 683598936, 681816339, 680107892, 678390205, 676720202, 675126553, 673501849, 671803176, 670123398, 668498456, 666855693, 665154696, 663429916, 661724806, 660034418, 658313930, 656574547, 654880226, 653234720, 651564538, 649809718, 648024559, 646304846, 644650161, 643001080, 641342640, 639706016, 638105690, 636504650, 634863675, 633202970, 631566107, 629937410, 628296018, 626706719, 625200272, 623731256, 622307718, 620889962, 619329154, 617653549, 616004527, 614437163, 613024473, 611747980, 610418200, 608919442, 607407331, 606095135, 604896009, 603578269, 602179646, 600874662, 599647164, 598439157, 597340107, 596408725, 595400214, 594094694, 592670500, 591367006, 590204358]
3279.7E90204358j140177j185537j179516j086652r57668r69171j135350j267254j330853
3298E79952180j308441j125157r41455j047671j413643j685798j671136j505852j425683
3316.4E67827344j493692j566768j487374j412154j597643j799404j717329j553536
3332.7E55199444j495421j482129j577854j745522j789272j780271j690805j476050
3349E42162120j529038j868188j968741j756311j583755j593888j594901j428187j319527
3367.4E27519584j551748j916706j900196j554132j362026j351594j338482j254499
3383.7E15290201j113057r41456p75575q55267j132906j125753p54774n62965q98362
3402.1E07130086j225948j047313p47144o38366o30856p01785o87122m78268l56734
$$ y = [590204358, 589064181, 587878644, 586699128, 585612476, 584654808, 583685637, 582550287, 581283033, 579952180, 578643739, 577518582, 576577127, 575529456, 574115813, 572430015, 570758879, 569253027, 567827344, 566333652, 564766884, 563279510, 561867356, 560269713, 558470309, 556752980, 555199444, 553704023, 552221894, 550644040, 548898518, 547109246, 545328975, 543638170, 542162120, 540633082, 538764894, 536796153, 535039842, 533456087, 531862199, 530267298, 528839111, 527519584, 525967836, 524051130, 522150934, 520596802, 519234776, 517883182, 516544700, 515290201, 514177144, 513235688, 512460113, 511604846, 510471940, 509346187, 508591413, 508028448, 507130086, 505904138, 504856825, 504109681, 503471315, 502840459, 502138674, 501451552, 500973284, 500616550]
3420.4E00616550l99291l40313j25706P4863J01626J19359K40445J76668m4882l5286
3440.8E00384033K25603M62473N32984N17250N78940O86466P65801Q57055R41634R17912
3461.2E06870151R41753J196146J359165J130700Q04484Q04245J051486J314819J383900
3479.6E16856849J197517J150668J337170J358509J259745J330494J477421J543522
3495.9E27511895J516699J591743J694440J481533J279295J449406J686156J770079
3512.2E39981246J699805J581133J628518J880705K122820K003312J733601J709819
3528.5E54340959J808881J955390K155543K165019K056837K232611K511263K464712
3544.8E71691215K089262J919091K145111K308071K339184K469957K633155K670288
$$ y = [500616550, 500217259, 499876946, 499751240, 499826103, 499927729, 500047088, 500287533, 500464201, 500419319, 500384033, 500609636, 501072109, 501605093, 502122343, 502701283, 503387749, 504153550, 505010605, 505952239, 506870151, 507811904, 509008050, 510367215, 511497915, 512302399, 513106644, 514158130, 515472949, 516856849, 518054366, 519205034, 520542204, 521900713, 523160458, 524490952, 525968373, 527511895, 529028594, 530620337, 532314777, 533796310, 535075605, 536525011, 538211167, 539981246, 541681051, 543262184, 544890702, 546771407, 548894227, 550897539, 552631140, 554340959, 556149840, 558105230, 560260773, 562425792, 564482629, 566715240, 569226503, 571691215, 573780477, 575699568, 577844679, 580152750, 582491934, 584961891, 587595046, 590265334]
3561.1E90265334K659678K794027K906979K713799K573550K704263K898812L054917
3577.5F12571359L183782L284573L408254L501117L300845L001988L063858L317416
3593.8F38633192L419339L430784L414810L303706L301621L494024L612638L489434
3610.1F66099548L407777L387689L337741L376603L202617K882660K964616L374397
3626.4F92033648L542126K969861K568781K691209K712012K698362K777815K847075
3642.7G14840889L018379L314913L216505K223312J564324J911283K276063K144217
3659G34509885J930118J840889K008617K329409K300203J825452J776993J743138J060605
3677.4G51325309Q44062J127839J427293J830041K088487J400292M52340M66644Q02994
$$ y = [590265334, 592925012, 595719039, 598626018, 601339817, 603913367, 606617630, 609516442, 612571359, 615755141, 619039714, 622447968, 625949085, 629249930, 632251918, 635315776, 638633192, 642052531, 645483315, 648898125, 652201831, 655503452, 658997476, 662610114, 666099548, 669507325, 672895014, 676232755, 679609358, 682811975, 685694635, 688659251, 692033648, 695575774, 698545635, 701114416, 703805625, 706517637, 709215999, 711993814, 714840889, 717859268, 721174181, 724390686, 726613998, 728178322, 730089605, 732365668, 734509885, 736440003, 738280892, 740289509, 742618918, 744919121, 746744573, 748521566, 750264704, 751325309, 752169371, 753297210, 754724503, 756554544, 758643031, 760043323, 760495663, 760962307, 761765301]
3695.8G61765301R66013J077532R78470O93262Q06808J206398J256228O10530N9426
3714.1G69419968K55764O21318P25329N71251L63827K16007L29376P64727J078010
3732.5G74345577Q21829J97887j03056K30312O96063N49793K85089N39363L57330k32041
3752.9G77688146j68205J85192J96636L7014K07901M13418L82483K22564q1778j33574
3773.3G78949797J72436M43459L33071L9696M0353R3996O9857J38223K27392L51727
3793.7G80860007M20928M08590M51445J15872j66178K1517j39594k38001K03013N79000
3814.1G82516599M14848K75672L23116k04146m13596j01388L3200J71483L30090M95255
3834.4G83841133M64141o6161m18007l21269k45631r5367L39567Q66414O22689n79655
$$ y = [761765301, 762731314, 763808846, 764787316, 765480578, 766287386, 767493784, 768750012, 769360542, 769419968, 769675732, 770297050, 771022379, 771593630, 771957457, 772173464, 772502840, 773267567, 774345577, 775167406, 775365293, 775262237, 775492549, 776188612, 776738405, 777023494, 777562857, 777920187, 777688146, 777519941, 777705133, 777901769, 777938783, 778146684, 778560102, 778942585, 779165149, 779083371, 778949797, 779122233, 779565692, 779898763, 779938459, 779978812, 780072808, 780142665, 780280888, 780508280, 780860007, 781280935, 781689525, 782140970, 782256842, 782090664, 782112181, 781972587, 781734586, 781937599, 782516599, 782931447, 783207119, 783530235, 783326089, 782912493, 782811105, 782844305, 783015788, 783345878, 783841133, 784305274, 784239113, 783821106, 783499837, 783254206, 783158839, 783498406, 784364820, 784987509, 784407854]
3854.8G84407854p06911q4341K78295K85267K0564M8339J82569r7513k54810j92344
3875.2G83886969K9028K50756J02580N9903j8239k24293j7404j6272l03388q1301L53515
3897.7G84021854L83377Q3149k48790m55916l63886j35660L1709J68503J72794j5617
3918.1G83641517j30653l7074J0311q3863l3498R0539l0577k26676k14994l6478J34646
3940.5G83083200Q5235p2300l5525L3856o0439j52409j12176k5094N543m1306q7797
3962.9G82620788l0160L9994q463q6666n3167M0233K5928l6478K5571Q4400m2379j70112
3987.4G82409489j06811P74J3650l1471o1512
3997.6G82224119
$$ y = [784407854, 783700943, 783616602, 783894897, 784180164, 784200728, 784249067, 784431636, 784334123, 784079313, 783886969, 783915997, 784166753, 784269333, 784329236, 784310997, 784086704, 784069300, 784053028, 783749640, 783668339, 784021854, 784405231, 784488380, 784239590, 783783674, 783419788, 783284128, 783315837, 783484340, 783657134, 783641517, 783510864, 783473790, 783484101, 783400238, 783366740, 783457279, 783426702, 783200026, 782985032, 782948554, 783083200, 783168435, 783096135, 783060610, 783094466, 783034027, 782881618, 782769442, 782744348, 782749891, 782708585, 782620788, 782590628, 782630622, 782622159, 782535493, 782482326, 782522559, 782548487, 782512009, 782537580, 782621980, 782579601, 782409489, 782302678, 782303452, 782317102, 782285631, 782224119]
##END=$$ End of the data block
