##TITLE=Casca de arroz - 1 $$ Begin of the data block
##JCAMP-DX=5.00 $$ ACD/SpecManager v 10.08
##SPECTROMETER/DATA SYSTEM=Alpha
##DATE=26 May 2015 14:52:24
##DATA TYPE=INFRARED SPECTRUM
##DATA CLASS=XYDATA
##ORIGIN=
##OWNER=
##NPOINTS=1765
##FIRSTX=399.76428223
##LASTX=3997.64306641
##MAXX=3997.64306641
##MINX=399.76428223
##MAXY=0.77827263
##MINY=0.33471513
##XFACTOR=1.0000000000
##YFACTOR=1.000000000000000e-9
##FIRSTY=0.60065854
##DELTAX=2.03961372
##XUNITS=1/CM
##YUNITS=ARBITRARY UNITS
##XYDATA=(X++(Y..Y))
399.8F00658536m141152j044810k63154l067732n387187l550112k94626o28948m635215
$$ 600658536 596517384 595472574 595209420 592141688 586754501 583204389 582909763 582280815 577645600
418.1E77645600o542981l434062j160443k543866n080819n054772k599478j575291
$$ 577645600 571102619 567668557 566508114 563964248 558883429 553828657 551229179 549653888
434.4E49653888l703475n666375m456580j955986j885653m398822n591333l732145
$$ 549653888 545950413 540284038 535827458 533871472 531985819 527586997 521995664 518263519
450.8E18263519j667619k343237m656136m925788k410054n37038j099765k257705j293570
$$ 518263519 516595900 514252663 509596527 504670739 502260685 501723647 500623882 498366177 497072607
469.1D97072607J636803L511280K877116K326608M066646O694258P546782O121218
$$ 497072607 498709410 502220690 505097806 507424414 511491060 518185318 525732100 531853318
485.4E31853318M899740O176234Q087694P235945M318416K953708M055738M929483
$$ 531853318 536753058 542929292 551016986 558252931 562571347 565525055 569580793 574510276
501.7E74510276L205002N04434O8426J727283K193928K9444k059698j303434R54211
$$ 574510276 577715278 578219712 578288138 580015421 582209349 582238793 580179095 578875661 579829872
520.1E79829872J229167p41363j860738m34875J554429J491428m32492j364588J60694
$$ 579829872 581059039 580317676 578456938 578022063 579576492 581067920 580635428 579270840 579431534
538.5E79431534J788676P90834j621246k006769j2994J172006l85404k562165k221048
$$ 579431534 581220210 582011044 580389798 578383029 578370035 579542041 579156637 576594472 574373424
556.8E74373424K14160J457929P5102j385927l13461J849353J837492l76463j562178
$$ 574373424 574587584 576045513 576120615 574734688 574421227 576270580 578108072 577731609 576169431
575.2E76169431O7115K323687K108812o8366q45790J009762K649427J529395p51078
$$ 576169431 576236546 578560233 580669045 580600679 579754889 580764651 583414078 584943473 584192395
593.5E84192395r04202J223802K515734J050353j137078q76069J505375K708912J242160
$$ 584192395 583288193 584511995 587027729 588078082 586941004 586064935 587570310 590279222 591521382
611.9E91521382n04493K52366K662182L419339J818836O52850J888513L794193L291965
$$ 591521382 591016889 591269255 593931437 597350776 599169612 599822462 601710975 605505168 608797133
630.2F08797133P54654l81648J290083L143191K381683M8756n25057J361906K787829
$$ 608797133 609551787 609170139 610460222 613603413 615985096 616033852 615508795 616870701 619658530
648.6F19658530J484573p85172q82745J027048J813054L8921j804292j222491J584768
$$ 619658530 621143103 620357931 619475186 620502234 622315288 622354209 620549917 619327426 620912194
667F20912194L773511J460194J34647J873553M340708M441798K122402N29051J510203
$$ 620912194 624685705 626145899 626280546 628154099 632494807 636936605 639059007 639588058 641098261
685.3F41098261L043949K263487j39356j004457N94198K077163J150250q14617q57710
$$ 641098261 644142210 646405697 646266341 645261884 645856082 647933245 649083495 648268878 647411168
703.7F47411168J213729K587020J404643n01871k76446J652062K417982J031220l17991
$$ 647411168 648624897 651211917 652616560 652114689 651838243 653490305 655908287 656939507 656621516
722F56621516M56035K336442K702177J056373k28941N96940K173126J969933L7849
$$ 656621516 657077551 659413993 662116170 663172543 662943602 663540542 665713668 667683601 667721450
740.4F67721450r64760L79443K069771J611233l26991r84192M67539J803577R90867
$$ 667721450 666756690 667136133 669205904 670817137 670490146 669505954 669973493 671777070 672767937
758.7F72767937q40723j128376L62218J289010j3948k077699k415359j110851n01097
$$ 672767937 671927214 670798838 671161056 672450066 672436118 670358419 667943060 666832209 666331112
777.1F66331112j614093k644599j791656R6738P21097n31852j687705r73285O39975
$$ 666331112 664717019 662072420 660280764 660377502 661098599 660566747 658879042 657905757 658545732
795.4F58545732R60947k62380r95517N8949J575947J617372L17335k63274R15528K307355
$$ 658545732 659506679 659244299 658248782 658307731 659883678 661501050 661818385 661555111 662470639 664777994
815.8F64777994K100587P96139L56376J398862K250910J414895l5286L7789J813948
$$ 664777994 666878581 667674720 668031096 669429958 671680868 673095763 673060477 673098266 674912214
834.2F74912214L236413K834916J686156J664698K650440K743781J176536m41373l71694
$$ 674912214 678148627 680983543 682669699 684334397 686984837 689728618 690905154 690463781 690092087
852.6F90092087P97629R97961l61979j536608r55045M51863N66959q54969j918376
$$ 690092087 690889716 691887677 691525698 689989090 689034045 689485908 690052867 689197898 687279522
870.9F87279522j377284m14610q67546k541303l594399l216028k728939l548265m958808
$$ 687279522 685902238 685487628 684620082 682078779 678484380 675268352 672539413 668991148 664032340
889.3F64032340n086601l531873j869023j408815j469851o84499P81714J370132K97308
$$ 664032340 658945739 655413866 653544843 652136028 650666177 649981678 650763392 652133524 652430832
907.6F52430832j268684j695991j098037j067817k264261l425837l210425k167404
$$ 652430832 651162148 649466157 648368120 647300303 645036042 641610205 638399780 636232376
923.9F36232376j878917k694547l379286k934694k040267k074063l104388l786147
$$ 636232376 634353459 631658912 628279626 625344932 623304665 621230602 618126214 614340067
940.3F14340067l363192k759218l133357m223168m780173m323900l776669m093886
$$ 614340067 610976875 608217657 605084300 600861132 596080959 591757059 587980390 583886504
956.6E83886504m880369m994511m236460l640056m018127m835248n060554m712999
$$ 583886504 579006135 574011624 569775164 566135108 562116981 557281733 552221179 547508180
972.9E47508180m790723n805314p009923p376075o969035o714284o917060o875187
$$ 547508180 542717457 536912143 529902220 522526145 515557110 508842826 501925766 495050579
989.2D95050579n999714m746616m164576m565060n131424n138576m943162n306721
$$ 495050579 489050865 484304249 480139673 475574613 470443189 465304613 460361451 455054730
1005.5D55054730o254673p063269p257969p184535p324159p504523p206052o347448
$$ 455054730 448800057 441736788 434478819 427294284 419970125 412465602 405259550 398912102
1021.8C98912102n509675n190581n152851m895449m261404l548592l125936k937824
$$ 398912102 393402427 388211846 383058995 378163546 373902142 370353550 367227614 364289790
1038.2C64289790k674281k316624k147645k289325k442956k244145j721680j228392
$$ 364289790 361615509 359298885 357151240 354861915 352418959 350174814 348453134 347224742
1054.5C47224742j043081j025975q12977l84510j93566n24730j095771j470834j546175
$$ 347224742 346181661 345155686 344342709 343958199 343764633 343239903 342144132 340673298 339127123
1072.8C39127123j482039j356215j062125n11616L8385K37316J04606o824J26928L32385
$$ 339127123 337645084 336288869 335226744 334715128 334753513 334990829 335095435 335088611 335215539 335547924
1093.2C35547924L52949J96367J56641M89533J096845J657724K108455K702177L528654
$$ 335547924 335900873 336097240 336253881 336743414 337840259 339497983 341606438 344308615 347837269
1111.6C47837269M281462M604131M498481M345298M457057M690736M790843M853785
$$ 347837269 352118731 356722862 361221343 365566641 370023698 374714434 379505277 384359062
1127.9C84359062N151540N559057N609989N077302M176438L286809K528220J715482
$$ 384359062 389510602 395069659 400679648 405756950 409933388 413220197 415748417 417463899
1144.2D17463899P65144n4508m56274m74542l54409k11895J42306R32634J997054K880305
$$ 417463899 418229043 418174535 417718261 417243719 416889310 416677415 416819721 417752355 419749409 422629714
1164.6D22629714L429562L999919M898965N840182O284803O147951N849034N688965
$$ 422629714 426059276 430059195 434958160 440798342 447083145 453231096 459080130 464769095
1180.9D64769095N473763M920691M132897L449440K946406K361536J510948O17058
$$ 464769095 470242858 475163549 479296446 482745886 485692292 488053828 489564776 490181834
1197.3D90181834J65075L29852P19160R04023R23067J013399J136660J027286O08266
$$ 490181834 490346909 490676761 491395921 492299944 493223011 494236410 495373070 496400356 497008622
1215.6D97008622J74433L7372J19448R3519j37448k73794m8429L99828P44552Q88139
$$ 497008622 497183055 497220427 497339875 497433394 497295946 497022152 496973723 497373551 498118103 499006242
1236D99006242J078277J508832J976252K193809K208828K314270K586186K756298K618789
$$ 499006242 500084519 501593351 503569603 505763412 507972240 510286510 512872696 515628994 518247783
1254.4E18247783K322853K201736K380669K607167K620816K539933K686739L124713
$$ 518247783 520570636 522772372 525153041 527760208 530381024 532920957 535607696 538732409
1270.7E38732409L513217L620267L614545L696025L844201L888071L721297L470599
$$ 538732409 542245626 545865893 549480438 553176463 557020664 560908735 564630032 568100631
1287E68100631L322184L205121K860606K205252J496732J031101P37965L03030k96950
$$ 568100631 571422815 574627936 577488542 579693794 581190526 582221627 582959592 583262622 582965672
1305.4E82965672p24912q25047q26180r64999j094699q46386k10703L28482M30464
$$ 582965672 582240760 581415713 580589533 579624534 578529835 577683449 577472746 577801228 578231692
1323.7E78231692K88308K67029M94838P69078Q69930Q80182J113653J596391J827061
$$ 578231692 578520000 578787029 579281867 580050945 580920875 581801057 582914710 584511101 586338162
1342.1E86338162J531721J016080O38008M33564J47820l55840q49307j110792j232028
$$ 586338162 587869883 588885963 589523971 589957535 590105355 589749515 588900208 587789416 586557388
1360.4E86557388j417935j689553j825511j581252r89556m19975L3796N44608J200259
$$ 586557388 585139453 583449900 581624389 580043137 579053581 578633606 578667402 579212010 580412269
1378.8E80412269J799583K162933K610267L299236L522098K948105K233208J621604
$$ 580412269 582211852 584374785 586985052 590284288 593806386 596754491 598987699 600609303
1395.1F00609303J168370J042783Q90195L82901j96159n91398q37743j154482j679719
$$ 600609303 601777673 602820456 603710651 604093552 603897393 603305995 602468252 601313770 599634051
1413.5E99634051k171993k264023j748800r42588m14193j3351N31316J259267J745999
$$ 599634051 597462058 595198035 593449235 592506647 592092454 592079103 592610419 593869686 595615685
1431.8E95615685J696765J778245K025903J676380R53257m3332r90272j307666j034618
$$ 595615685 597312450 599090695 601116598 602792978 603746235 603702903 602712631 601404965 600370347
1450.2F00370347q01861p12752k67148N29051O77228N39124J210153K778888M281044
$$ 600370347 599568486 598855734 598588586 599117637 599794865 600333989 601544142 604323030 608604074
1468.5F08604074N810916P664800P971286O795526N765319M809856L566623J975834
$$ 608604074 614414990 622079790 630051076 636846602 642611921 647421777 650988400 652964234
1484.9F52964234O53863j58667r06170j912772l137648m163981m346847m245162m449726
$$ 652964234 653618097 653459430 652553260 650640488 647502840 643338859 638992012 634746850 630297124
1503.2F30297124n180418n425513l600061k249002j517892L27945L376066O400645
$$ 630297124 625116706 619691193 616091132 613842130 612324238 612652183 616028249 622428894
1519.5F22428894Q655191Q040726O006598N022407M093945L257751K662778J762152
$$ 622428894 631084085 639124811 645131409 650153816 654247761 657505512 660168290 661930442
1535.8F61930442J246571J778961J960098J373828J108944J165748J338899J253724
$$ 661930442 663177013 664955974 666916072 668289900 669398844 670564592 671903491 673157215
1552.2F73157215P92742L88980Q14974J420260O12795l55721q67426j140416j495123
$$ 673157215 673949957 674338937 675153911 676574171 677186966 676831245 675963819 674823403 673328280
1570.5F73328280k181530l218650m275859m339218m430592n223572n699337n458295
$$ 673328280 671146750 667928100 663652241 659313023 654882431 649658859 643959522 638501227
1586.8F38501227m786313m283666m181147m281342m296958m353762m605711m593610
$$ 638501227 633714914 629431248 625250101 620968759 616671801 612318039 607712328 603118718
1603.2F03118718l691376k028465o13391l70324j218438k322972k969742k801954k995253
$$ 603118718 599427342 597398877 596785486 596415162 595196724 592873752 589904010 587102056 584106803
1621.5E84106803l726244l836513l333985k700985k046525j489699p22647K64227P40946
$$ 584106803 580380559 576544046 573210061 570509076 568462551 566972852 566250205 566514432 567255378
1639.9E67255378P77960O14345P47919J083255R42826J110494J840293J867772J969873
$$ 567255378 568033338 568647683 569395602 570478857 571421683 572532177 574372470 576240242 578210115
1658.2E78210115K507985L021121L116548K845586L237843L836870L442109L278851
$$ 578210115 580718100 583739221 586855769 589701355 592939198 596776068 600218177 603497028
1674.5F03497028L559769L317058K871036K775192L260792L071129K607822K515734
$$ 603497028 607056797 610373855 613244891 616020083 619280875 622352004 624959826 627475560
1690.9F27475560K036333J880765K110004K383352K815783K080202J246810J141786
$$ 627475560 629511893 631392658 633502662 635886014 638701797 640781999 642028809 643170595
1707.2F43170595J000107O04212R1016j79470J66536N81443L57032q6784k95639j97113
$$ 643170595 644170702 644774914 644865930 644686460 644852996 645434439 645791471 645704687 645409048 645211935
1727.6F45211935K086J39713O18697J437068K127647L240109M149079M328668M537523
$$ 645211935 645214021 645353734 645972431 647409499 649537146 652777255 656926334 661255002 665792525
1745.9F65792525N043506N896688O284237N635500N399108N686104N677044N666316
$$ 665792525 670836031 676732719 683016956 688652456 694051564 699737668 705414712 711081028
1762.2G11081028N036116M324793M206419M076422L920138L399431K705097K530694
$$ 711081028 716117144 720441937 724648356 728724778 732644916 736044347 738749444 741280138
1778.6G41280138K535522K195895J770199J626193J611114J605570J596749J335263
$$ 741280138 743815660 746011555 747781754 749407947 751019061 752624631 754221380 755556643
1794.9G55556643J129687J244604J359165J133680P70212P33375R75132J060128P67351
$$ 755556643 756686330 757930934 759290099 760423779 761193991 761927366 762902498 763962626 764729977
1813.2G64729977M81605N71668Q20220P23123L52323K03372L56614O39081P06673L64959
$$ 764729977 765211582 765783250 766603470 767326593 767678916 767882288 768238902 768877983 769584656 769949615
1833.6G69949615J10686K94804M88878K76804j6034L5882L00884M78983L44157p15
$$ 769949615 770060301 770355105 770843983 771120787 771104753 771140635 771441519 771920502 772264659 772263944
1854G72263944j00136J37568L30031J61648j69635k69890O2406M53770L31640j3113
$$ 772263944 772163808 772301376 772631407 772793055 772623420 772353530 772415936 772869706 773201346 773188233
1874.4G73188233n2094K19345L60131J46926j12415q4817K01225M00603K03490o7889
$$ 773188233 773136139 773355484 773715615 773862541 773750126 773665309 773866534 774267137 774470627 774402738
1894.8G74402738M3571L54290M08828J29461j02579J7345L14533L75390J00375j56165
$$ 774402738 774446309 774800599 775209427 775338888 775236309 775253654 775568187 775943577 776043952 775887787
1915.2G75887787k8550K97367K74182k5690j81913l4690J99198J58370j38879k80857
$$ 775887787 775859237 776156604 776430786 776405096 776223183 776188493 776387691 776546061 776407182 776126325
1935.6G76126325r2089R3281N722k15292k70903o7413J42753M6313k31921k83540m5478
$$ 776126325 776034236 776127517 776133239 775917947 775647044 775579631 775722384 775768697 775536776 775253236 775207758
1958.1G75207758J36912r597k94148k94745K6285J99974K861k46346k21074J8299J23620
$$ 775207758 775344670 775335073 775040925 774746180 774772465 774972439 774975300 774728954 774507880 774526179 774649799
1980.5G74649799o6102k92599k28107L1889J02579j01924k83718k23219j0908M8936
$$ 774649799 774583697 774291098 774062991 774094880 774197459 774095535 773811817 773588598 773577690 773626626
2000.9G73626626j75357l66807k40207J2100K145k76625m48644l11792j24871k37048
$$ 773626626 773451269 773084462 772844255 772856355 772858500 772581875 772133231 771821439 771696568 771459520
2021.3G71459520o41465p41005p8142N27322L37303j44005k98261p2360J65045Q6188
$$ 771459520 770818055 770077050 769998908 770526230 770863533 770719528 770421267 770348907 770513952 770600140
2041.7G70600140j92702k55763M470K20895J00732j55211j54733R2983K30670P6949
$$ 770600140 770407438 770151675 770156145 770377040 770477772 770322561 770167828 770260811 770491481 770568430
2062.1G70568430j42455j06096J68562L19898J32024j37448r6977J98007L24190J00612
$$ 770568430 770425975 770319879 770488441 770808339 770940363 770802915 770705938 770903945 771228135 771328747
2082.5G71328747j86145j57416J21474K30849J3113k15590j34110J24991J66714q2851
$$ 771328747 771142602 770985186 771106660 771337509 771350622 771135032 771000922 771125913 771292627 771209776
2102.9G71209776k71856j37926J22726J38522r3460k33233q0109J59860J39236j31011
$$ 771209776 770937920 770799994 770922720 771061242 770967782 770734549 770654440 770814300 770953536 770822525
2123.3G70822525k43425p809K49029J96457q7440j92941P5698L36409K18749p5698
$$ 770822525 770579100 770571291 770820320 771016777 770929337 770736396 770812094 771148503 771367252 771291554
2143.7G71291554j08480J79708L89218K28822p1883r0063K22028M37796K56061k5153
$$ 771291554 771183074 771362782 771752000 771980822 771908939 771818876 772040904 772478700 772734761 772709608
2164.1G72709608J5438L04699M64797K97248M8757J09851L80993M59134K22326j9431
$$ 772709608 772725046 773029745 773494542 773791790 773840547 773950398 774331391 774790525 775012851 774993420
2184.5G74993420Q8036L82602M03821J10388q6665O6936L32236L14117K3007j43111
$$ 774993420 775081456 775464058 775867879 775978267 775891602 775958538 776290774 776604891 776627898 776484787
2204.8G76484787M3095L20255K77400m1961j64151Q1658K84850J38462j48237k04742
$$ 776484787 776527882 776848137 777125537 777083576 776919425 777001083 777285933 777424395 777276158 777071416
2225.2G77071416N6506K81453J32501j69516j82748J10865K84553P3433k02597j41501
$$ 777071416 777127922 777409375 777541876 777372360 777189612 777300477 777585030 777658463 777455866 777314365
2245.6G77314365J64390K94089N1558k32577j57714J60813K82943N7459j80662o5744
$$ 777314365 777478755 777772844 777824402 777591825 777434111 777594924 777877867 777935326 777754664 777688920
2266G77688920K35975K47777n1022k35379o0737K32101K14994j01865k52783l1710
$$ 777688920 777924895 778172672 778121650 777886271 777825534 778057635 778272629 778170764 777917981 777886271
2286.4G77886271K12789J15812j89901k85625k5868K37941J12832k27511k99335k1219
$$ 777886271 778099060 778214872 778024971 777739346 777713478 777951419 778064251 777836740 777537405 777516186
2306.8G77516186J98663N2392k36690k78354m2736J31845l2067l01421k46882N8949
$$ 777516186 777714849 777767241 777530551 777252197 777209461 777341306 777309239 777007818 776760936 776819885
2327.2G76819885J86562o7651l81350l34502m7028N9784j52290k80023k0146J10388
$$ 776819885 777006447 776938796 776557446 776222944 776175916 776235700 776083410 775803387 775783241 775893629
2347.6G75893629q7440k57850k61545p5162J52946J06275j63853l28839j56284J12355
$$ 775893629 775806189 775548339 775286794 775211632 775364578 775470853 775307000 774978161 774821877 774934232
2368G74934232K3663k66731k85267l5584J21653k4379k86161l00825o0082P6950j00732
$$ 774934232 774957895 774691164 774405897 774370313 774491966 774467587 774181426 773880601 773820519 773897469 773796737
2390.4G73796737l57270l36409r0539n901k23815m33982l52204j11699p0333k99812
$$ 773796737 773439467 773103058 773012519 773006618 772782803 772348821 771996617 771884918 771814585 771514773
2410.8G71514773m65333l36826j10865r8049k99156m32134l22222j19210r8466l04342
$$ 771514773 771049440 770712614 770601749 770503700 770204544 769772410 769450188 769330978 769232512 768928170
2431.2G68928170m50671l17275r9421j17540l38316m42088k87056j02639j62124l77298
$$ 768928170 768477499 768160224 768060803 767943263 767604947 767162859 766875803 766773164 766611040 766233742
2451.6G66233742m25279k44677j02103j79946l49760l69013j99616r0241k04146l57389
$$ 766233742 765808463 765563786 765461683 765281737 764931977 764562964 764363348 764273107 764068961 763711572
2472G63711572l37422j87755j07646k23636l65615l09766j73449j50621k54631l58522
$$ 763711572 763374150 763186395 763078749 762855113 762489498 762179732 762006283 761855662 761601031 761242509
2492.4G61242509k99752j47521j22369k55167l63767l13580j92404j64151k53320l30508
$$ 761242509 760942757 760795236 760672867 760417700 760053933 759740353 759547949 759383798 759130478 758799970
2512.8G58799970k73645j34468p9155j77026k94149k54333j35898j53661k75075k96355
$$ 758799970 758526325 758391857 758312702 758135676 757841527 757587194 757451296 757297635 757022560 756726205
2533.2G56726205j78694p1049j19448k74300l34382k21730q6188j08302k42233k82109
$$ 756726205 756547511 756476462 756357014 756082714 755748332 755526602 755440414 755332112 755089879 754807770
2553.6G54807770j83284r9480j44422k69830l22044k25604j08898j45495l05414l54826
$$ 754807770 754624486 754525006 754380584 754110754 753788710 753563106 753454208 753308713 753003299 752648473
2574G52648473k15411r9838j80602l61264m03285k75552j89662k65837l82721l55065
$$ 752648473 752433062 752333224 752152622 751791358 751388073 751112521 750922859 750657022 750274301 749919236
2594.4G49919236k26140j90258l09587m57585m45723k90156k29895l55303m64737l88742
$$ 749919236 749693096 749502838 749193251 748735666 748289943 747999787 747769892 747414589 746949852 746561110
2614.8G46561110k42054k33412l93331n43177m85123l16679l08156m52876n20826m10735
$$ 746561110 746319056 746085644 745692313 745149136 744664013 744347334 744039178 743586302 743065476 742654741
2635.2G42654741k72274l12984m88937n39124l88980k74837l50952m99964n25117l81827
$$ 742654741 742382467 742069483 741580546 741041422 740652442 740377605 740026653 739526689 739001572 738619745
2655.6G38619745k42472k89738m69864n15878l65495k83361m04656n45680n02646l46184
$$ 738619745 738377273 738087535 737617671 737101793 736736298 736452937 736048281 735502601 734999955 734653771
2676G34653771l14355m58956n76734n09382l61561l29495m42564n29170m46737l17097
$$ 734653771 734339416 733880460 733303726 732794344 732432783 732103288 731660724 731131554 730684817 730367720
2696.4G30367720l39270m86135n69999m99487m04596m29333n24938n26845m18008l75509
$$ 730367720 730028450 729542315 728972316 728472829 728068233 727638900 727113962 726587117 726169109 725793600
2716.8G25793600m56393n32269n10216m03881l28124l87311m74810m36545l16262k68578
$$ 725793600 725337207 724804938 724294722 723890841 723562717 723175406 722700596 722264051 721947789 721679211
2737.2G21679211l46065m23372m00185l23952k95519l59655m28617m00543l29733l42786
$$ 721679211 721333146 720909774 720509589 720185637 719890118 719530463 719101846 718701303 718371570 718028784
2757.6G18028784m42744n07950m84944m55200m79639n21541n13792m61936m53233n18978
$$ 718028784 717586040 717078090 716593146 716137946 715658307 715136766 714622974 714161038 713707805 713188827
2778G13188827n85914o08205o19650o40989o83248p46786p78258p64370p65205q32676
$$ 713188827 712602913 711994708 711375058 710734069 710050821 709304035 708525777 707761407 706996202 706163526
2798.4G06163526r48310j015723j012504j025438j078904j155019j241744j304984
$$ 706163526 705215216 704199493 703186989 702161551 701082647 699927628 698685884 697380900
2814.7F97380900j356303j418114j513362j671433j827062j934230k061069k237022
$$ 697380900 696024597 694606483 693093121 691421688 689594626 687660396 685599327 683362305
2831F83362305k422690k599359k792775l066302l511846m214763n128742n692482m977703
$$ 683362305 680939615 678340256 675547481 672481179 668969333 664754570 659625828 653933346 648955643
2849.3F48955643l046155j237929l81767j81556k79069o01113j060128j466692j690149
$$ 648955643 645909488 644671559 644289792 644108236 643829167 643228054 642167926 640701234 639011085
2867.7F39011085j714408j582981j455247j401842j317977j230479j251042j353025
$$ 639011085 637296677 635713696 634258449 632856607 631538630 630308151 629057109 627704084
2884F27704084j416743j366854j320839j356959j341879j267314j224637j213610j252056
$$ 627704084 626287341 624920487 623599648 622242689 620900810 619633496 618408859 617195249 615943193
2902.4F15943193j360118j522422j805663k369583l228128l947913l807783k599895
$$ 615943193 614583075 613060653 611254990 608885407 605657279 601709366 597901583 595301688
2918.7E95301688j055897L2008O21557J014710J298010J421690J481593J668334J995385
$$ 595301688 594245791 594277799 594899356 595914066 597212076 598633766 600115359 601783693 603779078
2937F03779078K309083K548814K734363K818406K740026K530872K283037K061546J959979
$$ 603779078 606088161 608636975 611371338 614189744 616929770 619460642 621743679 623805225 625765204
2955.4F25765204K031029K158880K195716K165198K208948K319694K387225K418757
$$ 625765204 627796233 629955113 632150829 634316027 636524975 638844669 641231894 643650651
2971.7F43650651K458096K480626TK415001K216697J984775J819491J681090J507878
$$ 643650651 646108747 648589373 651069999 653485000 655701697 657686472 659505963 661187053 662694931
2990.1F62694931J225591Q85784O90401N93483M19021K33531J54078J71661K13504
$$ 662694931 663920522 664806306 665496707 666090190 666509211 666742742 666896820 667068481 667281985
3008.4F67281985K11299J08003n5909j48415j79828k76029m01139m61876n01335n35727
$$ 667281985 667493284 667601287 667545378 667396963 667217135 666941106 666539967 666078091 665576756 665041029
3028.8F65041029n55217n93662o57082p02440p23541p77304q63493r49919r91702r74298
$$ 665041029 664485812 663892150 663235068 662532628 661809087 661031783 660168290 659218371 658226669 657252371
3049.2F57252371j022398j141906j156986j106322j113474j123905j099646j049459
$$ 657252371 656229973 655088067 653931081 652824759 651711285 650587380 649487734 648438275
3065.5F48438275j030445j086354j119793j054883r10580q29280r47833j110553j153648
$$ 648438275 647407830 646321476 645201683 644146800 643236220 642406940 641459107 640348554 639194906
3083.9F39194906j140774j106798j082719j137673j188219j137793j076818j127898
$$ 639194906 638054132 636947334 635864615 634726942 633538723 632400930 631324112 630196214
3100.2F30196214j264692j326680j239478j170218j258791j317382j236677j213014
$$ 630196214 628931522 627604842 626365364 625195146 623936355 622618973 621382296 620169282
3116.5F20169282j303256j464545j621425j633406j540482j457215j459121j541913
$$ 620169282 618866026 617401481 615780056 614146650 612606168 611148953 609689832 608147919
3132.8F08147919j566171j472235j438379j593709j761616j779794j699210j582026
$$ 608147919 606581748 605109513 603671134 602077425 600315809 598536015 596836805 595254779
3149.2E95254779j520813j672566j895666Tj790345j769542j804114j849472j852691
$$ 595254779 593733966 592061400 590165734 588270068 586479723 584710181 582906067 581056595 579203904
3167.5E79203904j836419j860619j891255j882017j864970j889646j958370k003133
$$ 579203904 577367485 575506866 573615611 571733594 569868624 567978978 566020608 564017475
3183.8E64017475j960159j877844j858234j936853k008856j979649j916587j901209
$$ 564017475 562057316 560179472 558321238 556384385 554375529 552395880 550479293 548578084
3200.1E48578084j923085j960814j953900j891076j879394j934827j964807j925469
$$ 548578084 546654999 544694185 542740285 540849209 538969815 537034988 535070181 533144712
3216.5E33144712j872718j882911j941859j969815j940965j883984j821399j825511
$$ 533144712 531271994 529389083 527447224 525477409 523536444 521652460 519831061 518005550
3232.8E18005550j938403k003193j955449j931548j917482j844466j811563j884878
$$ 518005550 516067147 514063954 512108505 510176957 508259475 506415009 504603446 502718568
3249.1E02718568j937151j862198j739443j704573j764745j803875j774579j715392
$$ 502718568 500781417 498919219 497179776 495475203 493710458 491906583 490132004 488416612
3265.4D88416612j599520j463384j509756j653730j644433j544803j480461j476019
$$ 488416612 486817092 485353708 483843952 482190222 480545789 479000986 477520525 476044506
3281.7D76044506j462966j368821j283914j252174j277268j360655j401603j412362
$$ 476044506 474581540 473212719 471928805 470676631 469399363 468038708 466637105 465224743
3298D65224743j417607j348764j265019j332194j549154j716882j739770j676649j643002
$$ 465224743 463807136 462458372 461193353 459861159 458312005 456595123 454855353 453178704 451535702
3316.4D51535702j674503j717657j746416j756013j806050j868338j869172j841515
$$ 451535702 449861199 448143542 446397126 444641113 442835063 440966725 439097553 437256038
3332.7D37256038j759708j657456j695722j811356j822769j773089j701743j603931
$$ 437256038 435496330 433838874 432143152 430331796 428509027 426735938 425034195 423430264
3349D23430264j648456j808256j837969j737058j665145j690656j697928j569151j467973
$$ 423430264 421781808 419973552 418135583 416398525 414733380 413042724 411344796 409775645 408307672
3367.4D08307672j594007j830280j849950j626283j442045j403600j410603j351714
$$ 408307672 406713665 404883385 403033435 401407152 399965107 398561507 397150904 395799190
3383.7C95799190j225412j051188q93622r60887j188963j172305q53449o70910q77171
$$ 395799190 394573778 393522590 392628968 391668081 390479118 389306813 388453364 387782454 386905283
3402.1C86905283j098901r71705p51257o72638o44327n96314n23418m16339l15636
$$ 386905283 385806382 384834677 384083420 383410782 382766455 382170141 381646723 381230384 380914748
3420.4C80914748k60473j60545K7895J93298K28048K60651L75539L81529K77936L27439
$$ 380914748 380654275 380493730 380521625 380714923 380942971 381203622 381579161 381960690 382238626 382566065
3440.8C82566065N56975P60645Q58486Q79973R06795R92268J113087J241714J308590
$$ 382566065 383123040 383883685 384742171 385622144 386528939 387521207 388634294 389876008 391184598
3459.2C91184598J256615J296342J535892J669258J503587J287639J323908J505465
$$ 391184598 392441213 393737555 395273447 396942705 398446292 399733931 401057839 402563304
3475.5D02563304J672297J716525J602739J598567J766055J811892J758188J809567
$$ 402563304 404235601 405952126 407554865 409153432 410919487 412731379 414489567 416299134
3491.8D16299134J906276J986832K016246K033234K058535J971990J890481K007812
$$ 416299134 418205410 420192242 422208488 424241722 426300257 428272247 430162728 432170540
3508.1D32170540K181828K280831K277315K217502K229809K333880K507210K513706
$$ 432170540 434352368 436633199 438910514 441128016 443357825 445691705 448198915 450712621
3524.4D50712621K365232K376437K514899K635538K762407K793044K689511K731502
$$ 450712621 453077853 455454290 457969189 460604727 463367134 466160178 468849689 471581191
3540.8D71581191K930075L034055K894908K756775K897024L101349L114193L087461
$$ 471581191 474511266 477545321 480440229 483197004 486094028 489195377 492309570 495397031
3557.1D95397031L200442L271967L166854L200949L591418L777206L599644L545582
$$ 495397031 498597473 501869440 505036294 508237243 511828661 515605867 519205511 522751093
3573.4E22751093L637433L716946L808140L854335L801584L830492L982544M006088
$$ 522751093 526388526 530105472 533913612 537767947 541569531 545400023 549382567 553388655
3589.7E53388655L922641L987909M075050M068256M069745M034639L858208L707469
$$ 553388655 557311296 561299205 565374255 569442511 573512256 577546895 581405103 585112572
3606E85112572L824174L966153L966450L827036L548324L626406L907979L668546L135503
$$ 585112572 588936746 592902899 596869349 600696385 604244709 607871115 611779094 615447640 618583143
3624.4F18583143K953648L497362L833414L444790L232956L090382K972901K992272
$$ 618583143 621536791 625034153 628867567 632312357 635545313 638635695 641608596 644600868
3640.7F44600868K820075K428353K398133L070652L383398K759457K483308K741993
$$ 644600868 647420943 649849296 652247429 655318081 658701479 661460936 663944244 666686237
3657F66686237K717614K469182K258956K009213J892806K206981K301991K013325K245725
$$ 666686237 669403851 671873033 674131989 676141202 678034008 680240989 682542980 684556305 686802030
3675.4F86802030K358496K102911K030254J817286J566231J755774K016604J810431
$$ 686802030 689160526 691263437 693293691 695110977 696677208 698432982 700449586 702260017
3691.7G02260017J522720J302898J105845J082778J201034J096308P98285O79493Q79884
$$ 702260017 703782737 705085635 706191480 707274258 708475292 709571600 710369885 711049378 711929262
3710G11929262J166582J082063P81595O14465O22808O20962N19573M52340M27723M32432
$$ 711929262 713095844 714177907 714959502 715573967 716196775 716817737 717337310 717789650 718217373 718649805
3730.4G18649805M89175N86748O73592M67718O4730M1664K76387J38223J22428N17487
$$ 718649805 719138980 719725728 720399320 720867038 720931768 720973432 721249819 721388042 721510470 722027957
3750.8G22027957O04451K91765J55330L16262L88026K08974K5570J2279K79605M76122
$$ 722027957 722632408 722924173 723079503 723395765 723783791 723992765 724018335 724030614 724310219 724786341
3771.2G24786341K79427M0769J11699K98739K38299Q7560N4776J16527K25485J94192
$$ 724786341 725065768 725106537 725218236 725516975 725755274 725842834 725897610 726014137 726239622 726433814
3791.6G26433814O496j00195j14262O9141K88487R3698O4373L14296K46644n3287j32799
$$ 726433814 726440310 726340115 726225853 726294994 726583481 726677179 726741552 727055848 727302492 727249205 727116406
3814.1G27116406m590n1438J29640L96430J67072m5657p1526n6147n1856q3089Q166
$$ 727116406 727111816 727060378 727190018 727586448 727753520 727707863 727636337 727580190 727528334 727445245 727453411
3836.5G27453411J95622K30074J49906O8307p0990l21626m29094N5850N22375K09570
$$ 727453411 727649033 727879107 728029013 728097320 728026330 727704704 727275610 727331460 727853835 728063405
3856.9G28063405p4566j46150j22488r2268r5010Q7321J83284P2480J0490p4685m2498
$$ 728063405 727988839 727842689 727720201 727627933 727532923 727620244 727803528 727876008 727886498 727811813 727769315
3879.3G27769315l099m3631l338o7055n8889J18553O7294j62065k35856j71959o9380
$$ 727769315 727766216 727722585 727719247 727652192 727593303 727711856 727779150 727617085 727381229 727209270 727139890
3901.8G27139890R0480J85907J36971N2095o8784k11239j86145p75N7101l9816o5565
$$ 727139890 727230370 727416277 727553248 727605343 727536559 727325320 727139175 727138400 727195501 727155685 727090120
3924.2G27090120k9802o1870p2002n603K1100k3007p2777n2810k4617q0645r7632l2604
$$ 727090120 727060318 726998448 726926446 726920843 726941943 726918936 726846159 726793349 726768732 726688087 726590455 726557851
3948.7G26557851j1623k9683k8610l6478k7836l457l8147r5129r7930n5254j0073j8537
$$ 726557851 726546228 726516545 726487935 726451457 726423621 726420164 726382017 726286888 726188958 726133704 726123631 726105094
3973.1G26105094o1750k5392M1425J9193l5226o6877q6307m8042k026l9161p0929l3677
$$ 726105094 726043344 726017952 726059377 726078570 726043344 725976467 725890160 725842118 725840092 725800931 725730002 725696325
3997.6G25696325
$$ 725696325
##END=$$ End of the data block
